starting build "22c98def-f877-4033-bdd8-f5cff6293f07" FETCHSOURCE BUILD Starting Step #0 Step #0: Already have image (with digest): gcr.io/cloud-builders/git Step #0: Cloning into 'oss-fuzz'... Finished Step #0 Starting Step #1 - "build-39e81d01-377a-42bf-8a41-e80361c3aee4" Step #1 - "build-39e81d01-377a-42bf-8a41-e80361c3aee4": Already have image (with digest): gcr.io/cloud-builders/docker Step #1 - "build-39e81d01-377a-42bf-8a41-e80361c3aee4": Sending build context to Docker daemon 10.24kB Step #1 - "build-39e81d01-377a-42bf-8a41-e80361c3aee4": Step 1/9 : FROM gcr.io/oss-fuzz-base/base-builder-jvm:ubuntu-24-04 Step #1 - "build-39e81d01-377a-42bf-8a41-e80361c3aee4": ubuntu-24-04: Pulling from oss-fuzz-base/base-builder-jvm Step #1 - "build-39e81d01-377a-42bf-8a41-e80361c3aee4": 76249c7cd503: Pulling fs layer Step #1 - "build-39e81d01-377a-42bf-8a41-e80361c3aee4": 46264671b758: Pulling fs layer Step #1 - "build-39e81d01-377a-42bf-8a41-e80361c3aee4": 6863779eac27: Pulling fs layer Step #1 - "build-39e81d01-377a-42bf-8a41-e80361c3aee4": ceff62c12ef0: Pulling fs layer Step #1 - "build-39e81d01-377a-42bf-8a41-e80361c3aee4": daf5b03745dc: Pulling fs layer Step #1 - "build-39e81d01-377a-42bf-8a41-e80361c3aee4": 975c353aa81c: Pulling fs layer Step #1 - "build-39e81d01-377a-42bf-8a41-e80361c3aee4": 3bf26f04197d: Pulling fs layer Step #1 - "build-39e81d01-377a-42bf-8a41-e80361c3aee4": 00e76bf47480: Pulling fs layer Step #1 - "build-39e81d01-377a-42bf-8a41-e80361c3aee4": c6f1495583be: Pulling fs layer Step #1 - "build-39e81d01-377a-42bf-8a41-e80361c3aee4": d03c683e1f4d: Pulling fs layer Step #1 - "build-39e81d01-377a-42bf-8a41-e80361c3aee4": 2d7d565897bc: Pulling fs layer Step #1 - "build-39e81d01-377a-42bf-8a41-e80361c3aee4": 861122f7f686: Pulling fs layer Step #1 - "build-39e81d01-377a-42bf-8a41-e80361c3aee4": dfe8dd80041a: Pulling fs layer Step #1 - "build-39e81d01-377a-42bf-8a41-e80361c3aee4": 7157a56aab79: Pulling fs layer Step #1 - "build-39e81d01-377a-42bf-8a41-e80361c3aee4": 82e130fb643d: Pulling fs layer Step #1 - "build-39e81d01-377a-42bf-8a41-e80361c3aee4": 49c7cb4b7988: Pulling fs layer Step #1 - "build-39e81d01-377a-42bf-8a41-e80361c3aee4": d7933fe07539: Pulling fs layer Step #1 - "build-39e81d01-377a-42bf-8a41-e80361c3aee4": cf6c78f47e33: Pulling fs layer Step #1 - "build-39e81d01-377a-42bf-8a41-e80361c3aee4": aaeb98302975: Pulling fs layer Step #1 - "build-39e81d01-377a-42bf-8a41-e80361c3aee4": 195998b4c8fc: Pulling fs layer Step #1 - "build-39e81d01-377a-42bf-8a41-e80361c3aee4": d1ce99a33ca3: Pulling fs layer Step #1 - "build-39e81d01-377a-42bf-8a41-e80361c3aee4": 7853f9a5d7a6: Pulling fs layer Step #1 - "build-39e81d01-377a-42bf-8a41-e80361c3aee4": 205b117ef8c6: Pulling fs layer Step #1 - "build-39e81d01-377a-42bf-8a41-e80361c3aee4": 550c61568772: Pulling fs layer Step #1 - "build-39e81d01-377a-42bf-8a41-e80361c3aee4": a3e7639e6f49: Pulling fs layer Step #1 - "build-39e81d01-377a-42bf-8a41-e80361c3aee4": e2097a17ab55: Pulling fs layer Step #1 - "build-39e81d01-377a-42bf-8a41-e80361c3aee4": 92b488f57171: Pulling fs layer Step #1 - "build-39e81d01-377a-42bf-8a41-e80361c3aee4": 66cb42b989bc: Pulling fs layer Step #1 - "build-39e81d01-377a-42bf-8a41-e80361c3aee4": 079b7beb93ec: Pulling fs layer Step #1 - "build-39e81d01-377a-42bf-8a41-e80361c3aee4": 04cd5e6575b0: Pulling fs layer Step #1 - "build-39e81d01-377a-42bf-8a41-e80361c3aee4": 2c882934a1b1: Pulling fs layer Step #1 - "build-39e81d01-377a-42bf-8a41-e80361c3aee4": 91e62c8c0900: Pulling fs layer Step #1 - "build-39e81d01-377a-42bf-8a41-e80361c3aee4": cbda0e82a7aa: Pulling fs layer Step #1 - "build-39e81d01-377a-42bf-8a41-e80361c3aee4": 57a7dca3f91b: Pulling fs layer Step #1 - "build-39e81d01-377a-42bf-8a41-e80361c3aee4": ed2d39f2be54: Pulling fs layer Step #1 - "build-39e81d01-377a-42bf-8a41-e80361c3aee4": 96a6a846e125: Pulling fs layer Step #1 - "build-39e81d01-377a-42bf-8a41-e80361c3aee4": 64e047a5244b: Pulling fs layer Step #1 - "build-39e81d01-377a-42bf-8a41-e80361c3aee4": 7e63a1b5ec03: Pulling fs layer Step #1 - "build-39e81d01-377a-42bf-8a41-e80361c3aee4": 810d3d54b4ab: Pulling fs layer Step #1 - "build-39e81d01-377a-42bf-8a41-e80361c3aee4": 861122f7f686: Waiting Step #1 - "build-39e81d01-377a-42bf-8a41-e80361c3aee4": 49c7cb4b7988: Waiting Step #1 - "build-39e81d01-377a-42bf-8a41-e80361c3aee4": dead2d72fdae: Pulling fs layer Step #1 - "build-39e81d01-377a-42bf-8a41-e80361c3aee4": 0249af30b17b: Pulling fs layer Step #1 - "build-39e81d01-377a-42bf-8a41-e80361c3aee4": dfe8dd80041a: Waiting Step #1 - "build-39e81d01-377a-42bf-8a41-e80361c3aee4": 1f8296f9106b: Pulling fs layer Step #1 - "build-39e81d01-377a-42bf-8a41-e80361c3aee4": fdef062d4e3a: Pulling fs layer Step #1 - "build-39e81d01-377a-42bf-8a41-e80361c3aee4": d7933fe07539: Waiting Step #1 - "build-39e81d01-377a-42bf-8a41-e80361c3aee4": 4b43d9ab701c: Pulling fs layer Step #1 - "build-39e81d01-377a-42bf-8a41-e80361c3aee4": 7157a56aab79: Waiting Step #1 - "build-39e81d01-377a-42bf-8a41-e80361c3aee4": d63dbfbf5600: Pulling fs layer Step #1 - "build-39e81d01-377a-42bf-8a41-e80361c3aee4": 1aa19ec9b2f5: Pulling fs layer Step #1 - "build-39e81d01-377a-42bf-8a41-e80361c3aee4": cf6c78f47e33: Waiting Step #1 - "build-39e81d01-377a-42bf-8a41-e80361c3aee4": 82e130fb643d: Waiting Step #1 - "build-39e81d01-377a-42bf-8a41-e80361c3aee4": 195998b4c8fc: Waiting Step #1 - "build-39e81d01-377a-42bf-8a41-e80361c3aee4": a3e7639e6f49: Waiting Step #1 - "build-39e81d01-377a-42bf-8a41-e80361c3aee4": d1ce99a33ca3: Waiting Step #1 - "build-39e81d01-377a-42bf-8a41-e80361c3aee4": 2c882934a1b1: Waiting Step #1 - "build-39e81d01-377a-42bf-8a41-e80361c3aee4": 7853f9a5d7a6: Waiting Step #1 - "build-39e81d01-377a-42bf-8a41-e80361c3aee4": e2097a17ab55: Waiting Step #1 - "build-39e81d01-377a-42bf-8a41-e80361c3aee4": 205b117ef8c6: Waiting Step #1 - "build-39e81d01-377a-42bf-8a41-e80361c3aee4": 91e62c8c0900: Waiting Step #1 - "build-39e81d01-377a-42bf-8a41-e80361c3aee4": aaeb98302975: Waiting Step #1 - "build-39e81d01-377a-42bf-8a41-e80361c3aee4": 92b488f57171: Waiting Step #1 - "build-39e81d01-377a-42bf-8a41-e80361c3aee4": 550c61568772: Waiting Step #1 - "build-39e81d01-377a-42bf-8a41-e80361c3aee4": cbda0e82a7aa: Waiting Step #1 - "build-39e81d01-377a-42bf-8a41-e80361c3aee4": 66cb42b989bc: Waiting Step #1 - "build-39e81d01-377a-42bf-8a41-e80361c3aee4": 57a7dca3f91b: Waiting Step #1 - "build-39e81d01-377a-42bf-8a41-e80361c3aee4": 3bf26f04197d: Waiting Step #1 - "build-39e81d01-377a-42bf-8a41-e80361c3aee4": 079b7beb93ec: Waiting Step #1 - "build-39e81d01-377a-42bf-8a41-e80361c3aee4": 04cd5e6575b0: Waiting Step #1 - "build-39e81d01-377a-42bf-8a41-e80361c3aee4": ed2d39f2be54: Waiting Step #1 - "build-39e81d01-377a-42bf-8a41-e80361c3aee4": 00e76bf47480: Waiting Step #1 - "build-39e81d01-377a-42bf-8a41-e80361c3aee4": c6f1495583be: Waiting Step #1 - "build-39e81d01-377a-42bf-8a41-e80361c3aee4": 1f8296f9106b: Waiting Step #1 - "build-39e81d01-377a-42bf-8a41-e80361c3aee4": d03c683e1f4d: Waiting Step #1 - "build-39e81d01-377a-42bf-8a41-e80361c3aee4": fdef062d4e3a: Waiting Step #1 - "build-39e81d01-377a-42bf-8a41-e80361c3aee4": 96a6a846e125: Waiting Step #1 - "build-39e81d01-377a-42bf-8a41-e80361c3aee4": 2d7d565897bc: Waiting Step #1 - "build-39e81d01-377a-42bf-8a41-e80361c3aee4": 4b43d9ab701c: Waiting Step #1 - "build-39e81d01-377a-42bf-8a41-e80361c3aee4": 64e047a5244b: Waiting Step #1 - "build-39e81d01-377a-42bf-8a41-e80361c3aee4": d63dbfbf5600: Waiting Step #1 - "build-39e81d01-377a-42bf-8a41-e80361c3aee4": 0249af30b17b: Waiting Step #1 - "build-39e81d01-377a-42bf-8a41-e80361c3aee4": dead2d72fdae: Waiting Step #1 - "build-39e81d01-377a-42bf-8a41-e80361c3aee4": 1aa19ec9b2f5: Waiting Step #1 - "build-39e81d01-377a-42bf-8a41-e80361c3aee4": 7e63a1b5ec03: Waiting Step #1 - "build-39e81d01-377a-42bf-8a41-e80361c3aee4": 810d3d54b4ab: Waiting Step #1 - "build-39e81d01-377a-42bf-8a41-e80361c3aee4": 6863779eac27: Download complete Step #1 - "build-39e81d01-377a-42bf-8a41-e80361c3aee4": 975c353aa81c: Verifying Checksum Step #1 - "build-39e81d01-377a-42bf-8a41-e80361c3aee4": 975c353aa81c: Download complete Step #1 - "build-39e81d01-377a-42bf-8a41-e80361c3aee4": daf5b03745dc: Verifying Checksum Step #1 - "build-39e81d01-377a-42bf-8a41-e80361c3aee4": daf5b03745dc: Download complete Step #1 - "build-39e81d01-377a-42bf-8a41-e80361c3aee4": 00e76bf47480: Verifying Checksum Step #1 - "build-39e81d01-377a-42bf-8a41-e80361c3aee4": 00e76bf47480: Download complete Step #1 - "build-39e81d01-377a-42bf-8a41-e80361c3aee4": c6f1495583be: Download complete Step #1 - "build-39e81d01-377a-42bf-8a41-e80361c3aee4": 76249c7cd503: Verifying Checksum Step #1 - "build-39e81d01-377a-42bf-8a41-e80361c3aee4": 76249c7cd503: Download complete Step #1 - "build-39e81d01-377a-42bf-8a41-e80361c3aee4": ceff62c12ef0: Verifying Checksum Step #1 - "build-39e81d01-377a-42bf-8a41-e80361c3aee4": ceff62c12ef0: Download complete Step #1 - "build-39e81d01-377a-42bf-8a41-e80361c3aee4": dfe8dd80041a: Verifying Checksum Step #1 - "build-39e81d01-377a-42bf-8a41-e80361c3aee4": dfe8dd80041a: Download complete Step #1 - "build-39e81d01-377a-42bf-8a41-e80361c3aee4": 861122f7f686: Verifying Checksum Step #1 - "build-39e81d01-377a-42bf-8a41-e80361c3aee4": 861122f7f686: Download complete Step #1 - "build-39e81d01-377a-42bf-8a41-e80361c3aee4": 82e130fb643d: Verifying Checksum Step #1 - "build-39e81d01-377a-42bf-8a41-e80361c3aee4": 82e130fb643d: Download complete Step #1 - "build-39e81d01-377a-42bf-8a41-e80361c3aee4": 7157a56aab79: Verifying Checksum Step #1 - "build-39e81d01-377a-42bf-8a41-e80361c3aee4": 7157a56aab79: Download complete Step #1 - "build-39e81d01-377a-42bf-8a41-e80361c3aee4": d7933fe07539: Download complete Step #1 - "build-39e81d01-377a-42bf-8a41-e80361c3aee4": 2d7d565897bc: Verifying Checksum Step #1 - "build-39e81d01-377a-42bf-8a41-e80361c3aee4": 2d7d565897bc: Download complete Step #1 - "build-39e81d01-377a-42bf-8a41-e80361c3aee4": 49c7cb4b7988: Verifying Checksum Step #1 - "build-39e81d01-377a-42bf-8a41-e80361c3aee4": 49c7cb4b7988: Download complete Step #1 - "build-39e81d01-377a-42bf-8a41-e80361c3aee4": 46264671b758: Verifying Checksum Step #1 - "build-39e81d01-377a-42bf-8a41-e80361c3aee4": 46264671b758: Download complete Step #1 - "build-39e81d01-377a-42bf-8a41-e80361c3aee4": aaeb98302975: Verifying Checksum Step #1 - "build-39e81d01-377a-42bf-8a41-e80361c3aee4": aaeb98302975: Download complete Step #1 - "build-39e81d01-377a-42bf-8a41-e80361c3aee4": cf6c78f47e33: Verifying Checksum Step #1 - "build-39e81d01-377a-42bf-8a41-e80361c3aee4": cf6c78f47e33: Download complete Step #1 - "build-39e81d01-377a-42bf-8a41-e80361c3aee4": d1ce99a33ca3: Verifying Checksum Step #1 - "build-39e81d01-377a-42bf-8a41-e80361c3aee4": d1ce99a33ca3: Download complete Step #1 - "build-39e81d01-377a-42bf-8a41-e80361c3aee4": 195998b4c8fc: Verifying Checksum Step #1 - "build-39e81d01-377a-42bf-8a41-e80361c3aee4": 195998b4c8fc: Download complete Step #1 - "build-39e81d01-377a-42bf-8a41-e80361c3aee4": 7853f9a5d7a6: Verifying Checksum Step #1 - "build-39e81d01-377a-42bf-8a41-e80361c3aee4": 7853f9a5d7a6: Download complete Step #1 - "build-39e81d01-377a-42bf-8a41-e80361c3aee4": a3e7639e6f49: Verifying Checksum Step #1 - "build-39e81d01-377a-42bf-8a41-e80361c3aee4": a3e7639e6f49: Download complete Step #1 - "build-39e81d01-377a-42bf-8a41-e80361c3aee4": 76249c7cd503: Pull complete Step #1 - "build-39e81d01-377a-42bf-8a41-e80361c3aee4": 205b117ef8c6: Download complete Step #1 - "build-39e81d01-377a-42bf-8a41-e80361c3aee4": 550c61568772: Download complete Step #1 - "build-39e81d01-377a-42bf-8a41-e80361c3aee4": e2097a17ab55: Verifying Checksum Step #1 - "build-39e81d01-377a-42bf-8a41-e80361c3aee4": e2097a17ab55: Download complete Step #1 - "build-39e81d01-377a-42bf-8a41-e80361c3aee4": 92b488f57171: Download complete Step #1 - "build-39e81d01-377a-42bf-8a41-e80361c3aee4": 66cb42b989bc: Verifying Checksum Step #1 - "build-39e81d01-377a-42bf-8a41-e80361c3aee4": 66cb42b989bc: Download complete Step #1 - "build-39e81d01-377a-42bf-8a41-e80361c3aee4": 079b7beb93ec: Verifying Checksum Step #1 - "build-39e81d01-377a-42bf-8a41-e80361c3aee4": 079b7beb93ec: Download complete Step #1 - "build-39e81d01-377a-42bf-8a41-e80361c3aee4": 04cd5e6575b0: Verifying Checksum Step #1 - "build-39e81d01-377a-42bf-8a41-e80361c3aee4": 04cd5e6575b0: Download complete Step #1 - "build-39e81d01-377a-42bf-8a41-e80361c3aee4": 2c882934a1b1: Verifying Checksum Step #1 - "build-39e81d01-377a-42bf-8a41-e80361c3aee4": 2c882934a1b1: Download complete Step #1 - "build-39e81d01-377a-42bf-8a41-e80361c3aee4": 91e62c8c0900: Verifying Checksum Step #1 - "build-39e81d01-377a-42bf-8a41-e80361c3aee4": 91e62c8c0900: Download complete Step #1 - "build-39e81d01-377a-42bf-8a41-e80361c3aee4": d03c683e1f4d: Verifying Checksum Step #1 - "build-39e81d01-377a-42bf-8a41-e80361c3aee4": d03c683e1f4d: Download complete Step #1 - "build-39e81d01-377a-42bf-8a41-e80361c3aee4": 57a7dca3f91b: Download complete Step #1 - "build-39e81d01-377a-42bf-8a41-e80361c3aee4": cbda0e82a7aa: Verifying Checksum Step #1 - "build-39e81d01-377a-42bf-8a41-e80361c3aee4": cbda0e82a7aa: Download complete Step #1 - "build-39e81d01-377a-42bf-8a41-e80361c3aee4": ed2d39f2be54: Verifying Checksum Step #1 - "build-39e81d01-377a-42bf-8a41-e80361c3aee4": ed2d39f2be54: Download complete Step #1 - "build-39e81d01-377a-42bf-8a41-e80361c3aee4": 96a6a846e125: Download complete Step #1 - "build-39e81d01-377a-42bf-8a41-e80361c3aee4": 7e63a1b5ec03: Download complete Step #1 - "build-39e81d01-377a-42bf-8a41-e80361c3aee4": 810d3d54b4ab: Verifying Checksum Step #1 - "build-39e81d01-377a-42bf-8a41-e80361c3aee4": 810d3d54b4ab: Download complete Step #1 - "build-39e81d01-377a-42bf-8a41-e80361c3aee4": 0249af30b17b: Verifying Checksum Step #1 - "build-39e81d01-377a-42bf-8a41-e80361c3aee4": 0249af30b17b: Download complete Step #1 - "build-39e81d01-377a-42bf-8a41-e80361c3aee4": fdef062d4e3a: Download complete Step #1 - "build-39e81d01-377a-42bf-8a41-e80361c3aee4": 4b43d9ab701c: Download complete Step #1 - "build-39e81d01-377a-42bf-8a41-e80361c3aee4": d63dbfbf5600: Verifying Checksum Step #1 - "build-39e81d01-377a-42bf-8a41-e80361c3aee4": d63dbfbf5600: Download complete Step #1 - "build-39e81d01-377a-42bf-8a41-e80361c3aee4": 1f8296f9106b: Verifying Checksum Step #1 - "build-39e81d01-377a-42bf-8a41-e80361c3aee4": 1f8296f9106b: Download complete Step #1 - "build-39e81d01-377a-42bf-8a41-e80361c3aee4": 1aa19ec9b2f5: Verifying Checksum Step #1 - "build-39e81d01-377a-42bf-8a41-e80361c3aee4": 1aa19ec9b2f5: Download complete Step #1 - "build-39e81d01-377a-42bf-8a41-e80361c3aee4": 3bf26f04197d: Verifying Checksum Step #1 - "build-39e81d01-377a-42bf-8a41-e80361c3aee4": 3bf26f04197d: Download complete Step #1 - "build-39e81d01-377a-42bf-8a41-e80361c3aee4": dead2d72fdae: Verifying Checksum Step #1 - "build-39e81d01-377a-42bf-8a41-e80361c3aee4": dead2d72fdae: Download complete Step #1 - "build-39e81d01-377a-42bf-8a41-e80361c3aee4": 46264671b758: Pull complete Step #1 - "build-39e81d01-377a-42bf-8a41-e80361c3aee4": 6863779eac27: Pull complete Step #1 - "build-39e81d01-377a-42bf-8a41-e80361c3aee4": ceff62c12ef0: Pull complete Step #1 - "build-39e81d01-377a-42bf-8a41-e80361c3aee4": daf5b03745dc: Pull complete Step #1 - "build-39e81d01-377a-42bf-8a41-e80361c3aee4": 975c353aa81c: Pull complete Step #1 - "build-39e81d01-377a-42bf-8a41-e80361c3aee4": 3bf26f04197d: Pull complete Step #1 - "build-39e81d01-377a-42bf-8a41-e80361c3aee4": 00e76bf47480: Pull complete Step #1 - "build-39e81d01-377a-42bf-8a41-e80361c3aee4": c6f1495583be: Pull complete Step #1 - "build-39e81d01-377a-42bf-8a41-e80361c3aee4": d03c683e1f4d: Pull complete Step #1 - "build-39e81d01-377a-42bf-8a41-e80361c3aee4": 2d7d565897bc: Pull complete Step #1 - "build-39e81d01-377a-42bf-8a41-e80361c3aee4": 861122f7f686: Pull complete Step #1 - "build-39e81d01-377a-42bf-8a41-e80361c3aee4": dfe8dd80041a: Pull complete Step #1 - "build-39e81d01-377a-42bf-8a41-e80361c3aee4": 7157a56aab79: Pull complete Step #1 - "build-39e81d01-377a-42bf-8a41-e80361c3aee4": 82e130fb643d: Pull complete Step #1 - "build-39e81d01-377a-42bf-8a41-e80361c3aee4": 49c7cb4b7988: Pull complete Step #1 - "build-39e81d01-377a-42bf-8a41-e80361c3aee4": d7933fe07539: Pull complete Step #1 - "build-39e81d01-377a-42bf-8a41-e80361c3aee4": cf6c78f47e33: Pull complete Step #1 - "build-39e81d01-377a-42bf-8a41-e80361c3aee4": aaeb98302975: Pull complete Step #1 - "build-39e81d01-377a-42bf-8a41-e80361c3aee4": 195998b4c8fc: Pull complete Step #1 - "build-39e81d01-377a-42bf-8a41-e80361c3aee4": d1ce99a33ca3: Pull complete Step #1 - "build-39e81d01-377a-42bf-8a41-e80361c3aee4": 7853f9a5d7a6: Pull complete Step #1 - "build-39e81d01-377a-42bf-8a41-e80361c3aee4": 205b117ef8c6: Pull complete Step #1 - "build-39e81d01-377a-42bf-8a41-e80361c3aee4": 550c61568772: Pull complete Step #1 - "build-39e81d01-377a-42bf-8a41-e80361c3aee4": a3e7639e6f49: Pull complete Step #1 - "build-39e81d01-377a-42bf-8a41-e80361c3aee4": e2097a17ab55: Pull complete Step #1 - "build-39e81d01-377a-42bf-8a41-e80361c3aee4": 92b488f57171: Pull complete Step #1 - "build-39e81d01-377a-42bf-8a41-e80361c3aee4": 66cb42b989bc: Pull complete Step #1 - "build-39e81d01-377a-42bf-8a41-e80361c3aee4": 079b7beb93ec: Pull complete Step #1 - "build-39e81d01-377a-42bf-8a41-e80361c3aee4": 04cd5e6575b0: Pull complete Step #1 - "build-39e81d01-377a-42bf-8a41-e80361c3aee4": 2c882934a1b1: Pull complete Step #1 - "build-39e81d01-377a-42bf-8a41-e80361c3aee4": 91e62c8c0900: Pull complete Step #1 - "build-39e81d01-377a-42bf-8a41-e80361c3aee4": cbda0e82a7aa: Pull complete Step #1 - "build-39e81d01-377a-42bf-8a41-e80361c3aee4": 57a7dca3f91b: Pull complete Step #1 - "build-39e81d01-377a-42bf-8a41-e80361c3aee4": ed2d39f2be54: Pull complete Step #1 - "build-39e81d01-377a-42bf-8a41-e80361c3aee4": 96a6a846e125: Pull complete Step #1 - "build-39e81d01-377a-42bf-8a41-e80361c3aee4": 64e047a5244b: Pull complete Step #1 - "build-39e81d01-377a-42bf-8a41-e80361c3aee4": 7e63a1b5ec03: Pull complete Step #1 - "build-39e81d01-377a-42bf-8a41-e80361c3aee4": 810d3d54b4ab: Pull complete Step #1 - "build-39e81d01-377a-42bf-8a41-e80361c3aee4": dead2d72fdae: Pull complete Step #1 - "build-39e81d01-377a-42bf-8a41-e80361c3aee4": 0249af30b17b: Pull complete Step #1 - "build-39e81d01-377a-42bf-8a41-e80361c3aee4": 1f8296f9106b: Pull complete Step #1 - "build-39e81d01-377a-42bf-8a41-e80361c3aee4": fdef062d4e3a: Pull complete Step #1 - "build-39e81d01-377a-42bf-8a41-e80361c3aee4": 4b43d9ab701c: Pull complete Step #1 - "build-39e81d01-377a-42bf-8a41-e80361c3aee4": d63dbfbf5600: Pull complete Step #1 - "build-39e81d01-377a-42bf-8a41-e80361c3aee4": 1aa19ec9b2f5: Pull complete Step #1 - "build-39e81d01-377a-42bf-8a41-e80361c3aee4": Digest: sha256:abd2fe4ae09de7082b446a3bd84b8d6c068dba175744c6cbf40491e55bfe32b4 Step #1 - "build-39e81d01-377a-42bf-8a41-e80361c3aee4": Status: Downloaded newer image for gcr.io/oss-fuzz-base/base-builder-jvm:ubuntu-24-04 Step #1 - "build-39e81d01-377a-42bf-8a41-e80361c3aee4": ---> 3f27356eaba3 Step #1 - "build-39e81d01-377a-42bf-8a41-e80361c3aee4": Step 2/9 : RUN curl -L https://services.gradle.org/distributions/gradle-7.4.2-bin.zip -o gradle.zip && unzip gradle.zip -d $SRC/gradle && rm -rf gradle.zip Step #1 - "build-39e81d01-377a-42bf-8a41-e80361c3aee4": ---> Running in 7f29349a3266 Step #1 - "build-39e81d01-377a-42bf-8a41-e80361c3aee4":  % Total % Received % Xferd Average Speed Time Time Time Current Step #1 - "build-39e81d01-377a-42bf-8a41-e80361c3aee4": Dload Upload Total Spent Left Speed Step #1 - "build-39e81d01-377a-42bf-8a41-e80361c3aee4": 0 0 0 0 0 0 0 0 --:--:-- --:--:-- --:--:-- 0 100 169 100 169 0 0 2197 0 --:--:-- --:--:-- --:--:-- 2223 Step #1 - "build-39e81d01-377a-42bf-8a41-e80361c3aee4":  0 0 0 0 0 0 0 0 --:--:-- --:--:-- --:--:-- 0 Step #1 - "build-39e81d01-377a-42bf-8a41-e80361c3aee4":  89 110M 89 98.6M 0 0 150M 0 --:--:-- --:--:-- --:--:-- 150M 100 110M 100 110M 0 0 156M 0 --:--:-- --:--:-- --:--:-- 252M Step #1 - "build-39e81d01-377a-42bf-8a41-e80361c3aee4": Archive: gradle.zip Step #1 - "build-39e81d01-377a-42bf-8a41-e80361c3aee4": creating: /src/gradle/gradle-7.4.2/ Step #1 - "build-39e81d01-377a-42bf-8a41-e80361c3aee4": inflating: /src/gradle/gradle-7.4.2/LICENSE Step #1 - "build-39e81d01-377a-42bf-8a41-e80361c3aee4": inflating: /src/gradle/gradle-7.4.2/NOTICE Step #1 - "build-39e81d01-377a-42bf-8a41-e80361c3aee4": inflating: /src/gradle/gradle-7.4.2/README Step #1 - "build-39e81d01-377a-42bf-8a41-e80361c3aee4": creating: /src/gradle/gradle-7.4.2/init.d/ Step #1 - "build-39e81d01-377a-42bf-8a41-e80361c3aee4": inflating: /src/gradle/gradle-7.4.2/init.d/readme.txt Step #1 - "build-39e81d01-377a-42bf-8a41-e80361c3aee4": creating: /src/gradle/gradle-7.4.2/bin/ Step #1 - "build-39e81d01-377a-42bf-8a41-e80361c3aee4": inflating: /src/gradle/gradle-7.4.2/bin/gradle Step #1 - "build-39e81d01-377a-42bf-8a41-e80361c3aee4": inflating: /src/gradle/gradle-7.4.2/bin/gradle.bat Step #1 - "build-39e81d01-377a-42bf-8a41-e80361c3aee4": creating: /src/gradle/gradle-7.4.2/lib/ Step #1 - "build-39e81d01-377a-42bf-8a41-e80361c3aee4": inflating: /src/gradle/gradle-7.4.2/lib/gradle-runtime-api-info-7.4.2.jar Step #1 - "build-39e81d01-377a-42bf-8a41-e80361c3aee4": inflating: /src/gradle/gradle-7.4.2/lib/gradle-installation-beacon-7.4.2.jar Step #1 - "build-39e81d01-377a-42bf-8a41-e80361c3aee4": inflating: /src/gradle/gradle-7.4.2/lib/gradle-api-metadata-7.4.2.jar Step #1 - "build-39e81d01-377a-42bf-8a41-e80361c3aee4": inflating: /src/gradle/gradle-7.4.2/lib/gradle-launcher-7.4.2.jar Step #1 - "build-39e81d01-377a-42bf-8a41-e80361c3aee4": inflating: /src/gradle/gradle-7.4.2/lib/gradle-kotlin-dsl-7.4.2.jar Step #1 - "build-39e81d01-377a-42bf-8a41-e80361c3aee4": inflating: /src/gradle/gradle-7.4.2/lib/gradle-build-events-7.4.2.jar Step #1 - "build-39e81d01-377a-42bf-8a41-e80361c3aee4": inflating: /src/gradle/gradle-7.4.2/lib/gradle-tooling-api-7.4.2.jar Step #1 - "build-39e81d01-377a-42bf-8a41-e80361c3aee4": inflating: /src/gradle/gradle-7.4.2/lib/gradle-core-7.4.2.jar Step #1 - "build-39e81d01-377a-42bf-8a41-e80361c3aee4": inflating: /src/gradle/gradle-7.4.2/lib/gradle-file-collections-7.4.2.jar Step #1 - "build-39e81d01-377a-42bf-8a41-e80361c3aee4": inflating: /src/gradle/gradle-7.4.2/lib/gradle-jvm-services-7.4.2.jar Step #1 - "build-39e81d01-377a-42bf-8a41-e80361c3aee4": inflating: /src/gradle/gradle-7.4.2/lib/gradle-execution-7.4.2.jar Step #1 - "build-39e81d01-377a-42bf-8a41-e80361c3aee4": inflating: /src/gradle/gradle-7.4.2/lib/gradle-model-groovy-7.4.2.jar Step #1 - "build-39e81d01-377a-42bf-8a41-e80361c3aee4": inflating: /src/gradle/gradle-7.4.2/lib/gradle-model-core-7.4.2.jar Step #1 - "build-39e81d01-377a-42bf-8a41-e80361c3aee4": inflating: /src/gradle/gradle-7.4.2/lib/gradle-build-cache-7.4.2.jar Step #1 - "build-39e81d01-377a-42bf-8a41-e80361c3aee4": inflating: /src/gradle/gradle-7.4.2/lib/gradle-core-api-7.4.2.jar Step #1 - "build-39e81d01-377a-42bf-8a41-e80361c3aee4": inflating: /src/gradle/gradle-7.4.2/lib/gradle-persistent-cache-7.4.2.jar Step #1 - "build-39e81d01-377a-42bf-8a41-e80361c3aee4": inflating: /src/gradle/gradle-7.4.2/lib/gradle-worker-processes-7.4.2.jar Step #1 - "build-39e81d01-377a-42bf-8a41-e80361c3aee4": inflating: /src/gradle/gradle-7.4.2/lib/gradle-logging-7.4.2.jar Step #1 - "build-39e81d01-377a-42bf-8a41-e80361c3aee4": inflating: /src/gradle/gradle-7.4.2/lib/groovy-ant-3.0.9.jar Step #1 - "build-39e81d01-377a-42bf-8a41-e80361c3aee4": inflating: /src/gradle/gradle-7.4.2/lib/ant-junit-1.10.11.jar Step #1 - "build-39e81d01-377a-42bf-8a41-e80361c3aee4": inflating: /src/gradle/gradle-7.4.2/lib/ant-1.10.11.jar Step #1 - "build-39e81d01-377a-42bf-8a41-e80361c3aee4": inflating: /src/gradle/gradle-7.4.2/lib/ant-launcher-1.10.11.jar Step #1 - "build-39e81d01-377a-42bf-8a41-e80361c3aee4": inflating: /src/gradle/gradle-7.4.2/lib/gradle-process-services-7.4.2.jar Step #1 - "build-39e81d01-377a-42bf-8a41-e80361c3aee4": inflating: /src/gradle/gradle-7.4.2/lib/gradle-resources-7.4.2.jar Step #1 - "build-39e81d01-377a-42bf-8a41-e80361c3aee4": inflating: /src/gradle/gradle-7.4.2/lib/gradle-messaging-7.4.2.jar Step #1 - "build-39e81d01-377a-42bf-8a41-e80361c3aee4": inflating: /src/gradle/gradle-7.4.2/lib/gradle-native-7.4.2.jar Step #1 - "build-39e81d01-377a-42bf-8a41-e80361c3aee4": inflating: /src/gradle/gradle-7.4.2/lib/gradle-base-services-groovy-7.4.2.jar Step #1 - "build-39e81d01-377a-42bf-8a41-e80361c3aee4": inflating: /src/gradle/gradle-7.4.2/lib/gradle-file-temp-7.4.2.jar Step #1 - "build-39e81d01-377a-42bf-8a41-e80361c3aee4": inflating: /src/gradle/gradle-7.4.2/lib/gradle-base-services-7.4.2.jar Step #1 - "build-39e81d01-377a-42bf-8a41-e80361c3aee4": inflating: /src/gradle/gradle-7.4.2/lib/gradle-normalization-java-7.4.2.jar Step #1 - "build-39e81d01-377a-42bf-8a41-e80361c3aee4": inflating: /src/gradle/gradle-7.4.2/lib/asm-commons-9.2.jar Step #1 - "build-39e81d01-377a-42bf-8a41-e80361c3aee4": inflating: /src/gradle/gradle-7.4.2/lib/asm-analysis-9.2.jar Step #1 - "build-39e81d01-377a-42bf-8a41-e80361c3aee4": inflating: /src/gradle/gradle-7.4.2/lib/asm-tree-9.2.jar Step #1 - "build-39e81d01-377a-42bf-8a41-e80361c3aee4": inflating: /src/gradle/gradle-7.4.2/lib/asm-9.2.jar Step #1 - "build-39e81d01-377a-42bf-8a41-e80361c3aee4": inflating: /src/gradle/gradle-7.4.2/lib/gradle-build-cache-packaging-7.4.2.jar Step #1 - "build-39e81d01-377a-42bf-8a41-e80361c3aee4": inflating: /src/gradle/gradle-7.4.2/lib/commons-compress-1.21.jar Step #1 - "build-39e81d01-377a-42bf-8a41-e80361c3aee4": inflating: /src/gradle/gradle-7.4.2/lib/commons-io-2.6.jar Step #1 - "build-39e81d01-377a-42bf-8a41-e80361c3aee4": inflating: /src/gradle/gradle-7.4.2/lib/gradle-build-option-7.4.2.jar Step #1 - "build-39e81d01-377a-42bf-8a41-e80361c3aee4": inflating: /src/gradle/gradle-7.4.2/lib/commons-lang-2.6.jar Step #1 - "build-39e81d01-377a-42bf-8a41-e80361c3aee4": inflating: /src/gradle/gradle-7.4.2/lib/fastutil-8.5.2-min.jar Step #1 - "build-39e81d01-377a-42bf-8a41-e80361c3aee4": inflating: /src/gradle/gradle-7.4.2/lib/groovy-json-3.0.9.jar Step #1 - "build-39e81d01-377a-42bf-8a41-e80361c3aee4": inflating: /src/gradle/gradle-7.4.2/lib/groovy-astbuilder-3.0.9.jar Step #1 - "build-39e81d01-377a-42bf-8a41-e80361c3aee4": inflating: /src/gradle/gradle-7.4.2/lib/groovy-console-3.0.9.jar Step #1 - "build-39e81d01-377a-42bf-8a41-e80361c3aee4": inflating: /src/gradle/gradle-7.4.2/lib/groovy-dateutil-3.0.9.jar Step #1 - "build-39e81d01-377a-42bf-8a41-e80361c3aee4": inflating: /src/gradle/gradle-7.4.2/lib/groovy-datetime-3.0.9.jar Step #1 - "build-39e81d01-377a-42bf-8a41-e80361c3aee4": inflating: /src/gradle/gradle-7.4.2/lib/groovy-groovydoc-3.0.9.jar Step #1 - "build-39e81d01-377a-42bf-8a41-e80361c3aee4": inflating: /src/gradle/gradle-7.4.2/lib/groovy-nio-3.0.9.jar Step #1 - "build-39e81d01-377a-42bf-8a41-e80361c3aee4": inflating: /src/gradle/gradle-7.4.2/lib/groovy-sql-3.0.9.jar Step #1 - "build-39e81d01-377a-42bf-8a41-e80361c3aee4": inflating: /src/gradle/gradle-7.4.2/lib/groovy-docgenerator-3.0.9.jar Step #1 - "build-39e81d01-377a-42bf-8a41-e80361c3aee4": inflating: /src/gradle/gradle-7.4.2/lib/groovy-templates-3.0.9.jar Step #1 - "build-39e81d01-377a-42bf-8a41-e80361c3aee4": inflating: /src/gradle/gradle-7.4.2/lib/groovy-test-3.0.9.jar Step #1 - "build-39e81d01-377a-42bf-8a41-e80361c3aee4": inflating: /src/gradle/gradle-7.4.2/lib/groovy-xml-3.0.9.jar Step #1 - "build-39e81d01-377a-42bf-8a41-e80361c3aee4": inflating: /src/gradle/gradle-7.4.2/lib/groovy-swing-3.0.9.jar Step #1 - "build-39e81d01-377a-42bf-8a41-e80361c3aee4": inflating: /src/gradle/gradle-7.4.2/lib/groovy-3.0.9.jar Step #1 - "build-39e81d01-377a-42bf-8a41-e80361c3aee4": inflating: /src/gradle/gradle-7.4.2/lib/gradle-file-watching-7.4.2.jar Step #1 - "build-39e81d01-377a-42bf-8a41-e80361c3aee4": inflating: /src/gradle/gradle-7.4.2/lib/gradle-snapshots-7.4.2.jar Step #1 - "build-39e81d01-377a-42bf-8a41-e80361c3aee4": inflating: /src/gradle/gradle-7.4.2/lib/gradle-build-cache-base-7.4.2.jar Step #1 - "build-39e81d01-377a-42bf-8a41-e80361c3aee4": inflating: /src/gradle/gradle-7.4.2/lib/gradle-files-7.4.2.jar Step #1 - "build-39e81d01-377a-42bf-8a41-e80361c3aee4": inflating: /src/gradle/gradle-7.4.2/lib/gradle-hashing-7.4.2.jar Step #1 - "build-39e81d01-377a-42bf-8a41-e80361c3aee4": inflating: /src/gradle/gradle-7.4.2/lib/guava-30.1.1-jre.jar Step #1 - "build-39e81d01-377a-42bf-8a41-e80361c3aee4": inflating: /src/gradle/gradle-7.4.2/lib/junit-4.13.2.jar Step #1 - "build-39e81d01-377a-42bf-8a41-e80361c3aee4": inflating: /src/gradle/gradle-7.4.2/lib/hamcrest-core-1.3.jar Step #1 - "build-39e81d01-377a-42bf-8a41-e80361c3aee4": inflating: /src/gradle/gradle-7.4.2/lib/javax.inject-1.jar Step #1 - "build-39e81d01-377a-42bf-8a41-e80361c3aee4": inflating: /src/gradle/gradle-7.4.2/lib/jansi-1.18.jar Step #1 - "build-39e81d01-377a-42bf-8a41-e80361c3aee4": inflating: /src/gradle/gradle-7.4.2/lib/jcl-over-slf4j-1.7.30.jar Step #1 - "build-39e81d01-377a-42bf-8a41-e80361c3aee4": inflating: /src/gradle/gradle-7.4.2/lib/kotlin-stdlib-jdk8-1.5.31.jar Step #1 - "build-39e81d01-377a-42bf-8a41-e80361c3aee4": inflating: /src/gradle/gradle-7.4.2/lib/kotlin-compiler-embeddable-1.5.31-patched-for-gradle-7.4.2.jar Step #1 - "build-39e81d01-377a-42bf-8a41-e80361c3aee4": inflating: /src/gradle/gradle-7.4.2/lib/kotlin-stdlib-jdk7-1.5.31.jar Step #1 - "build-39e81d01-377a-42bf-8a41-e80361c3aee4": inflating: /src/gradle/gradle-7.4.2/lib/kotlin-reflect-1.5.31.jar Step #1 - "build-39e81d01-377a-42bf-8a41-e80361c3aee4": inflating: /src/gradle/gradle-7.4.2/lib/kotlin-stdlib-1.5.31.jar Step #1 - "build-39e81d01-377a-42bf-8a41-e80361c3aee4": inflating: /src/gradle/gradle-7.4.2/lib/annotations-20.1.0.jar Step #1 - "build-39e81d01-377a-42bf-8a41-e80361c3aee4": inflating: /src/gradle/gradle-7.4.2/lib/gradle-enterprise-operations-7.4.2.jar Step #1 - "build-39e81d01-377a-42bf-8a41-e80361c3aee4": inflating: /src/gradle/gradle-7.4.2/lib/gradle-bootstrap-7.4.2.jar Step #1 - "build-39e81d01-377a-42bf-8a41-e80361c3aee4": inflating: /src/gradle/gradle-7.4.2/lib/gradle-problems-7.4.2.jar Step #1 - "build-39e81d01-377a-42bf-8a41-e80361c3aee4": inflating: /src/gradle/gradle-7.4.2/lib/gradle-kotlin-dsl-tooling-models-7.4.2.jar Step #1 - "build-39e81d01-377a-42bf-8a41-e80361c3aee4": inflating: /src/gradle/gradle-7.4.2/lib/gradle-functional-7.4.2.jar Step #1 - "build-39e81d01-377a-42bf-8a41-e80361c3aee4": inflating: /src/gradle/gradle-7.4.2/lib/gradle-worker-services-7.4.2.jar Step #1 - "build-39e81d01-377a-42bf-8a41-e80361c3aee4": inflating: /src/gradle/gradle-7.4.2/lib/gradle-build-operations-7.4.2.jar Step #1 - "build-39e81d01-377a-42bf-8a41-e80361c3aee4": inflating: /src/gradle/gradle-7.4.2/lib/gradle-enterprise-workers-7.4.2.jar Step #1 - "build-39e81d01-377a-42bf-8a41-e80361c3aee4": inflating: /src/gradle/gradle-7.4.2/lib/gradle-base-annotations-7.4.2.jar Step #1 - "build-39e81d01-377a-42bf-8a41-e80361c3aee4": inflating: /src/gradle/gradle-7.4.2/lib/tomlj-1.0.0.jar Step #1 - "build-39e81d01-377a-42bf-8a41-e80361c3aee4": inflating: /src/gradle/gradle-7.4.2/lib/jsr305-3.0.2.jar Step #1 - "build-39e81d01-377a-42bf-8a41-e80361c3aee4": inflating: /src/gradle/gradle-7.4.2/lib/jul-to-slf4j-1.7.30.jar Step #1 - "build-39e81d01-377a-42bf-8a41-e80361c3aee4": inflating: /src/gradle/gradle-7.4.2/lib/kryo-2.24.0.jar Step #1 - "build-39e81d01-377a-42bf-8a41-e80361c3aee4": inflating: /src/gradle/gradle-7.4.2/lib/log4j-over-slf4j-1.7.30.jar Step #1 - "build-39e81d01-377a-42bf-8a41-e80361c3aee4": inflating: /src/gradle/gradle-7.4.2/lib/minlog-1.2.jar Step #1 - "build-39e81d01-377a-42bf-8a41-e80361c3aee4": inflating: /src/gradle/gradle-7.4.2/lib/native-platform-0.22-milestone-23.jar Step #1 - "build-39e81d01-377a-42bf-8a41-e80361c3aee4": inflating: /src/gradle/gradle-7.4.2/lib/file-events-0.22-milestone-23.jar Step #1 - "build-39e81d01-377a-42bf-8a41-e80361c3aee4": inflating: /src/gradle/gradle-7.4.2/lib/objenesis-2.6.jar Step #1 - "build-39e81d01-377a-42bf-8a41-e80361c3aee4": inflating: /src/gradle/gradle-7.4.2/lib/slf4j-api-1.7.30.jar Step #1 - "build-39e81d01-377a-42bf-8a41-e80361c3aee4": inflating: /src/gradle/gradle-7.4.2/lib/trove4j-1.0.20181211.jar Step #1 - "build-39e81d01-377a-42bf-8a41-e80361c3aee4": inflating: /src/gradle/gradle-7.4.2/lib/xml-apis-1.4.01.jar Step #1 - "build-39e81d01-377a-42bf-8a41-e80361c3aee4": inflating: /src/gradle/gradle-7.4.2/lib/javaparser-core-3.17.0.jar Step #1 - "build-39e81d01-377a-42bf-8a41-e80361c3aee4": inflating: /src/gradle/gradle-7.4.2/lib/gradle-wrapper-7.4.2.jar Step #1 - "build-39e81d01-377a-42bf-8a41-e80361c3aee4": inflating: /src/gradle/gradle-7.4.2/lib/gradle-cli-7.4.2.jar Step #1 - "build-39e81d01-377a-42bf-8a41-e80361c3aee4": inflating: /src/gradle/gradle-7.4.2/lib/kotlin-script-runtime-1.5.31.jar Step #1 - "build-39e81d01-377a-42bf-8a41-e80361c3aee4": inflating: /src/gradle/gradle-7.4.2/lib/kotlin-daemon-embeddable-1.5.31.jar Step #1 - "build-39e81d01-377a-42bf-8a41-e80361c3aee4": inflating: /src/gradle/gradle-7.4.2/lib/kotlin-scripting-common-1.5.31.jar Step #1 - "build-39e81d01-377a-42bf-8a41-e80361c3aee4": inflating: /src/gradle/gradle-7.4.2/lib/kotlin-scripting-jvm-1.5.31.jar Step #1 - "build-39e81d01-377a-42bf-8a41-e80361c3aee4": inflating: /src/gradle/gradle-7.4.2/lib/kotlin-scripting-jvm-host-1.5.31.jar Step #1 - "build-39e81d01-377a-42bf-8a41-e80361c3aee4": inflating: /src/gradle/gradle-7.4.2/lib/kotlin-scripting-compiler-embeddable-1.5.31.jar Step #1 - "build-39e81d01-377a-42bf-8a41-e80361c3aee4": inflating: /src/gradle/gradle-7.4.2/lib/kotlin-scripting-compiler-impl-embeddable-1.5.31.jar Step #1 - "build-39e81d01-377a-42bf-8a41-e80361c3aee4": inflating: /src/gradle/gradle-7.4.2/lib/kotlin-sam-with-receiver-compiler-plugin-1.5.31.jar Step #1 - "build-39e81d01-377a-42bf-8a41-e80361c3aee4": inflating: /src/gradle/gradle-7.4.2/lib/kotlinx-metadata-jvm-0.3.0.jar Step #1 - "build-39e81d01-377a-42bf-8a41-e80361c3aee4": inflating: /src/gradle/gradle-7.4.2/lib/failureaccess-1.0.1.jar Step #1 - "build-39e81d01-377a-42bf-8a41-e80361c3aee4": inflating: /src/gradle/gradle-7.4.2/lib/native-platform-freebsd-amd64-libcpp-0.22-milestone-23.jar Step #1 - "build-39e81d01-377a-42bf-8a41-e80361c3aee4": inflating: /src/gradle/gradle-7.4.2/lib/native-platform-linux-aarch64-0.22-milestone-23.jar Step #1 - "build-39e81d01-377a-42bf-8a41-e80361c3aee4": inflating: /src/gradle/gradle-7.4.2/lib/native-platform-linux-amd64-0.22-milestone-23.jar Step #1 - "build-39e81d01-377a-42bf-8a41-e80361c3aee4": inflating: /src/gradle/gradle-7.4.2/lib/native-platform-osx-aarch64-0.22-milestone-23.jar Step #1 - "build-39e81d01-377a-42bf-8a41-e80361c3aee4": inflating: /src/gradle/gradle-7.4.2/lib/native-platform-osx-amd64-0.22-milestone-23.jar Step #1 - "build-39e81d01-377a-42bf-8a41-e80361c3aee4": inflating: /src/gradle/gradle-7.4.2/lib/native-platform-windows-amd64-0.22-milestone-23.jar Step #1 - "build-39e81d01-377a-42bf-8a41-e80361c3aee4": inflating: /src/gradle/gradle-7.4.2/lib/native-platform-windows-amd64-min-0.22-milestone-23.jar Step #1 - "build-39e81d01-377a-42bf-8a41-e80361c3aee4": inflating: /src/gradle/gradle-7.4.2/lib/native-platform-windows-i386-0.22-milestone-23.jar Step #1 - "build-39e81d01-377a-42bf-8a41-e80361c3aee4": inflating: /src/gradle/gradle-7.4.2/lib/native-platform-windows-i386-min-0.22-milestone-23.jar Step #1 - "build-39e81d01-377a-42bf-8a41-e80361c3aee4": inflating: /src/gradle/gradle-7.4.2/lib/native-platform-linux-aarch64-ncurses5-0.22-milestone-23.jar Step #1 - "build-39e81d01-377a-42bf-8a41-e80361c3aee4": inflating: /src/gradle/gradle-7.4.2/lib/native-platform-linux-aarch64-ncurses6-0.22-milestone-23.jar Step #1 - "build-39e81d01-377a-42bf-8a41-e80361c3aee4": inflating: /src/gradle/gradle-7.4.2/lib/native-platform-linux-amd64-ncurses5-0.22-milestone-23.jar Step #1 - "build-39e81d01-377a-42bf-8a41-e80361c3aee4": inflating: /src/gradle/gradle-7.4.2/lib/native-platform-linux-amd64-ncurses6-0.22-milestone-23.jar Step #1 - "build-39e81d01-377a-42bf-8a41-e80361c3aee4": inflating: /src/gradle/gradle-7.4.2/lib/file-events-linux-aarch64-0.22-milestone-23.jar Step #1 - "build-39e81d01-377a-42bf-8a41-e80361c3aee4": inflating: /src/gradle/gradle-7.4.2/lib/file-events-linux-amd64-0.22-milestone-23.jar Step #1 - "build-39e81d01-377a-42bf-8a41-e80361c3aee4": inflating: /src/gradle/gradle-7.4.2/lib/file-events-osx-aarch64-0.22-milestone-23.jar Step #1 - "build-39e81d01-377a-42bf-8a41-e80361c3aee4": inflating: /src/gradle/gradle-7.4.2/lib/file-events-osx-amd64-0.22-milestone-23.jar Step #1 - "build-39e81d01-377a-42bf-8a41-e80361c3aee4": inflating: /src/gradle/gradle-7.4.2/lib/file-events-windows-amd64-0.22-milestone-23.jar Step #1 - "build-39e81d01-377a-42bf-8a41-e80361c3aee4": inflating: /src/gradle/gradle-7.4.2/lib/file-events-windows-amd64-min-0.22-milestone-23.jar Step #1 - "build-39e81d01-377a-42bf-8a41-e80361c3aee4": inflating: /src/gradle/gradle-7.4.2/lib/file-events-windows-i386-0.22-milestone-23.jar Step #1 - "build-39e81d01-377a-42bf-8a41-e80361c3aee4": inflating: /src/gradle/gradle-7.4.2/lib/file-events-windows-i386-min-0.22-milestone-23.jar Step #1 - "build-39e81d01-377a-42bf-8a41-e80361c3aee4": inflating: /src/gradle/gradle-7.4.2/lib/ant-antlr-1.10.11.jar Step #1 - "build-39e81d01-377a-42bf-8a41-e80361c3aee4": inflating: /src/gradle/gradle-7.4.2/lib/antlr4-runtime-4.7.2.jar Step #1 - "build-39e81d01-377a-42bf-8a41-e80361c3aee4": inflating: /src/gradle/gradle-7.4.2/lib/kotlin-stdlib-common-1.5.31.jar Step #1 - "build-39e81d01-377a-42bf-8a41-e80361c3aee4": inflating: /src/gradle/gradle-7.4.2/lib/qdox-1.12.1.jar Step #1 - "build-39e81d01-377a-42bf-8a41-e80361c3aee4": creating: /src/gradle/gradle-7.4.2/lib/plugins/ Step #1 - "build-39e81d01-377a-42bf-8a41-e80361c3aee4": inflating: /src/gradle/gradle-7.4.2/lib/plugins/gradle-kotlin-dsl-provider-plugins-7.4.2.jar Step #1 - "build-39e81d01-377a-42bf-8a41-e80361c3aee4": inflating: /src/gradle/gradle-7.4.2/lib/plugins/gradle-plugin-development-7.4.2.jar Step #1 - "build-39e81d01-377a-42bf-8a41-e80361c3aee4": inflating: /src/gradle/gradle-7.4.2/lib/plugins/gradle-build-init-7.4.2.jar Step #1 - "build-39e81d01-377a-42bf-8a41-e80361c3aee4": inflating: /src/gradle/gradle-7.4.2/lib/plugins/gradle-build-profile-7.4.2.jar Step #1 - "build-39e81d01-377a-42bf-8a41-e80361c3aee4": inflating: /src/gradle/gradle-7.4.2/lib/plugins/gradle-antlr-7.4.2.jar Step #1 - "build-39e81d01-377a-42bf-8a41-e80361c3aee4": inflating: /src/gradle/gradle-7.4.2/lib/plugins/gradle-enterprise-7.4.2.jar Step #1 - "build-39e81d01-377a-42bf-8a41-e80361c3aee4": inflating: /src/gradle/gradle-7.4.2/lib/plugins/gradle-tooling-api-builders-7.4.2.jar Step #1 - "build-39e81d01-377a-42bf-8a41-e80361c3aee4": inflating: /src/gradle/gradle-7.4.2/lib/plugins/gradle-configuration-cache-7.4.2.jar Step #1 - "build-39e81d01-377a-42bf-8a41-e80361c3aee4": inflating: /src/gradle/gradle-7.4.2/lib/plugins/gradle-kotlin-dsl-tooling-builders-7.4.2.jar Step #1 - "build-39e81d01-377a-42bf-8a41-e80361c3aee4": inflating: /src/gradle/gradle-7.4.2/lib/plugins/gradle-code-quality-7.4.2.jar Step #1 - "build-39e81d01-377a-42bf-8a41-e80361c3aee4": inflating: /src/gradle/gradle-7.4.2/lib/plugins/gradle-signing-7.4.2.jar Step #1 - "build-39e81d01-377a-42bf-8a41-e80361c3aee4": inflating: /src/gradle/gradle-7.4.2/lib/plugins/gradle-tooling-native-7.4.2.jar Step #1 - "build-39e81d01-377a-42bf-8a41-e80361c3aee4": inflating: /src/gradle/gradle-7.4.2/lib/plugins/gradle-ide-native-7.4.2.jar Step #1 - "build-39e81d01-377a-42bf-8a41-e80361c3aee4": inflating: /src/gradle/gradle-7.4.2/lib/plugins/gradle-ide-7.4.2.jar Step #1 - "build-39e81d01-377a-42bf-8a41-e80361c3aee4": inflating: /src/gradle/gradle-7.4.2/lib/plugins/gradle-scala-7.4.2.jar Step #1 - "build-39e81d01-377a-42bf-8a41-e80361c3aee4": inflating: /src/gradle/gradle-7.4.2/lib/plugins/gradle-ear-7.4.2.jar Step #1 - "build-39e81d01-377a-42bf-8a41-e80361c3aee4": inflating: /src/gradle/gradle-7.4.2/lib/plugins/gradle-jacoco-7.4.2.jar Step #1 - "build-39e81d01-377a-42bf-8a41-e80361c3aee4": inflating: /src/gradle/gradle-7.4.2/lib/plugins/gradle-testing-native-7.4.2.jar Step #1 - "build-39e81d01-377a-42bf-8a41-e80361c3aee4": inflating: /src/gradle/gradle-7.4.2/lib/plugins/gradle-language-native-7.4.2.jar Step #1 - "build-39e81d01-377a-42bf-8a41-e80361c3aee4": inflating: /src/gradle/gradle-7.4.2/lib/plugins/gradle-maven-7.4.2.jar Step #1 - "build-39e81d01-377a-42bf-8a41-e80361c3aee4": inflating: /src/gradle/gradle-7.4.2/lib/plugins/gradle-ivy-7.4.2.jar Step #1 - "build-39e81d01-377a-42bf-8a41-e80361c3aee4": inflating: /src/gradle/gradle-7.4.2/lib/plugins/gradle-plugins-7.4.2.jar Step #1 - "build-39e81d01-377a-42bf-8a41-e80361c3aee4": inflating: /src/gradle/gradle-7.4.2/lib/plugins/gradle-testing-junit-platform-7.4.2.jar Step #1 - "build-39e81d01-377a-42bf-8a41-e80361c3aee4": inflating: /src/gradle/gradle-7.4.2/lib/plugins/gradle-testing-jvm-7.4.2.jar Step #1 - "build-39e81d01-377a-42bf-8a41-e80361c3aee4": inflating: /src/gradle/gradle-7.4.2/lib/plugins/gradle-language-groovy-7.4.2.jar Step #1 - "build-39e81d01-377a-42bf-8a41-e80361c3aee4": inflating: /src/gradle/gradle-7.4.2/lib/plugins/gradle-language-java-7.4.2.jar Step #1 - "build-39e81d01-377a-42bf-8a41-e80361c3aee4": inflating: /src/gradle/gradle-7.4.2/lib/plugins/gradle-language-jvm-7.4.2.jar Step #1 - "build-39e81d01-377a-42bf-8a41-e80361c3aee4": inflating: /src/gradle/gradle-7.4.2/lib/plugins/gradle-platform-jvm-7.4.2.jar Step #1 - "build-39e81d01-377a-42bf-8a41-e80361c3aee4": inflating: /src/gradle/gradle-7.4.2/lib/plugins/gradle-composite-builds-7.4.2.jar Step #1 - "build-39e81d01-377a-42bf-8a41-e80361c3aee4": inflating: /src/gradle/gradle-7.4.2/lib/plugins/gradle-plugin-use-7.4.2.jar Step #1 - "build-39e81d01-377a-42bf-8a41-e80361c3aee4": inflating: /src/gradle/gradle-7.4.2/lib/plugins/gradle-publish-7.4.2.jar Step #1 - "build-39e81d01-377a-42bf-8a41-e80361c3aee4": inflating: /src/gradle/gradle-7.4.2/lib/plugins/gradle-testing-base-7.4.2.jar Step #1 - "build-39e81d01-377a-42bf-8a41-e80361c3aee4": inflating: /src/gradle/gradle-7.4.2/lib/plugins/gradle-platform-native-7.4.2.jar Step #1 - "build-39e81d01-377a-42bf-8a41-e80361c3aee4": inflating: /src/gradle/gradle-7.4.2/lib/plugins/gradle-diagnostics-7.4.2.jar Step #1 - "build-39e81d01-377a-42bf-8a41-e80361c3aee4": inflating: /src/gradle/gradle-7.4.2/lib/plugins/gradle-platform-base-7.4.2.jar Step #1 - "build-39e81d01-377a-42bf-8a41-e80361c3aee4": inflating: /src/gradle/gradle-7.4.2/lib/plugins/gradle-version-control-7.4.2.jar Step #1 - "build-39e81d01-377a-42bf-8a41-e80361c3aee4": inflating: /src/gradle/gradle-7.4.2/lib/plugins/gradle-dependency-management-7.4.2.jar Step #1 - "build-39e81d01-377a-42bf-8a41-e80361c3aee4": inflating: /src/gradle/gradle-7.4.2/lib/plugins/gradle-reporting-7.4.2.jar Step #1 - "build-39e81d01-377a-42bf-8a41-e80361c3aee4": inflating: /src/gradle/gradle-7.4.2/lib/plugins/gradle-workers-7.4.2.jar Step #1 - "build-39e81d01-377a-42bf-8a41-e80361c3aee4": inflating: /src/gradle/gradle-7.4.2/lib/plugins/gradle-test-kit-7.4.2.jar Step #1 - "build-39e81d01-377a-42bf-8a41-e80361c3aee4": inflating: /src/gradle/gradle-7.4.2/lib/plugins/gradle-resources-s3-7.4.2.jar Step #1 - "build-39e81d01-377a-42bf-8a41-e80361c3aee4": inflating: /src/gradle/gradle-7.4.2/lib/plugins/gradle-resources-gcs-7.4.2.jar Step #1 - "build-39e81d01-377a-42bf-8a41-e80361c3aee4": inflating: /src/gradle/gradle-7.4.2/lib/plugins/gradle-build-cache-http-7.4.2.jar Step #1 - "build-39e81d01-377a-42bf-8a41-e80361c3aee4": inflating: /src/gradle/gradle-7.4.2/lib/plugins/gradle-security-7.4.2.jar Step #1 - "build-39e81d01-377a-42bf-8a41-e80361c3aee4": inflating: /src/gradle/gradle-7.4.2/lib/plugins/gradle-resources-http-7.4.2.jar Step #1 - "build-39e81d01-377a-42bf-8a41-e80361c3aee4": inflating: /src/gradle/gradle-7.4.2/lib/plugins/gradle-resources-sftp-7.4.2.jar Step #1 - "build-39e81d01-377a-42bf-8a41-e80361c3aee4": inflating: /src/gradle/gradle-7.4.2/lib/plugins/aws-java-sdk-s3-1.11.948.jar Step #1 - "build-39e81d01-377a-42bf-8a41-e80361c3aee4": inflating: /src/gradle/gradle-7.4.2/lib/plugins/aws-java-sdk-kms-1.11.948.jar Step #1 - "build-39e81d01-377a-42bf-8a41-e80361c3aee4": inflating: /src/gradle/gradle-7.4.2/lib/plugins/aws-java-sdk-sts-1.11.948.jar Step #1 - "build-39e81d01-377a-42bf-8a41-e80361c3aee4": inflating: /src/gradle/gradle-7.4.2/lib/plugins/aws-java-sdk-core-1.11.948.jar Step #1 - "build-39e81d01-377a-42bf-8a41-e80361c3aee4": inflating: /src/gradle/gradle-7.4.2/lib/plugins/org.eclipse.jgit-5.7.0.202003110725-r.jar Step #1 - "build-39e81d01-377a-42bf-8a41-e80361c3aee4": inflating: /src/gradle/gradle-7.4.2/lib/plugins/bcpg-jdk15on-1.68.jar Step #1 - "build-39e81d01-377a-42bf-8a41-e80361c3aee4": inflating: /src/gradle/gradle-7.4.2/lib/plugins/bcpkix-jdk15on-1.68.jar Step #1 - "build-39e81d01-377a-42bf-8a41-e80361c3aee4": inflating: /src/gradle/gradle-7.4.2/lib/plugins/bcprov-jdk15on-1.68.jar Step #1 - "build-39e81d01-377a-42bf-8a41-e80361c3aee4": inflating: /src/gradle/gradle-7.4.2/lib/plugins/testng-6.3.1.jar Step #1 - "build-39e81d01-377a-42bf-8a41-e80361c3aee4": inflating: /src/gradle/gradle-7.4.2/lib/plugins/bsh-2.0b6.jar Step #1 - "build-39e81d01-377a-42bf-8a41-e80361c3aee4": inflating: /src/gradle/gradle-7.4.2/lib/plugins/capsule-0.6.3.jar Step #1 - "build-39e81d01-377a-42bf-8a41-e80361c3aee4": inflating: /src/gradle/gradle-7.4.2/lib/plugins/google-api-services-storage-v1-rev171-1.25.0.jar Step #1 - "build-39e81d01-377a-42bf-8a41-e80361c3aee4": inflating: /src/gradle/gradle-7.4.2/lib/plugins/google-api-client-1.25.0.jar Step #1 - "build-39e81d01-377a-42bf-8a41-e80361c3aee4": inflating: /src/gradle/gradle-7.4.2/lib/plugins/google-oauth-client-1.25.0.jar Step #1 - "build-39e81d01-377a-42bf-8a41-e80361c3aee4": inflating: /src/gradle/gradle-7.4.2/lib/plugins/google-http-client-jackson2-1.25.0.jar Step #1 - "build-39e81d01-377a-42bf-8a41-e80361c3aee4": inflating: /src/gradle/gradle-7.4.2/lib/plugins/google-http-client-1.25.0.jar Step #1 - "build-39e81d01-377a-42bf-8a41-e80361c3aee4": inflating: /src/gradle/gradle-7.4.2/lib/plugins/httpclient-4.5.13.jar Step #1 - "build-39e81d01-377a-42bf-8a41-e80361c3aee4": inflating: /src/gradle/gradle-7.4.2/lib/plugins/commons-codec-1.15.jar Step #1 - "build-39e81d01-377a-42bf-8a41-e80361c3aee4": inflating: /src/gradle/gradle-7.4.2/lib/plugins/gson-2.8.6.jar Step #1 - "build-39e81d01-377a-42bf-8a41-e80361c3aee4": inflating: /src/gradle/gradle-7.4.2/lib/plugins/jmespath-java-1.11.948.jar Step #1 - "build-39e81d01-377a-42bf-8a41-e80361c3aee4": inflating: /src/gradle/gradle-7.4.2/lib/plugins/jackson-databind-2.12.1.jar Step #1 - "build-39e81d01-377a-42bf-8a41-e80361c3aee4": inflating: /src/gradle/gradle-7.4.2/lib/plugins/jackson-core-2.12.1.jar Step #1 - "build-39e81d01-377a-42bf-8a41-e80361c3aee4": inflating: /src/gradle/gradle-7.4.2/lib/plugins/jackson-annotations-2.12.1.jar Step #1 - "build-39e81d01-377a-42bf-8a41-e80361c3aee4": inflating: /src/gradle/gradle-7.4.2/lib/plugins/httpcore-4.4.14.jar Step #1 - "build-39e81d01-377a-42bf-8a41-e80361c3aee4": inflating: /src/gradle/gradle-7.4.2/lib/plugins/maven-settings-builder-3.6.3.jar Step #1 - "build-39e81d01-377a-42bf-8a41-e80361c3aee4": inflating: /src/gradle/gradle-7.4.2/lib/plugins/ivy-2.3.0.jar Step #1 - "build-39e81d01-377a-42bf-8a41-e80361c3aee4": inflating: /src/gradle/gradle-7.4.2/lib/plugins/jaxb-impl-3.0.0.jar Step #1 - "build-39e81d01-377a-42bf-8a41-e80361c3aee4": inflating: /src/gradle/gradle-7.4.2/lib/plugins/jaxb-core-3.0.0.jar Step #1 - "build-39e81d01-377a-42bf-8a41-e80361c3aee4": inflating: /src/gradle/gradle-7.4.2/lib/plugins/jakarta.xml.bind-api-3.0.0.jar Step #1 - "build-39e81d01-377a-42bf-8a41-e80361c3aee4": inflating: /src/gradle/gradle-7.4.2/lib/plugins/jakarta.activation-2.0.0.jar Step #1 - "build-39e81d01-377a-42bf-8a41-e80361c3aee4": inflating: /src/gradle/gradle-7.4.2/lib/plugins/jatl-0.2.3.jar Step #1 - "build-39e81d01-377a-42bf-8a41-e80361c3aee4": inflating: /src/gradle/gradle-7.4.2/lib/plugins/jcifs-1.3.17.jar Step #1 - "build-39e81d01-377a-42bf-8a41-e80361c3aee4": inflating: /src/gradle/gradle-7.4.2/lib/plugins/jcommander-1.78.jar Step #1 - "build-39e81d01-377a-42bf-8a41-e80361c3aee4": inflating: /src/gradle/gradle-7.4.2/lib/plugins/joda-time-2.10.4.jar Step #1 - "build-39e81d01-377a-42bf-8a41-e80361c3aee4": inflating: /src/gradle/gradle-7.4.2/lib/plugins/jsch-0.1.55.jar Step #1 - "build-39e81d01-377a-42bf-8a41-e80361c3aee4": inflating: /src/gradle/gradle-7.4.2/lib/plugins/junit-platform-engine-1.7.2.jar Step #1 - "build-39e81d01-377a-42bf-8a41-e80361c3aee4": inflating: /src/gradle/gradle-7.4.2/lib/plugins/junit-platform-commons-1.7.2.jar Step #1 - "build-39e81d01-377a-42bf-8a41-e80361c3aee4": inflating: /src/gradle/gradle-7.4.2/lib/plugins/junit-platform-launcher-1.7.2.jar Step #1 - "build-39e81d01-377a-42bf-8a41-e80361c3aee4": inflating: /src/gradle/gradle-7.4.2/lib/plugins/jzlib-1.1.3.jar Step #1 - "build-39e81d01-377a-42bf-8a41-e80361c3aee4": inflating: /src/gradle/gradle-7.4.2/lib/plugins/maven-builder-support-3.6.3.jar Step #1 - "build-39e81d01-377a-42bf-8a41-e80361c3aee4": inflating: /src/gradle/gradle-7.4.2/lib/plugins/maven-model-3.6.3.jar Step #1 - "build-39e81d01-377a-42bf-8a41-e80361c3aee4": inflating: /src/gradle/gradle-7.4.2/lib/plugins/maven-repository-metadata-3.6.3.jar Step #1 - "build-39e81d01-377a-42bf-8a41-e80361c3aee4": inflating: /src/gradle/gradle-7.4.2/lib/plugins/maven-settings-3.6.3.jar Step #1 - "build-39e81d01-377a-42bf-8a41-e80361c3aee4": inflating: /src/gradle/gradle-7.4.2/lib/plugins/nekohtml-1.9.22.jar Step #1 - "build-39e81d01-377a-42bf-8a41-e80361c3aee4": inflating: /src/gradle/gradle-7.4.2/lib/plugins/plexus-sec-dispatcher-1.4.jar Step #1 - "build-39e81d01-377a-42bf-8a41-e80361c3aee4": inflating: /src/gradle/gradle-7.4.2/lib/plugins/plexus-cipher-1.7.jar Step #1 - "build-39e81d01-377a-42bf-8a41-e80361c3aee4": inflating: /src/gradle/gradle-7.4.2/lib/plugins/plexus-interpolation-1.26.jar Step #1 - "build-39e81d01-377a-42bf-8a41-e80361c3aee4": inflating: /src/gradle/gradle-7.4.2/lib/plugins/plexus-utils-3.3.0.jar Step #1 - "build-39e81d01-377a-42bf-8a41-e80361c3aee4": inflating: /src/gradle/gradle-7.4.2/lib/plugins/dd-plist-1.21.jar Step #1 - "build-39e81d01-377a-42bf-8a41-e80361c3aee4": inflating: /src/gradle/gradle-7.4.2/lib/plugins/snakeyaml-1.28.jar Step #1 - "build-39e81d01-377a-42bf-8a41-e80361c3aee4": inflating: /src/gradle/gradle-7.4.2/lib/plugins/xercesImpl-2.12.0.jar Step #1 - "build-39e81d01-377a-42bf-8a41-e80361c3aee4": inflating: /src/gradle/gradle-7.4.2/lib/plugins/gradle-java-compiler-plugin-7.4.2.jar Step #1 - "build-39e81d01-377a-42bf-8a41-e80361c3aee4": inflating: /src/gradle/gradle-7.4.2/lib/plugins/ion-java-1.0.2.jar Step #1 - "build-39e81d01-377a-42bf-8a41-e80361c3aee4": inflating: /src/gradle/gradle-7.4.2/lib/plugins/apiguardian-api-1.1.0.jar Step #1 - "build-39e81d01-377a-42bf-8a41-e80361c3aee4": inflating: /src/gradle/gradle-7.4.2/lib/plugins/opentest4j-1.2.0.jar Step #1 - "build-39e81d01-377a-42bf-8a41-e80361c3aee4": Removing intermediate container 7f29349a3266 Step #1 - "build-39e81d01-377a-42bf-8a41-e80361c3aee4": ---> dab31965aa06 Step #1 - "build-39e81d01-377a-42bf-8a41-e80361c3aee4": Step 3/9 : ENV GRADLE_HOME $SRC/gradle/gradle-7.4.2 Step #1 - "build-39e81d01-377a-42bf-8a41-e80361c3aee4": ---> Running in ea7d2623418f Step #1 - "build-39e81d01-377a-42bf-8a41-e80361c3aee4": Removing intermediate container ea7d2623418f Step #1 - "build-39e81d01-377a-42bf-8a41-e80361c3aee4": ---> 4b4d6644279a Step #1 - "build-39e81d01-377a-42bf-8a41-e80361c3aee4": Step 4/9 : ENV PATH $GRADLE_HOME/bin:$PATH Step #1 - "build-39e81d01-377a-42bf-8a41-e80361c3aee4": ---> Running in 3e49cb7ba868 Step #1 - "build-39e81d01-377a-42bf-8a41-e80361c3aee4": Removing intermediate container 3e49cb7ba868 Step #1 - "build-39e81d01-377a-42bf-8a41-e80361c3aee4": ---> 206ae3b486cc Step #1 - "build-39e81d01-377a-42bf-8a41-e80361c3aee4": Step 5/9 : RUN git clone --depth 1 https://github.com/strongcourage/fuzzing-corpus.git && zip -j $SRC/JunrarFuzzer_seed_corpus.zip fuzzing-corpus/rar/* && rm -rf fuzzing-corpus Step #1 - "build-39e81d01-377a-42bf-8a41-e80361c3aee4": ---> Running in b49be640d373 Step #1 - "build-39e81d01-377a-42bf-8a41-e80361c3aee4": Cloning into 'fuzzing-corpus'... Step #1 - "build-39e81d01-377a-42bf-8a41-e80361c3aee4": Updating files: 58% (6054/10320) Updating files: 59% (6089/10320) Updating files: 60% (6192/10320) Updating files: 61% (6296/10320) Updating files: 62% (6399/10320) Updating files: 63% (6502/10320) Updating files: 64% (6605/10320) Updating files: 65% (6708/10320) Updating files: 66% (6812/10320) Updating files: 67% (6915/10320) Updating files: 68% (7018/10320) Updating files: 69% (7121/10320) Updating files: 70% (7224/10320) Updating files: 71% (7328/10320) Updating files: 72% (7431/10320) Updating files: 73% (7534/10320) Updating files: 74% (7637/10320) Updating files: 75% (7740/10320) Updating files: 76% (7844/10320) Updating files: 77% (7947/10320) Updating files: 78% (8050/10320) Updating files: 79% (8153/10320) Updating files: 80% (8256/10320) Updating files: 81% (8360/10320) Updating files: 82% (8463/10320) Updating files: 83% (8566/10320) Updating files: 84% (8669/10320) Updating files: 85% (8772/10320) Updating files: 86% (8876/10320) Updating files: 87% (8979/10320) Updating files: 88% (9082/10320) Updating files: 89% (9185/10320) Updating files: 90% (9288/10320) Updating files: 91% (9392/10320) Updating files: 92% (9495/10320) Updating files: 93% (9598/10320) Updating files: 94% (9701/10320) Updating files: 95% (9804/10320) Updating files: 96% (9908/10320) Updating files: 97% (10011/10320) Updating files: 98% (10114/10320) Updating files: 99% (10217/10320) Updating files: 100% (10320/10320) Updating files: 100% (10320/10320), done. Step #1 - "build-39e81d01-377a-42bf-8a41-e80361c3aee4":  adding: sample.rar (deflated 1%) Step #1 - "build-39e81d01-377a-42bf-8a41-e80361c3aee4": Removing intermediate container b49be640d373 Step #1 - "build-39e81d01-377a-42bf-8a41-e80361c3aee4": ---> 08efeeb2ac60 Step #1 - "build-39e81d01-377a-42bf-8a41-e80361c3aee4": Step 6/9 : RUN git clone --depth 1 https://github.com/junrar/junrar.git junrar Step #1 - "build-39e81d01-377a-42bf-8a41-e80361c3aee4": ---> Running in 5ffec03fd76b Step #1 - "build-39e81d01-377a-42bf-8a41-e80361c3aee4": Cloning into 'junrar'... Step #1 - "build-39e81d01-377a-42bf-8a41-e80361c3aee4": Removing intermediate container 5ffec03fd76b Step #1 - "build-39e81d01-377a-42bf-8a41-e80361c3aee4": ---> 39d69c213b60 Step #1 - "build-39e81d01-377a-42bf-8a41-e80361c3aee4": Step 7/9 : COPY build.sh $SRC/ Step #1 - "build-39e81d01-377a-42bf-8a41-e80361c3aee4": ---> 718dc93adbcb Step #1 - "build-39e81d01-377a-42bf-8a41-e80361c3aee4": Step 8/9 : COPY JunrarFuzzer.java $SRC/ Step #1 - "build-39e81d01-377a-42bf-8a41-e80361c3aee4": ---> 1d687665911b Step #1 - "build-39e81d01-377a-42bf-8a41-e80361c3aee4": Step 9/9 : WORKDIR $SRC/junrar Step #1 - "build-39e81d01-377a-42bf-8a41-e80361c3aee4": ---> Running in df2d9e10cd1f Step #1 - "build-39e81d01-377a-42bf-8a41-e80361c3aee4": Removing intermediate container df2d9e10cd1f Step #1 - "build-39e81d01-377a-42bf-8a41-e80361c3aee4": ---> 001acbc46ae3 Step #1 - "build-39e81d01-377a-42bf-8a41-e80361c3aee4": Successfully built 001acbc46ae3 Step #1 - "build-39e81d01-377a-42bf-8a41-e80361c3aee4": Successfully tagged gcr.io/oss-fuzz/junrar:latest Step #1 - "build-39e81d01-377a-42bf-8a41-e80361c3aee4": Successfully tagged us-central1-docker.pkg.dev/oss-fuzz/unsafe/junrar:latest Finished Step #1 - "build-39e81d01-377a-42bf-8a41-e80361c3aee4" Starting Step #2 - "srcmap" Step #2 - "srcmap": Already have image: gcr.io/oss-fuzz/junrar Step #2 - "srcmap": ++ tempfile Step #2 - "srcmap": WARNING: tempfile is deprecated; consider using mktemp instead. Step #2 - "srcmap": + SRCMAP=/tmp/file1QZ08x Step #2 - "srcmap": + echo '{}' Step #2 - "srcmap": + PATHS_TO_SCAN=/src Step #2 - "srcmap": + [[ jvm == \g\o ]] Step #2 - "srcmap": ++ find /src -name .git -type d Step #2 - "srcmap": + for DOT_GIT_DIR in $(find $PATHS_TO_SCAN -name ".git" -type d) Step #2 - "srcmap": ++ dirname /src/junrar/.git Step #2 - "srcmap": + GIT_DIR=/src/junrar Step #2 - "srcmap": + cd /src/junrar Step #2 - "srcmap": ++ git config --get remote.origin.url Step #2 - "srcmap": + GIT_URL=https://github.com/junrar/junrar.git Step #2 - "srcmap": ++ git rev-parse HEAD Step #2 - "srcmap": + GIT_REV=c29e60f634c92a1009de324ab163f2e00cde58a4 Step #2 - "srcmap": + jq_inplace /tmp/file1QZ08x '."/src/junrar" = { type: "git", url: "https://github.com/junrar/junrar.git", rev: "c29e60f634c92a1009de324ab163f2e00cde58a4" }' Step #2 - "srcmap": ++ tempfile Step #2 - "srcmap": WARNING: tempfile is deprecated; consider using mktemp instead. Step #2 - "srcmap": + F=/tmp/fileVS0xR6 Step #2 - "srcmap": + cat /tmp/file1QZ08x Step #2 - "srcmap": + jq '."/src/junrar" = { type: "git", url: "https://github.com/junrar/junrar.git", rev: "c29e60f634c92a1009de324ab163f2e00cde58a4" }' Step #2 - "srcmap": + mv /tmp/fileVS0xR6 /tmp/file1QZ08x Step #2 - "srcmap": ++ find /src -name .svn -type d Step #2 - "srcmap": ++ find /src -name .hg -type d Step #2 - "srcmap": + '[' '' '!=' '' ']' Step #2 - "srcmap": + cat /tmp/file1QZ08x Step #2 - "srcmap": + rm /tmp/file1QZ08x Step #2 - "srcmap": { Step #2 - "srcmap": "/src/junrar": { Step #2 - "srcmap": "type": "git", Step #2 - "srcmap": "url": "https://github.com/junrar/junrar.git", Step #2 - "srcmap": "rev": "c29e60f634c92a1009de324ab163f2e00cde58a4" Step #2 - "srcmap": } Step #2 - "srcmap": } Finished Step #2 - "srcmap" Starting Step #3 - "compile-libfuzzer-coverage-x86_64" Step #3 - "compile-libfuzzer-coverage-x86_64": Already have image (with digest): gcr.io/cloud-builders/docker Step #3 - "compile-libfuzzer-coverage-x86_64": --------------------------------------------------------------- Step #3 - "compile-libfuzzer-coverage-x86_64": vm.mmap_rnd_bits = 28 Step #3 - "compile-libfuzzer-coverage-x86_64": --------------------------------------------------------------- Step #3 - "compile-libfuzzer-coverage-x86_64": CC=clang Step #3 - "compile-libfuzzer-coverage-x86_64": CXX=clang++ Step #3 - "compile-libfuzzer-coverage-x86_64": CFLAGS=-O1 -fno-omit-frame-pointer -gline-tables-only -Wno-error=incompatible-function-pointer-types -Wno-error=int-conversion -Wno-error=deprecated-declarations -Wno-error=implicit-function-declaration -Wno-error=implicit-int -Wno-error=unknown-warning-option -Wno-error=vla-cxx-extension -DFUZZING_BUILD_MODE_UNSAFE_FOR_PRODUCTION -fprofile-instr-generate -fcoverage-mapping -pthread -Wl,--no-as-needed -Wl,-ldl -Wl,-lm -Wno-unused-command-line-argument -fno-sanitize=leak Step #3 - "compile-libfuzzer-coverage-x86_64": CXXFLAGS=-O1 -fno-omit-frame-pointer -gline-tables-only -Wno-error=incompatible-function-pointer-types -Wno-error=int-conversion -Wno-error=deprecated-declarations -Wno-error=implicit-function-declaration -Wno-error=implicit-int -Wno-error=unknown-warning-option -Wno-error=vla-cxx-extension -DFUZZING_BUILD_MODE_UNSAFE_FOR_PRODUCTION -fprofile-instr-generate -fcoverage-mapping -pthread -Wl,--no-as-needed -Wl,-ldl -Wl,-lm -Wno-unused-command-line-argument -stdlib=libc++ -fno-sanitize=leak Step #3 - "compile-libfuzzer-coverage-x86_64": RUSTFLAGS=--cfg fuzzing -Cdebuginfo=1 -Cforce-frame-pointers -Cinstrument-coverage -C link-arg=-lc++ Step #3 - "compile-libfuzzer-coverage-x86_64": --------------------------------------------------------------- Step #3 - "compile-libfuzzer-coverage-x86_64": + mv /src/JunrarFuzzer_seed_corpus.zip /workspace/out/libfuzzer-coverage-x86_64 Step #3 - "compile-libfuzzer-coverage-x86_64": + ./gradlew build Step #3 - "compile-libfuzzer-coverage-x86_64": Fetching distribution. Step #3 - "compile-libfuzzer-coverage-x86_64": Downloading https://services.gradle.org/distributions/gradle-9.7.1-all.zip Step #3 - "compile-libfuzzer-coverage-x86_64": ........................10%.........................20%........................30%.........................40%.........................50%........................60%.........................70%........................80%.........................90%.........................100% Step #3 - "compile-libfuzzer-coverage-x86_64": Step #3 - "compile-libfuzzer-coverage-x86_64": Welcome to Gradle 9.7.1! Step #3 - "compile-libfuzzer-coverage-x86_64": Step #3 - "compile-libfuzzer-coverage-x86_64": Here are the highlights of this release: Step #3 - "compile-libfuzzer-coverage-x86_64": - Isolated Projects graduates to incubating Step #3 - "compile-libfuzzer-coverage-x86_64": - Broader Configuration Cache compatibility Step #3 - "compile-libfuzzer-coverage-x86_64": - Resilient Sync helps you fix broken builds Step #3 - "compile-libfuzzer-coverage-x86_64": - More source locations in problem reports Step #3 - "compile-libfuzzer-coverage-x86_64": Step #3 - "compile-libfuzzer-coverage-x86_64": For more details see https://docs.gradle.org/9.7.1/release-notes.html Step #3 - "compile-libfuzzer-coverage-x86_64": Step #3 - "compile-libfuzzer-coverage-x86_64": Starting a Gradle Daemon (subsequent builds will be faster) Step #3 - "compile-libfuzzer-coverage-x86_64": Step #3 - "compile-libfuzzer-coverage-x86_64": Step #3 - "compile-libfuzzer-coverage-x86_64": > Starting Daemon> IDLEโ”‚ยทยทยทยทยทยทยทยทยทยทยทยทยทยทยทโ”‚ 0% INITIALIZING [34ms]โ”‚ยทยทยทยทยทยทยทยทยทยทยทยทยทยทยทโ”‚ 0% INITIALIZING [134ms]โ”‚ยทยทยทยทยทยทยทยทยทยทยทยทยทยทยทโ”‚ 0% INITIALIZING [234ms]โ”‚ยทยทยทยทยทยทยทยทยทยทยทยทยทยทยทโ”‚ 0% INITIALIZING [334ms]โ”‚ยทยทยทยทยทยทยทยทยทยทยทยทยทยทยทโ”‚ 0% INITIALIZING [434ms]โ”‚ยทยทยทยทยทยทยทยทยทยทยทยทยทยทยทโ”‚ 0% INITIALIZING [534ms]โ”‚ยทยทยทยทยทยทยทยทยทยทยทยทยทยทยทโ”‚ 0% INITIALIZING [634ms]> Evaluating settingsโ”‚ยทยทยทยทยทยทยทยทยทยทยทยทยทยทยทโ”‚ 0% INITIALIZING [734ms]โ”‚ยทยทยทยทยทยทยทยทยทยทยทยทยทยทยทโ”‚ 0% INITIALIZING [834ms]โ”‚ยทยทยทยทยทยทยทยทยทยทยทยทยทยทยทโ”‚ 0% INITIALIZING [934ms]โ”‚ยทยทยทยทยทยทยทยทยทยทยทยทยทยทยทโ”‚ 0% INITIALIZING [1s]โ”‚ยทยทยทยทยทยทยทยทยทยทยทยทยทยทยทโ”‚ 0% INITIALIZING [2s]> Evaluating settings > Resolve dependencies of detachedConfiguration1> Evaluating settings > Resolve dependencies of detachedConfiguration1 > org.gr> Evaluating settings > Resolve dependencies of detachedConfiguration1> Evaluating settingsโ”‚ยทยทยทยทยทยทยทยทยทยทยทยทยทยทยทโ”‚ 0% INITIALIZING [3s]> Evaluating settings > Resolve dependencies of detachedConfiguration2 > io.git> Evaluating settings> Evaluating settings > Resolve dependencies of classpath > foojay-resolver-1.0> Evaluating settings > Resolve dependencies of classpath > gradle-versions-plu> Evaluating settings > Resolve dependencies of classpath > kotlin-bom-2.4.10.p> Evaluating settings > Resolve dependencies of classpath > gradle-versions-plu Step #3 - "compile-libfuzzer-coverage-x86_64": Step #3 - "compile-libfuzzer-coverage-x86_64": > Evaluating settings > Resolve dependencies of classpath > okhttp-4.12.0.pom> Evaluating settings > Resolve dependencies of classpath > moshi-kotlin-1.12.0> Evaluating settings > Resolve dependencies of classpath > kotlin-stdlib-2.4.1โ”‚ยทยทยทยทยทยทยทยทยทยทยทยทยทยทยทโ”‚ 0% INITIALIZING [4s]> IDLE> Evaluating settings > Resolve dependencies of classpath > annotations-13.0.po> IDLE> Evaluating settings > Resolve dependencies of classpath > okio-3.6.0.module> Evaluating settings > Resolve dependencies of classpath > kotlin-stdlib-jdk8-> Evaluating settings > Resolve dependencies of classpath > moshi-1.12.0.pom> Evaluating settings > Resolve dependencies of classpath > kotlin-reflect-2.4.> Evaluating settings > Resolve dependencies of classpath > okio-jvm-3.6.0.modu> Evaluating settings > Resolve dependencies of classpath > kotlin-stdlib-jdk7-> Evaluating settings > Resolve dependencies of classpath > kotlin-stdlib-commo Step #3 - "compile-libfuzzer-coverage-x86_64": > Evaluating settings > Resolve files of configuration 'classpath' > kotlin-std> Evaluating settings > Resolve files of configuration 'classpath' > kotlin-ref> Evaluating settings > Resolve files of configuration 'classpath' > kotlin-std> Evaluating settings > Resolve files of configuration 'classpath' > moshi-kotl (6 lines not showing)โ”‚ยทยทยทยทยทยทยทยทยทยทยทยทยทยทยทโ”‚ 0% INITIALIZING [5s]> Evaluating settings > Resolve files of configuration 'classpath' > foojay-res> IDLE> Evaluating settings > Resolve files of configuration 'classpath' > okhttp-4.1> Evaluating settings > Resolve files of configuration 'classpath' > okio-jvm-3> Evaluating settings > Resolve files of configuration 'classpath' > Resolve fi> Evaluating settings > Resolve files of configuration 'classpath' > Resolve fi> Evaluating settings > Resolve files of configuration 'classpath' > Resolve fi> Evaluating settings > Resolve files of configuration 'classpath' > Resolve fi (5 lines not showing)> IDLE> IDLE> IDLE> IDLE (1 line not showing)> Evaluating settings > Resolve files of configuration 'classpath' > ExternalDe> Evaluating settings > Resolve files of configuration 'classpath' > ExternalDe> Evaluating settings > Resolve files of configuration 'classpath' > ExternalDe> Evaluating settings > Resolve files of configuration 'classpath' > ExternalDe (7 lines not showing)> IDLE> IDLE (5 lines not showing)> IDLE> IDLE (3 lines not showing) (2 lines not showing) (1 line not showing)โ”‚ยทยทยทยทยทยทยทยทยทยทยทยทยทยทยทโ”‚ 0% INITIALIZING [6s]> Evaluating settingsโ”‚ยทยทยทยทยทยทยทยทยทยทยทยทยทยทยทโ”‚ 0% CONFIGURING [6s]> Loading projects> root projectโ”‚ยทยทยทยทยทยทยทยทยทยทยทยทยทยทยทโ”‚ 0% CONFIGURING [7s]> root project > Resolve dependencies of detachedConfiguration1 > dev.jacomet.l> root project> root project > Resolve dependencies of detachedConfiguration2 > io.github.gra> root project> root project > Resolve dependencies of detachedConfiguration3 > org.jreleaser> root project > Resolve dependencies of detachedConfiguration4 > com.diffplug.> root project> root project > Resolve dependencies of classpath > logging-capabilities-0.11.> root project > Resolve dependencies of classpathโ”‚ยทยทยทยทยทยทยทยทยทยทยทยทยทยทยทโ”‚ 0% CONFIGURING [8s]> root project > Resolve dependencies of classpath > jreleaser-gradle-plugin-1.> root project > Resolve dependencies of classpath > spotless-plugin-gradle-8.1> root project > Resolve dependencies of classpath > jreleaser-config-toml-1.26> root project > Resolve dependencies of classpath > jreleaser-config-json-1.26> root project > Resolve dependencies of classpath > jreleaser-config-yaml-1.26> root project > Resolve dependencies of classpath > jreleaser-engine-1.26.0.po> root project > Resolve dependencies of classpath > durian-collect-1.2.0.pom> root project > Resolve dependencies of classpath > durian-core-1.2.0.pom> root project > Resolve dependencies of classpath > spotless-lib-4.10.1.pom> root project > Resolve dependencies of classpath > org.eclipse.jgit-5.13.5.20 (2 lines not showing)> IDLE> IDLE> IDLE> root project > Resolve dependencies of classpath > org.eclipse.jgit-parent-5.> root project > Resolve dependencies of classpath > maven-model-builder-3.6.3.> root project > Resolve dependencies of classpath > maven-3.6.3.pom> root project > Resolve dependencies of classpath> root project > Resolve dependencies of classpath > jreleaser-gitter-java-sdk-> root project > Resolve dependencies of classpath > jreleaser-discourse-java-s> root project > Resolve dependencies of classpath > jreleaser-opencollective-j> root project > Resolve dependencies of classpath > jreleaser-signing-java-sdk (32 lines not showing)โ”‚ยทยทยทยทยทยทยทยทยทยทยทยทยทยทยทโ”‚ 0% CONFIGURING [9s]> IDLE> root project > Resolve dependencies of classpath > jsonschema-generator-paren> root project > Resolve dependencies of classpath > apache-35.pom> IDLE> root project > Resolve dependencies of classpath > junit-bom-5.13.4.module> root project > Resolve dependencies of classpath > jackson-bom-2.17.2.pom> root project > Resolve dependencies of classpath > junit-bom-5.14.1.module> IDLE> root project > Resolve dependencies of classpath > jackson-parent-2.17.pom> IDLE> root project > Resolve dependencies of classpath> root project > Resolve dependencies of classpath > junit-bom-5.10.1.pom> root project > Resolve dependencies of classpath > jackson-dataformats-text-2> root project > Resolve dependencies of classpath > jackson-base-2.22.0.pom> root project > Resolve dependencies of classpath > junit-bom-5.10.1.module> IDLE> root project > Resolve dependencies of classpath > jackson-bom-2.22.0.pom> root project > Resolve dependencies of classpath > oss-parent-79.pom> IDLE> root project > Resolve dependencies of classpath > junit-bom-5.14.3.module> root project > Resolve dependencies of classpath > jackson-core-2.22.0.module> root project > Resolve dependencies of classpath > jackson-dataformat-yaml-2.> root project > Resolve dependencies of classpath > jackson-databind-2.22.0.mo> IDLE> IDLEโ”‚ยทยทยทยทยทยทยทยทยทยทยทยทยทยทยทโ”‚ 0% CONFIGURING [10s]> root project > Resolve dependencies of classpath > jackson-dataformat-toml-2.> root project > Resolve dependencies of classpath > slf4j-parent-1.7.30.pom> root project > Resolve dependencies of classpath > oss-parent-5.pom> root project > Resolve dependencies of classpath > org.eclipse.osgi-3.24.200.> root project > Resolve dependencies of classpath > solstice-1.8.2.pom> root project > Resolve dependencies of classpath > concurrent-trees-2.6.1.pom> IDLE> root project > Resolve dependencies of classpath > solstice-1.8.2.module> IDLE> root project > Resolve dependencies of classpath > plexus-5.1.pom> root project > Resolve dependencies of classpath > maven-artifact-3.6.3.pom> root project > Resolve dependencies of classpath > sisu-inject-0.3.4.pom> IDLE> IDLE> root project > Resolve dependencies of classpath> root project > Resolve dependencies of classpath > commons-parent-102.pom> root project > Resolve dependencies of classpath > mockito-bom-4.11.0.pom> root project > Resolve dependencies of classpath > compiler-0.9.14.pom> root project > Resolve dependencies of classpath > commons-io-2.22.0.pomโ”‚ยทยทยทยทยทยทยทยทยทยทยทยทยทยทยทโ”‚ 0% CONFIGURING [11s]> IDLE> root project > Resolve dependencies of classpath > apache-37.pom> root project > Resolve dependencies of classpath > junit-bom-5.14.2.pom> root project > Resolve dependencies of classpath > bcpg-jdk18on-1.85.pom> root project > Resolve dependencies of classpath > jreleaser-utils-1.26.0.pom> root project > Resolve dependencies of classpath > slf4j-parent-2.0.16.pom> root project > Resolve dependencies of classpath > slf4j-bom-2.0.16.pom> root project > Resolve dependencies of classpath > oss-parent-56.pom> root project > Resolve dependencies of classpath > jreleaser-java-sdk-commons> root project > Resolve dependencies of classpath > project-1.0.9.pom> root project > Resolve dependencies of classpath > twitter4j-core-4.1.2.pomโ”‚ยทยทยทยทยทยทยทยทยทยทยทยทยทยทยทโ”‚ 0% CONFIGURING [12s]> root project > Resolve dependencies of classpath > jackson-datatype-jsr310-2.> root project > Resolve dependencies of classpath > jackson-dataformat-xml-2.2> root project > Resolve dependencies of classpath > failsafe-3.3.2.pom> root project > Resolve dependencies of classpath > failsafe-parent-3.3.2.pom> root project > Resolve dependencies of classpath > jackson-modules-java8-2.22> root project > Resolve dependencies of classpath > jackson-dataformat-xml-2.2> IDLE> root project > Resolve dependencies of classpath > jackson-datatype-jsr310-2.> IDLE> root project > Resolve dependencies of classpath > commons-net-3.13.0.pom> root project > Resolve dependencies of classpath > commons-parent-97.pom> root project > Resolve dependencies of classpath > bcutil-jdk18on-1.85.pom> root project > Resolve dependencies of classpath > sshj-0.40.0.pom> root project > Resolve dependencies of classpath > bcprov-jdk18on-1.85.pom> IDLE> root project > Resolve dependencies of classpath> IDLE> root project > Resolve dependencies of classpath > httpcore5-parent-5.4.3.pom> root project > Resolve dependencies of classpath > commons-parent-103.pom> root project > Resolve dependencies of classpath > services-2.54.6.pom> root project > Resolve dependencies of classpath > http-clients-2.54.6.pom (1 line not showing)> IDLE> root project > Resolve dependencies of classpath > bom-internal-2.54.6.pom> root project > Resolve dependencies of classpath > apache-27.pom> IDLE> root project > Resolve dependencies of classpath > junit-bom-5.13.3.pom> root project > Resolve dependencies of classpath > junit-bom-5.10.3.pomโ”‚ยทยทยทยทยทยทยทยทยทยทยทยทยทยทยทโ”‚ 0% CONFIGURING [13s]> root project > Resolve dependencies of classpath > opentelemetry-bom-1.49.0.p> IDLE> root project > Resolve dependencies of classpath> root project > Resolve dependencies of classpath > jackson-annotations-2.22.m> root project > Resolve dependencies of classpath > xz-1.9.pom> root project > Resolve dependencies of classpath > durian-swt.os-4.3.0.pom> root project > Resolve dependencies of classpath> IDLE> root project > Resolve dependencies of classpath > slf4j-parent-2.0.18.pom> root project > Resolve dependencies of classpath > jcl-over-slf4j-2.0.18.pom> root project > Resolve dependencies of classpath > xz-1.12.pom> root project > Resolve dependencies of classpath > commons-compress-1.28.0.po> root project > Resolve dependencies of classpath > commonmark-parent-0.21.0.p> root project > Resolve dependencies of classpath > commons-parent-85.pom> IDLEโ”‚ยทยทยทยทยทยทยทยทยทยทยทยทยทยทยทโ”‚ 0% CONFIGURING [14s]> root project > Resolve dependencies of classpath > junit-bom-5.13.1.module> root project > Resolve dependencies of classpath > feign-jackson-13.14.pom> root project > Resolve dependencies of classpath > feign-httpclient-13.14.pom> root project > Resolve dependencies of classpath > tika-core-2.9.4.pom> root project > Resolve dependencies of classpath > httpclient-4.5.14.pom (3 lines not showing)> IDLE> root project > Resolve dependencies of classpath > httpcomponents-parent-11.p> root project > Resolve dependencies of classpath > junit-bom-6.1.3.pom> root project > Resolve dependencies of classpath > apache-34.pom> IDLE> root project > Resolve dependencies of classpath > jackson-parent-2.19.pom> root project > Resolve dependencies of classpath > okhttp-bom-5.4.0.pom> root project > Resolve dependencies of classpath > oss-parent-65.pom> IDLE> root project > Resolve dependencies of classpath > netty-bom-4.2.0.Final.pom> root project > Resolve dependencies of classpath > cxf-3.5.11.pom> root project > Resolve dependencies of classpath > log4j-bom-2.24.3.pom> root project > Resolve dependencies of classpath > apache-33.pom> root project > Resolve dependencies of classpath > jetty-bom-9.4.57.v20241219โ”‚ยทยทยทยทยทยทยทยทยทยทยทยทยทยทยทโ”‚ 0% CONFIGURING [15s]> root project > Resolve dependencies of classpath > junit-bom-5.12.2.module> root project > Resolve dependencies of classpath> root project > Resolve dependencies of classpath > woodstox-core-7.2.0.pom> root project > Resolve dependencies of classpath > stax2-api-4.3.0.pom> root project > Resolve dependencies of classpath> IDLE> root project > Resolve dependencies of classpath > httpcore5-parent-5.4.pom> root project > Resolve dependencies of classpath > core-2.54.6.pom> root project > Resolve dependencies of classpath > identity-spi-2.54.6.pom> root project > Resolve dependencies of classpath > arns-2.54.6.pom> root project > Resolve dependencies of classpath > aws-xml-protocol-2.54.6.po> root project > Resolve dependencies of classpath > protocol-core-2.54.6.pom (14 lines not showing)> IDLE> IDLE> root project > Resolve dependencies of classpath> IDLE> root project > Resolve dependencies of classpath > commons-logging-1.2.pomโ”‚ยทยทยทยทยทยทยทยทยทยทยทยทยทยทยทโ”‚ 0% CONFIGURING [16s]> root project > Resolve dependencies of classpath > commons-parent-34.pom> root project > Resolve dependencies of classpath > jackson-databind-2.22.1.po> root project > Resolve dependencies of classpath > jackson-base-2.22.1.pom> root project > Resolve dependencies of classpath > jackson-databind-2.22.1.mo> root project > Resolve dependencies of classpath > aws-query-protocol-2.54.6.> root project > Resolve dependencies of classpath > retries-2.54.6.pom> root project > Resolve dependencies of classpath > utils-lite-2.54.6.pom> root project > Resolve dependencies of classpath > third-party-jackson-core-2> root project > Resolve dependencies of classpath> root project > Resolve dependencies of classpath > jackson-core-2.22.1.pomโ”‚ยทยทยทยทยทยทยทยทยทยทยทยทยทยทยทโ”‚ 0% CONFIGURING [17s]> root project > Resolve dependencies of classpath > jackson-core-2.22.1.module> root project > Resolve dependencies of classpath > kotlin-stdlib-common-1.9.1> root project > Resolve dependencies of classpath > jackson-dataformats-text-2> root project > Resolve dependencies of classpath > jackson-dataformat-toml-2.> root project > Resolve dependencies of classpath > jackson-dataformat-xml-2.2> root project > Resolve dependencies of classpath > jackson-dataformat-yaml-2.> root project > Resolve dependencies of classpath > jackson-datatype-jsr310-2.> root project > Resolve dependencies of classpath > snakeyaml-2.2.pom> root project > Resolve dependencies of classpath > kotlin-stdlib-jdk7-1.9.10.โ”‚ยทยทยทยทยทยทยทยทยทยทยทยทยทยทยทโ”‚ 0% CONFIGURING [18s]> root project > Resolve files of configuration 'classpath' > jreleaser-engine-> root project > Resolve files of configuration 'classpath' > base-gradle-plugi> root project > Resolve files of configuration 'classpath' > publish-plugin-2.> root project > Resolve files of configuration 'classpath' > logging-capabilit (28 lines not showing)> root project > Resolve files of configuration 'classpath' > jsonschema-genera> root project > Resolve files of configuration 'classpath' > commons-compress-> root project > Resolve files of configuration 'classpath' > jreleaser-templat> root project > Resolve files of configuration 'classpath' > s3-2.54.6.jar > 1> root project > Resolve files of configuration 'classpath' > profiles-2.54.6.j> root project > Resolve files of configuration 'classpath' > sdk-core-2.54.6.j> root project > Resolve files of configuration 'classpath' > http-auth-aws-2.5 (25 lines not showing)> root project > Resolve files of configuration 'classpath' > httpcore-4.4.16.j> root project > Resolve files of configuration 'classpath' > woodstox-core-7.2> root project > Resolve files of configuration 'classpath' > zstd-jni-1.5.7-15> root project > Resolve files of configuration 'classpath' > bcprov-jdk18on-1. (15 lines not showing)> IDLE> IDLE> root project > Resolve files of configuration 'classpath' > Resolve files of > IDLE> root project > Resolve files of configuration 'classpath' > Resolve files of > root project > Resolve files of configuration 'classpath' > Resolve files of > root project > Resolve files of configuration 'classpath' > Resolve files of  (3 lines not showing)> IDLE> IDLE> IDLE> root project > Resolve files of configuration 'classpath' > MergeInstrumentat> root project > Resolve files of configuration 'classpath' > ExternalDependenc> root project > Resolve files of configuration 'classpath' > ExternalDependenc> root project > Resolve files of configuration 'classpath' > ExternalDependenc> root project > Resolve files of configuration 'classpath' > ExternalDependenc (8 lines not showing)โ”‚ยทยทยทยทยทยทยทยทยทยทยทยทยทยทยทโ”‚ 0% CONFIGURING [19s] (6 lines not showing) (19 lines not showing)> IDLE> root project > Resolve files of configuration 'classpath' > ExternalDependenc (15 lines not showing) (18 lines not showing)> root project > Resolve files of configuration 'classpath' > MergeInstrumentat (16 lines not showing)> root project > Resolve files of configuration 'classpath' > ExternalDependenc (18 lines not showing) (16 lines not showing) (20 lines not showing) (19 lines not showing)โ”‚ยทยทยทยทยทยทยทยทยทยทยทยทยทยทยทโ”‚ 0% CONFIGURING [20s]> IDLE (13 lines not showing) (11 lines not showing) (8 lines not showing) (6 lines not showing)> IDLE (4 lines not showing)> IDLE> IDLE (2 lines not showing)> root project > Resolve files of configuration 'classpath' > ExternalDependenc (1 line not showing)> IDLE> root projectโ”‚ยทยทยทยทยทยทยทยทยทยทยทยทยทยทยทโ”‚ 0% CONFIGURING [21s]โ”‚ยทยทยทยทยทยทยทยทยทยทยทยทยทยทยทโ”‚ 0% CONFIGURING [22s] Step #3 - "compile-libfuzzer-coverage-x86_64": > Configure project : Step #3 - "compile-libfuzzer-coverage-x86_64": JReleaser Gradle Plugin 1.26.0. Consider becoming a sponsor at https://opencollective.com/jreleaser Step #3 - "compile-libfuzzer-coverage-x86_64":  Step #3 - "compile-libfuzzer-coverage-x86_64":  Step #3 - "compile-libfuzzer-coverage-x86_64":  Step #3 - "compile-libfuzzer-coverage-x86_64": โ”‚ยทยทยทยทยทยทยทยทยทยทยทยทยทยทยทโ”‚ 0% CONFIGURING [22s]> IDLE> root project> IDLE> IDLEโ”‚ยทยทยทยทยทยทยทยทยทยทยทยทยทยทยทโ”‚ 0% CONFIGURING [23s]โ”‚ยทยทยทยทยทยทยทยทยทยทยทยทยทยทยทโ”‚ 0% CONFIGURING [24s]โ”‚โ–ˆโ–ˆโ–ˆโ–ˆโ–ˆโ–ˆโ–ˆโ–ˆโ–ˆโ–ˆโ–ˆโ–ˆโ–ˆโ–ˆโ–ˆโ”‚ 100% CONFIGURING [24s]> Building task graph of root buildโ”‚ยทยทยทยทยทยทยทยทยทยทยทยทยทยทยทโ”‚ 0% EXECUTING [25s]> :compileJava> :compileJava > Resolve dependencies of :compileClasspath > slf4j-api-2.0.17.p> :compileJava > Resolve dependencies of :compileClasspath > slf4j-bom-2.0.17.p> :compileJava > Resolve files of configuration ':compileClasspath' > slf4j-api> :compileJavaโ”‚ยทยทยทยทยทยทยทยทยทยทยทยทยทยทยทโ”‚ 0% EXECUTING [26s]โ”‚ยทยทยทยทยทยทยทยทยทยทยทยทยทยทยทโ”‚ 0% EXECUTING [27s]โ”‚โ–ˆโ–ˆโ–Žยทยทยทยทยทยทยทยทยทยทยทยทโ”‚ 15% EXECUTING [27s]> :jarโ”‚โ–ˆโ–ˆโ–ˆโ–ยทยทยทยทยทยทยทยทยทยทยทโ”‚ 21% EXECUTING [27s]> :javadocโ”‚โ–ˆโ–ˆโ–ˆโ–ยทยทยทยทยทยทยทยทยทยทยทโ”‚ 21% EXECUTING [28s] Step #3 - "compile-libfuzzer-coverage-x86_64": > Task :javadoc FAILED Step #3 - "compile-libfuzzer-coverage-x86_64": /src/junrar/src/main/java/com/github/junrar/rarfile/Rar5FileHeaderReader.java:41: error: unmappable character (0xE2) for encoding US-ASCII Step #3 - "compile-libfuzzer-coverage-x86_64": /** {@code headers5.hpp:65} ??? RAR7 compression flags carrying a RAR5 compression algorithm. */ Step #3 - "compile-libfuzzer-coverage-x86_64": ^ Step #3 - "compile-libfuzzer-coverage-x86_64": /src/junrar/src/main/java/com/github/junrar/rarfile/Rar5FileHeaderReader.java:41: error: unmappable character (0x80) for encoding US-ASCII Step #3 - "compile-libfuzzer-coverage-x86_64": /** {@code headers5.hpp:65} ??? RAR7 compression flags carrying a RAR5 compression algorithm. */ Step #3 - "compile-libfuzzer-coverage-x86_64": ^ Step #3 - "compile-libfuzzer-coverage-x86_64": /src/junrar/src/main/java/com/github/junrar/rarfile/Rar5FileHeaderReader.java:41: error: unmappable character (0x94) for encoding US-ASCII Step #3 - "compile-libfuzzer-coverage-x86_64": /** {@code headers5.hpp:65} ??? RAR7 compression flags carrying a RAR5 compression algorithm. */ Step #3 - "compile-libfuzzer-coverage-x86_64": ^ Step #3 - "compile-libfuzzer-coverage-x86_64": /src/junrar/src/main/java/com/github/junrar/rarfile/FileHeader.java:1019: error: unmappable character (0xE2) for encoding US-ASCII Step #3 - "compile-libfuzzer-coverage-x86_64": * the two as one case throughout ??? {@code case VER_PACK5: case VER_PACK7:} in Step #3 - "compile-libfuzzer-coverage-x86_64": ^ Step #3 - "compile-libfuzzer-coverage-x86_64": /src/junrar/src/main/java/com/github/junrar/rarfile/FileHeader.java:1019: error: unmappable character (0x80) for encoding US-ASCII Step #3 - "compile-libfuzzer-coverage-x86_64": * the two as one case throughout ??? {@code case VER_PACK5: case VER_PACK7:} in Step #3 - "compile-libfuzzer-coverage-x86_64": ^ Step #3 - "compile-libfuzzer-coverage-x86_64": /src/junrar/src/main/java/com/github/junrar/rarfile/FileHeader.java:1019: error: unmappable character (0x94) for encoding US-ASCII Step #3 - "compile-libfuzzer-coverage-x86_64": * the two as one case throughout ??? {@code case VER_PACK5: case VER_PACK7:} in Step #3 - "compile-libfuzzer-coverage-x86_64": ^ Step #3 - "compile-libfuzzer-coverage-x86_64": /src/junrar/src/main/java/com/github/junrar/rarfile/FileHeader.java:1020: error: unmappable character (0xE2) for encoding US-ASCII Step #3 - "compile-libfuzzer-coverage-x86_64": * {@code d861246:unpack.cpp:182-184} ??? and RAR7 reuses the RARFMT50 container Step #3 - "compile-libfuzzer-coverage-x86_64": ^ Step #3 - "compile-libfuzzer-coverage-x86_64": /src/junrar/src/main/java/com/github/junrar/rarfile/FileHeader.java:1020: error: unmappable character (0x80) for encoding US-ASCII Step #3 - "compile-libfuzzer-coverage-x86_64": * {@code d861246:unpack.cpp:182-184} ??? and RAR7 reuses the RARFMT50 container Step #3 - "compile-libfuzzer-coverage-x86_64": ^ Step #3 - "compile-libfuzzer-coverage-x86_64": /src/junrar/src/main/java/com/github/junrar/rarfile/FileHeader.java:1020: error: unmappable character (0x94) for encoding US-ASCII Step #3 - "compile-libfuzzer-coverage-x86_64": * {@code d861246:unpack.cpp:182-184} ??? and RAR7 reuses the RARFMT50 container Step #3 - "compile-libfuzzer-coverage-x86_64": ^ Step #3 - "compile-libfuzzer-coverage-x86_64": /src/junrar/src/main/java/com/github/junrar/unpack/Unpack5Window.java:20: error: unmappable character (0xE2) for encoding US-ASCII Step #3 - "compile-libfuzzer-coverage-x86_64": * {@code unpack50frag.cpp} ??? that allocator solves a 32-bit-C++ fragmentation problem, not an Step #3 - "compile-libfuzzer-coverage-x86_64": ^ Step #3 - "compile-libfuzzer-coverage-x86_64": /src/junrar/src/main/java/com/github/junrar/unpack/Unpack5Window.java:20: error: unmappable character (0x80) for encoding US-ASCII Step #3 - "compile-libfuzzer-coverage-x86_64": * {@code unpack50frag.cpp} ??? that allocator solves a 32-bit-C++ fragmentation problem, not an Step #3 - "compile-libfuzzer-coverage-x86_64": ^ Step #3 - "compile-libfuzzer-coverage-x86_64": /src/junrar/src/main/java/com/github/junrar/unpack/Unpack5Window.java:20: error: unmappable character (0x94) for encoding US-ASCII Step #3 - "compile-libfuzzer-coverage-x86_64": * {@code unpack50frag.cpp} ??? that allocator solves a 32-bit-C++ fragmentation problem, not an Step #3 - "compile-libfuzzer-coverage-x86_64": ^ Step #3 - "compile-libfuzzer-coverage-x86_64": /src/junrar/src/main/java/com/github/junrar/unpack/Unpack5Window.java:32: error: unmappable character (0xE2) for encoding US-ASCII Step #3 - "compile-libfuzzer-coverage-x86_64": * 256 KB, not 64 GB ??? strictly better than upstream, which eagerly allocates up to its limit. Step #3 - "compile-libfuzzer-coverage-x86_64": ^ Step #3 - "compile-libfuzzer-coverage-x86_64": /src/junrar/src/main/java/com/github/junrar/unpack/Unpack5Window.java:32: error: unmappable character (0x80) for encoding US-ASCII Step #3 - "compile-libfuzzer-coverage-x86_64": * 256 KB, not 64 GB ??? strictly better than upstream, which eagerly allocates up to its limit. Step #3 - "compile-libfuzzer-coverage-x86_64": ^ Step #3 - "compile-libfuzzer-coverage-x86_64": /src/junrar/src/main/java/com/github/junrar/unpack/Unpack5Window.java:32: error: unmappable character (0x94) for encoding US-ASCII Step #3 - "compile-libfuzzer-coverage-x86_64": * 256 KB, not 64 GB ??? strictly better than upstream, which eagerly allocates up to its limit. Step #3 - "compile-libfuzzer-coverage-x86_64": ^ Step #3 - "compile-libfuzzer-coverage-x86_64": /src/junrar/src/main/java/com/github/junrar/unpack/Unpack5Window.java:146: error: unmappable character (0xE2) for encoding US-ASCII Step #3 - "compile-libfuzzer-coverage-x86_64": /** @return the backing array holding {@code pos} ??? pair with {@link #offsetAt}. */ Step #3 - "compile-libfuzzer-coverage-x86_64": ^ Step #3 - "compile-libfuzzer-coverage-x86_64": /src/junrar/src/main/java/com/github/junrar/unpack/Unpack5Window.java:146: error: unmappable character (0x80) for encoding US-ASCII Step #3 - "compile-libfuzzer-coverage-x86_64": /** @return the backing array holding {@code pos} ??? pair with {@link #offsetAt}. */ Step #3 - "compile-libfuzzer-coverage-x86_64": ^ Step #3 - "compile-libfuzzer-coverage-x86_64": /src/junrar/src/main/java/com/github/junrar/unpack/Unpack5Window.java:146: error: unmappable character (0x94) for encoding US-ASCII Step #3 - "compile-libfuzzer-coverage-x86_64": /** @return the backing array holding {@code pos} ??? pair with {@link #offsetAt}. */ Step #3 - "compile-libfuzzer-coverage-x86_64": ^ Step #3 - "compile-libfuzzer-coverage-x86_64": /src/junrar/src/main/java/com/github/junrar/unpack/Unpack5Window.java:158: error: unmappable character (0xE2) for encoding US-ASCII Step #3 - "compile-libfuzzer-coverage-x86_64": * segment boundaries as needed. The range must not cross the window end ??? callers Step #3 - "compile-libfuzzer-coverage-x86_64": ^ Step #3 - "compile-libfuzzer-coverage-x86_64": /src/junrar/src/main/java/com/github/junrar/unpack/Unpack5Window.java:158: error: unmappable character (0x80) for encoding US-ASCII Step #3 - "compile-libfuzzer-coverage-x86_64": * segment boundaries as needed. The range must not cross the window end ??? callers Step #3 - "compile-libfuzzer-coverage-x86_64": ^ Step #3 - "compile-libfuzzer-coverage-x86_64": /src/junrar/src/main/java/com/github/junrar/unpack/Unpack5Window.java:158: error: unmappable character (0x94) for encoding US-ASCII Step #3 - "compile-libfuzzer-coverage-x86_64": * segment boundaries as needed. The range must not cross the window end ??? callers Step #3 - "compile-libfuzzer-coverage-x86_64": ^ Step #3 - "compile-libfuzzer-coverage-x86_64": /src/junrar/src/main/java/com/github/junrar/unpack/decode/Compress.java:74: error: unmappable character (0xE2) for encoding US-ASCII Step #3 - "compile-libfuzzer-coverage-x86_64": // Match-length ceilings (compress.hpp:10,17) ??? the write-out reserve margin the decode loop Step #3 - "compile-libfuzzer-coverage-x86_64": ^ Step #3 - "compile-libfuzzer-coverage-x86_64": /src/junrar/src/main/java/com/github/junrar/unpack/decode/Compress.java:74: error: unmappable character (0x80) for encoding US-ASCII Step #3 - "compile-libfuzzer-coverage-x86_64": // Match-length ceilings (compress.hpp:10,17) ??? the write-out reserve margin the decode loop Step #3 - "compile-libfuzzer-coverage-x86_64": ^ Step #3 - "compile-libfuzzer-coverage-x86_64": /src/junrar/src/main/java/com/github/junrar/unpack/decode/Compress.java:74: error: unmappable character (0x94) for encoding US-ASCII Step #3 - "compile-libfuzzer-coverage-x86_64": // Match-length ceilings (compress.hpp:10,17) ??? the write-out reserve margin the decode loop Step #3 - "compile-libfuzzer-coverage-x86_64": ^ Step #3 - "compile-libfuzzer-coverage-x86_64": /src/junrar/src/main/java/com/github/junrar/unpack/decode/Decode5.java:9: error: unmappable character (0xE2) for encoding US-ASCII Step #3 - "compile-libfuzzer-coverage-x86_64": * {@code 8f437ab:unpack.hpp} ??? the quick-decode accelerator ({@link #quickLen}/{@link #quickNum}) Step #3 - "compile-libfuzzer-coverage-x86_64": ^ Step #3 - "compile-libfuzzer-coverage-x86_64": /src/junrar/src/main/java/com/github/junrar/unpack/decode/Decode5.java:9: error: unmappable character (0x80) for encoding US-ASCII Step #3 - "compile-libfuzzer-coverage-x86_64": * {@code 8f437ab:unpack.hpp} ??? the quick-decode accelerator ({@link #quickLen}/{@link #quickNum}) Step #3 - "compile-libfuzzer-coverage-x86_64": ^ Step #3 - "compile-libfuzzer-coverage-x86_64": /src/junrar/src/main/java/com/github/junrar/unpack/decode/Decode5.java:9: error: unmappable character (0x94) for encoding US-ASCII Step #3 - "compile-libfuzzer-coverage-x86_64": * {@code 8f437ab:unpack.hpp} ??? the quick-decode accelerator ({@link #quickLen}/{@link #quickNum}) Step #3 - "compile-libfuzzer-coverage-x86_64": ^ Step #3 - "compile-libfuzzer-coverage-x86_64": /src/junrar/src/main/java/com/github/junrar/unpack/decode/Decode5.java:10: error: unmappable character (0xE2) for encoding US-ASCII Step #3 - "compile-libfuzzer-coverage-x86_64": * that the older RAR3 {@link Decode} lacks ??? so it is a sibling holder, not a subclass. Every Step #3 - "compile-libfuzzer-coverage-x86_64": ^ Step #3 - "compile-libfuzzer-coverage-x86_64": /src/junrar/src/main/java/com/github/junrar/unpack/decode/Decode5.java:10: error: unmappable character (0x80) for encoding US-ASCII Step #3 - "compile-libfuzzer-coverage-x86_64": * that the older RAR3 {@link Decode} lacks ??? so it is a sibling holder, not a subclass. Every Step #3 - "compile-libfuzzer-coverage-x86_64": ^ Step #3 - "compile-libfuzzer-coverage-x86_64": /src/junrar/src/main/java/com/github/junrar/unpack/decode/Decode5.java:10: error: unmappable character (0x94) for encoding US-ASCII Step #3 - "compile-libfuzzer-coverage-x86_64": * that the older RAR3 {@link Decode} lacks ??? so it is a sibling holder, not a subclass. Every Step #3 - "compile-libfuzzer-coverage-x86_64": ^ Step #3 - "compile-libfuzzer-coverage-x86_64": /src/junrar/src/main/java/com/github/junrar/unpack/Unpack5.java:17: error: unmappable character (0xE2) for encoding US-ASCII Step #3 - "compile-libfuzzer-coverage-x86_64": * RAR5 (unpack method 0x50) decode engine ??? skeleton (issue #27, M3.6). Built as a Step #3 - "compile-libfuzzer-coverage-x86_64": ^ Step #3 - "compile-libfuzzer-coverage-x86_64": /src/junrar/src/main/java/com/github/junrar/unpack/Unpack5.java:17: error: unmappable character (0x80) for encoding US-ASCII Step #3 - "compile-libfuzzer-coverage-x86_64": * RAR5 (unpack method 0x50) decode engine ??? skeleton (issue #27, M3.6). Built as a Step #3 - "compile-libfuzzer-coverage-x86_64": ^ Step #3 - "compile-libfuzzer-coverage-x86_64": /src/junrar/src/main/java/com/github/junrar/unpack/Unpack5.java:17: error: unmappable character (0x94) for encoding US-ASCII Step #3 - "compile-libfuzzer-coverage-x86_64": * RAR5 (unpack method 0x50) decode engine ??? skeleton (issue #27, M3.6). Built as a Step #3 - "compile-libfuzzer-coverage-x86_64": ^ Step #3 - "compile-libfuzzer-coverage-x86_64": /src/junrar/src/main/java/com/github/junrar/unpack/Unpack5.java:25: error: unmappable character (0xE2) for encoding US-ASCII Step #3 - "compile-libfuzzer-coverage-x86_64": *

Dictionary resource model (plan §6 R1, review B-S3 ??? three separated concepts). Step #3 - "compile-libfuzzer-coverage-x86_64": ^ Step #3 - "compile-libfuzzer-coverage-x86_64": /src/junrar/src/main/java/com/github/junrar/unpack/Unpack5.java:25: error: unmappable character (0x80) for encoding US-ASCII Step #3 - "compile-libfuzzer-coverage-x86_64": *

Dictionary resource model (plan §6 R1, review B-S3 ??? three separated concepts). Step #3 - "compile-libfuzzer-coverage-x86_64": ^ Step #3 - "compile-libfuzzer-coverage-x86_64": /src/junrar/src/main/java/com/github/junrar/unpack/Unpack5.java:25: error: unmappable character (0x94) for encoding US-ASCII Step #3 - "compile-libfuzzer-coverage-x86_64": *

Dictionary resource model (plan §6 R1, review B-S3 ??? three separated concepts). Step #3 - "compile-libfuzzer-coverage-x86_64": ^ Step #3 - "compile-libfuzzer-coverage-x86_64": /src/junrar/src/main/java/com/github/junrar/unpack/Unpack5.java:27: error: unmappable character (0xE2) for encoding US-ASCII Step #3 - "compile-libfuzzer-coverage-x86_64": *

  • Engine capability ceiling ??? what {@link Unpack5Window} can address: 64 GB since Step #3 - "compile-libfuzzer-coverage-x86_64": ^ Step #3 - "compile-libfuzzer-coverage-x86_64": /src/junrar/src/main/java/com/github/junrar/unpack/Unpack5.java:27: error: unmappable character (0x80) for encoding US-ASCII Step #3 - "compile-libfuzzer-coverage-x86_64": *
  • Engine capability ceiling ??? what {@link Unpack5Window} can address: 64 GB since Step #3 - "compile-libfuzzer-coverage-x86_64": ^ Step #3 - "compile-libfuzzer-coverage-x86_64": /src/junrar/src/main/java/com/github/junrar/unpack/Unpack5.java:27: error: unmappable character (0x94) for encoding US-ASCII Step #3 - "compile-libfuzzer-coverage-x86_64": *
  • Engine capability ceiling ??? what {@link Unpack5Window} can address: 64 GB since Step #3 - "compile-libfuzzer-coverage-x86_64": ^ Step #3 - "compile-libfuzzer-coverage-x86_64": /src/junrar/src/main/java/com/github/junrar/unpack/Unpack5.java:30: error: unmappable character (0xE2) for encoding US-ASCII Step #3 - "compile-libfuzzer-coverage-x86_64": *
  • Caller resource limit ??? {@code ArchiveOptions.maxDictionarySize} (P0.8; default Step #3 - "compile-libfuzzer-coverage-x86_64": ^ Step #3 - "compile-libfuzzer-coverage-x86_64": /src/junrar/src/main/java/com/github/junrar/unpack/Unpack5.java:30: error: unmappable character (0x80) for encoding US-ASCII Step #3 - "compile-libfuzzer-coverage-x86_64": *
  • Caller resource limit ??? {@code ArchiveOptions.maxDictionarySize} (P0.8; default Step #3 - "compile-libfuzzer-coverage-x86_64": ^ Step #3 - "compile-libfuzzer-coverage-x86_64": /src/junrar/src/main/java/com/github/junrar/unpack/Unpack5.java:30: error: unmappable character (0x94) for encoding US-ASCII Step #3 - "compile-libfuzzer-coverage-x86_64": *
  • Caller resource limit ??? {@code ArchiveOptions.maxDictionarySize} (P0.8; default Step #3 - "compile-libfuzzer-coverage-x86_64": ^ Step #3 - "compile-libfuzzer-coverage-x86_64": /src/junrar/src/main/java/com/github/junrar/unpack/Unpack5.java:34: error: unmappable character (0xE2) for encoding US-ASCII Step #3 - "compile-libfuzzer-coverage-x86_64": *
  • Allocation policy ??? growth-capped and lazily segmented, never header-eager (see Step #3 - "compile-libfuzzer-coverage-x86_64": ^ Step #3 - "compile-libfuzzer-coverage-x86_64": /src/junrar/src/main/java/com/github/junrar/unpack/Unpack5.java:34: error: unmappable character (0x80) for encoding US-ASCII Step #3 - "compile-libfuzzer-coverage-x86_64": *
  • Allocation policy ??? growth-capped and lazily segmented, never header-eager (see Step #3 - "compile-libfuzzer-coverage-x86_64": ^ Step #3 - "compile-libfuzzer-coverage-x86_64": /src/junrar/src/main/java/com/github/junrar/unpack/Unpack5.java:34: error: unmappable character (0x94) for encoding US-ASCII Step #3 - "compile-libfuzzer-coverage-x86_64": *
  • Allocation policy ??? growth-capped and lazily segmented, never header-eager (see Step #3 - "compile-libfuzzer-coverage-x86_64": ^ Step #3 - "compile-libfuzzer-coverage-x86_64": /src/junrar/src/main/java/com/github/junrar/unpack/Unpack5.java:123: error: unmappable character (0xC2) for encoding US-ASCII Step #3 - "compile-libfuzzer-coverage-x86_64": // (manual ??4.3). Grown on demand, bounded by MAX_FILTER_BLOCK_SIZE via the ReadFilter clamp. Step #3 - "compile-libfuzzer-coverage-x86_64": ^ Step #3 - "compile-libfuzzer-coverage-x86_64": /src/junrar/src/main/java/com/github/junrar/unpack/Unpack5.java:123: error: unmappable character (0xA7) for encoding US-ASCII Step #3 - "compile-libfuzzer-coverage-x86_64": // (manual ??4.3). Grown on demand, bounded by MAX_FILTER_BLOCK_SIZE via the ReadFilter clamp. Step #3 - "compile-libfuzzer-coverage-x86_64": ^ Step #3 - "compile-libfuzzer-coverage-x86_64": /src/junrar/src/main/java/com/github/junrar/unpack/Unpack5.java:152: error: unmappable character (0xE2) for encoding US-ASCII Step #3 - "compile-libfuzzer-coverage-x86_64": * {@code false} for version 50 ??? including a RAR7 header that {@code FCI_RAR5_COMPAT} demoted. Step #3 - "compile-libfuzzer-coverage-x86_64": ^ Step #3 - "compile-libfuzzer-coverage-x86_64": /src/junrar/src/main/java/com/github/junrar/unpack/Unpack5.java:152: error: unmappable character (0x80) for encoding US-ASCII Step #3 - "compile-libfuzzer-coverage-x86_64": * {@code false} for version 50 ??? including a RAR7 header that {@code FCI_RAR5_COMPAT} demoted. Step #3 - "compile-libfuzzer-coverage-x86_64": ^ Step #3 - "compile-libfuzzer-coverage-x86_64": /src/junrar/src/main/java/com/github/junrar/unpack/Unpack5.java:152: error: unmappable character (0x94) for encoding US-ASCII Step #3 - "compile-libfuzzer-coverage-x86_64": * {@code false} for version 50 ??? including a RAR7 header that {@code FCI_RAR5_COMPAT} demoted. Step #3 - "compile-libfuzzer-coverage-x86_64": ^ Step #3 - "compile-libfuzzer-coverage-x86_64": /src/junrar/src/main/java/com/github/junrar/unpack/Unpack5.java:186: error: unmappable character (0xE2) for encoding US-ASCII Step #3 - "compile-libfuzzer-coverage-x86_64": // Caller resource limit ??? BEFORE any window allocation (the -mdx / CheckWinLimit analog). Step #3 - "compile-libfuzzer-coverage-x86_64": ^ Step #3 - "compile-libfuzzer-coverage-x86_64": /src/junrar/src/main/java/com/github/junrar/unpack/Unpack5.java:186: error: unmappable character (0x80) for encoding US-ASCII Step #3 - "compile-libfuzzer-coverage-x86_64": // Caller resource limit ??? BEFORE any window allocation (the -mdx / CheckWinLimit analog). Step #3 - "compile-libfuzzer-coverage-x86_64": ^ Step #3 - "compile-libfuzzer-coverage-x86_64": /src/junrar/src/main/java/com/github/junrar/unpack/Unpack5.java:186: error: unmappable character (0x94) for encoding US-ASCII Step #3 - "compile-libfuzzer-coverage-x86_64": // Caller resource limit ??? BEFORE any window allocation (the -mdx / CheckWinLimit analog). Step #3 - "compile-libfuzzer-coverage-x86_64": ^ Step #3 - "compile-libfuzzer-coverage-x86_64": /src/junrar/src/main/java/com/github/junrar/unpack/Unpack5.java:247: error: unmappable character (0xE2) for encoding US-ASCII Step #3 - "compile-libfuzzer-coverage-x86_64": * (test) mode ??? {@link #feed} supplied everything ??? and on a spent stream ({@code readCode==-1}, Step #3 - "compile-libfuzzer-coverage-x86_64": ^ Step #3 - "compile-libfuzzer-coverage-x86_64": /src/junrar/src/main/java/com/github/junrar/unpack/Unpack5.java:247: error: unmappable character (0x80) for encoding US-ASCII Step #3 - "compile-libfuzzer-coverage-x86_64": * (test) mode ??? {@link #feed} supplied everything ??? and on a spent stream ({@code readCode==-1}, Step #3 - "compile-libfuzzer-coverage-x86_64": ^ Step #3 - "compile-libfuzzer-coverage-x86_64": /src/junrar/src/main/java/com/github/junrar/unpack/Unpack5.java:247: error: unmappable character (0x94) for encoding US-ASCII Step #3 - "compile-libfuzzer-coverage-x86_64": * (test) mode ??? {@link #feed} supplied everything ??? and on a spent stream ({@code readCode==-1}, Step #3 - "compile-libfuzzer-coverage-x86_64": ^ Step #3 - "compile-libfuzzer-coverage-x86_64": /src/junrar/src/main/java/com/github/junrar/unpack/Unpack5.java:247: error: unmappable character (0xE2) for encoding US-ASCII Step #3 - "compile-libfuzzer-coverage-x86_64": * (test) mode ??? {@link #feed} supplied everything ??? and on a spent stream ({@code readCode==-1}, Step #3 - "compile-libfuzzer-coverage-x86_64": ^ Step #3 - "compile-libfuzzer-coverage-x86_64": /src/junrar/src/main/java/com/github/junrar/unpack/Unpack5.java:247: error: unmappable character (0x80) for encoding US-ASCII Step #3 - "compile-libfuzzer-coverage-x86_64": * (test) mode ??? {@link #feed} supplied everything ??? and on a spent stream ({@code readCode==-1}, Step #3 - "compile-libfuzzer-coverage-x86_64": ^ Step #3 - "compile-libfuzzer-coverage-x86_64": /src/junrar/src/main/java/com/github/junrar/unpack/Unpack5.java:247: error: unmappable character (0x94) for encoding US-ASCII Step #3 - "compile-libfuzzer-coverage-x86_64": * (test) mode ??? {@link #feed} supplied everything ??? and on a spent stream ({@code readCode==-1}, Step #3 - "compile-libfuzzer-coverage-x86_64": ^ Step #3 - "compile-libfuzzer-coverage-x86_64": /src/junrar/src/main/java/com/github/junrar/unpack/Unpack5.java:605: error: unmappable character (0xE2) for encoding US-ASCII Step #3 - "compile-libfuzzer-coverage-x86_64": // (8f437ab:unpack.cpp UnpInitData ??? InitFilters() runs even for solid continuations). Step #3 - "compile-libfuzzer-coverage-x86_64": ^ Step #3 - "compile-libfuzzer-coverage-x86_64": /src/junrar/src/main/java/com/github/junrar/unpack/Unpack5.java:605: error: unmappable character (0x80) for encoding US-ASCII Step #3 - "compile-libfuzzer-coverage-x86_64": // (8f437ab:unpack.cpp UnpInitData ??? InitFilters() runs even for solid continuations). Step #3 - "compile-libfuzzer-coverage-x86_64": ^ Step #3 - "compile-libfuzzer-coverage-x86_64": /src/junrar/src/main/java/com/github/junrar/unpack/Unpack5.java:605: error: unmappable character (0x94) for encoding US-ASCII Step #3 - "compile-libfuzzer-coverage-x86_64": // (8f437ab:unpack.cpp UnpInitData ??? InitFilters() runs even for solid continuations). Step #3 - "compile-libfuzzer-coverage-x86_64": ^ Step #3 - "compile-libfuzzer-coverage-x86_64": /src/junrar/src/main/java/com/github/junrar/unpack/Unpack5.java:628: error: unmappable character (0xE2) for encoding US-ASCII Step #3 - "compile-libfuzzer-coverage-x86_64": * are not powers of two and a {@code size - 1} mask wraps at the wrong position ??? it Step #3 - "compile-libfuzzer-coverage-x86_64": ^ Step #3 - "compile-libfuzzer-coverage-x86_64": /src/junrar/src/main/java/com/github/junrar/unpack/Unpack5.java:628: error: unmappable character (0x80) for encoding US-ASCII Step #3 - "compile-libfuzzer-coverage-x86_64": * are not powers of two and a {@code size - 1} mask wraps at the wrong position ??? it Step #3 - "compile-libfuzzer-coverage-x86_64": ^ Step #3 - "compile-libfuzzer-coverage-x86_64": /src/junrar/src/main/java/com/github/junrar/unpack/Unpack5.java:628: error: unmappable character (0x94) for encoding US-ASCII Step #3 - "compile-libfuzzer-coverage-x86_64": * are not powers of two and a {@code size - 1} mask wraps at the wrong position ??? it Step #3 - "compile-libfuzzer-coverage-x86_64": ^ Step #3 - "compile-libfuzzer-coverage-x86_64": /src/junrar/src/main/java/com/github/junrar/unpack/Unpack5.java:825: error: unmappable character (0xE2) for encoding US-ASCII Step #3 - "compile-libfuzzer-coverage-x86_64": * upstream's fast/slow paths bit-for-bit (both copy byte-by-byte forward, overlap-safe ??? the Step #3 - "compile-libfuzzer-coverage-x86_64": ^ Step #3 - "compile-libfuzzer-coverage-x86_64": /src/junrar/src/main/java/com/github/junrar/unpack/Unpack5.java:825: error: unmappable character (0x80) for encoding US-ASCII Step #3 - "compile-libfuzzer-coverage-x86_64": * upstream's fast/slow paths bit-for-bit (both copy byte-by-byte forward, overlap-safe ??? the Step #3 - "compile-libfuzzer-coverage-x86_64": ^ Step #3 - "compile-libfuzzer-coverage-x86_64": /src/junrar/src/main/java/com/github/junrar/unpack/Unpack5.java:825: error: unmappable character (0x94) for encoding US-ASCII Step #3 - "compile-libfuzzer-coverage-x86_64": * upstream's fast/slow paths bit-for-bit (both copy byte-by-byte forward, overlap-safe ??? the Step #3 - "compile-libfuzzer-coverage-x86_64": ^ Step #3 - "compile-libfuzzer-coverage-x86_64": /src/junrar/src/main/java/com/github/junrar/unpack/Unpack5.java:871: error: unmappable character (0xE2) for encoding US-ASCII Step #3 - "compile-libfuzzer-coverage-x86_64": * relative block start, block length, 3-bit type, and ??? for DELTA ??? the 5-bit channel count. Step #3 - "compile-libfuzzer-coverage-x86_64": ^ Step #3 - "compile-libfuzzer-coverage-x86_64": /src/junrar/src/main/java/com/github/junrar/unpack/Unpack5.java:871: error: unmappable character (0x80) for encoding US-ASCII Step #3 - "compile-libfuzzer-coverage-x86_64": * relative block start, block length, 3-bit type, and ??? for DELTA ??? the 5-bit channel count. Step #3 - "compile-libfuzzer-coverage-x86_64": ^ Step #3 - "compile-libfuzzer-coverage-x86_64": /src/junrar/src/main/java/com/github/junrar/unpack/Unpack5.java:871: error: unmappable character (0x94) for encoding US-ASCII Step #3 - "compile-libfuzzer-coverage-x86_64": * relative block start, block length, 3-bit type, and ??? for DELTA ??? the 5-bit channel count. Step #3 - "compile-libfuzzer-coverage-x86_64": ^ Step #3 - "compile-libfuzzer-coverage-x86_64": /src/junrar/src/main/java/com/github/junrar/unpack/Unpack5.java:871: error: unmappable character (0xE2) for encoding US-ASCII Step #3 - "compile-libfuzzer-coverage-x86_64": * relative block start, block length, 3-bit type, and ??? for DELTA ??? the 5-bit channel count. Step #3 - "compile-libfuzzer-coverage-x86_64": ^ Step #3 - "compile-libfuzzer-coverage-x86_64": /src/junrar/src/main/java/com/github/junrar/unpack/Unpack5.java:871: error: unmappable character (0x80) for encoding US-ASCII Step #3 - "compile-libfuzzer-coverage-x86_64": * relative block start, block length, 3-bit type, and ??? for DELTA ??? the 5-bit channel count. Step #3 - "compile-libfuzzer-coverage-x86_64": ^ Step #3 - "compile-libfuzzer-coverage-x86_64": /src/junrar/src/main/java/com/github/junrar/unpack/Unpack5.java:871: error: unmappable character (0x94) for encoding US-ASCII Step #3 - "compile-libfuzzer-coverage-x86_64": * relative block start, block length, 3-bit type, and ??? for DELTA ??? the 5-bit channel count. Step #3 - "compile-libfuzzer-coverage-x86_64": ^ Step #3 - "compile-libfuzzer-coverage-x86_64": /src/junrar/src/main/java/com/github/junrar/unpack/Unpack5.java:899: error: unmappable character (0xE2) for encoding US-ASCII Step #3 - "compile-libfuzzer-coverage-x86_64": * if still over the cap, drops the whole queue ({@link #initFilters()}) ??? a no-op, never an Step #3 - "compile-libfuzzer-coverage-x86_64": ^ Step #3 - "compile-libfuzzer-coverage-x86_64": /src/junrar/src/main/java/com/github/junrar/unpack/Unpack5.java:899: error: unmappable character (0x80) for encoding US-ASCII Step #3 - "compile-libfuzzer-coverage-x86_64": * if still over the cap, drops the whole queue ({@link #initFilters()}) ??? a no-op, never an Step #3 - "compile-libfuzzer-coverage-x86_64": ^ Step #3 - "compile-libfuzzer-coverage-x86_64": /src/junrar/src/main/java/com/github/junrar/unpack/Unpack5.java:899: error: unmappable character (0x94) for encoding US-ASCII Step #3 - "compile-libfuzzer-coverage-x86_64": * if still over the cap, drops the whole queue ({@link #initFilters()}) ??? a no-op, never an Step #3 - "compile-libfuzzer-coverage-x86_64": ^ Step #3 - "compile-libfuzzer-coverage-x86_64": /src/junrar/src/main/java/com/github/junrar/unpack/Unpack5.java:928: error: unmappable character (0xE2) for encoding US-ASCII Step #3 - "compile-libfuzzer-coverage-x86_64": * d861246:unpack50.cpp:427-485 is the authoritative 4-type census ??? DELTA/E8/E8E9/ARM only). Step #3 - "compile-libfuzzer-coverage-x86_64": ^ Step #3 - "compile-libfuzzer-coverage-x86_64": /src/junrar/src/main/java/com/github/junrar/unpack/Unpack5.java:928: error: unmappable character (0x80) for encoding US-ASCII Step #3 - "compile-libfuzzer-coverage-x86_64": * d861246:unpack50.cpp:427-485 is the authoritative 4-type census ??? DELTA/E8/E8E9/ARM only). Step #3 - "compile-libfuzzer-coverage-x86_64": ^ Step #3 - "compile-libfuzzer-coverage-x86_64": /src/junrar/src/main/java/com/github/junrar/unpack/Unpack5.java:928: error: unmappable character (0x94) for encoding US-ASCII Step #3 - "compile-libfuzzer-coverage-x86_64": * d861246:unpack50.cpp:427-485 is the authoritative 4-type census ??? DELTA/E8/E8E9/ARM only). Step #3 - "compile-libfuzzer-coverage-x86_64": ^ Step #3 - "compile-libfuzzer-coverage-x86_64": /src/junrar/src/main/java/com/github/junrar/unpack/Unpack5.java:1029: error: unmappable character (0xE2) for encoding US-ASCII Step #3 - "compile-libfuzzer-coverage-x86_64": * filtered output is written INSTEAD of them (the window itself is never modified ??? its bytes Step #3 - "compile-libfuzzer-coverage-x86_64": ^ Step #3 - "compile-libfuzzer-coverage-x86_64": /src/junrar/src/main/java/com/github/junrar/unpack/Unpack5.java:1029: error: unmappable character (0x80) for encoding US-ASCII Step #3 - "compile-libfuzzer-coverage-x86_64": * filtered output is written INSTEAD of them (the window itself is never modified ??? its bytes Step #3 - "compile-libfuzzer-coverage-x86_64": ^ Step #3 - "compile-libfuzzer-coverage-x86_64": /src/junrar/src/main/java/com/github/junrar/unpack/Unpack5.java:1029: error: unmappable character (0x94) for encoding US-ASCII Step #3 - "compile-libfuzzer-coverage-x86_64": * filtered output is written INSTEAD of them (the window itself is never modified ??? its bytes Step #3 - "compile-libfuzzer-coverage-x86_64": ^ Step #3 - "compile-libfuzzer-coverage-x86_64": /src/junrar/src/main/java/com/github/junrar/unpack/Unpack5.java:1069: error: unmappable character (0xC2) for encoding US-ASCII Step #3 - "compile-libfuzzer-coverage-x86_64": // Real copy-out, wrap split into two copies (manual ??4.3): the window Step #3 - "compile-libfuzzer-coverage-x86_64": ^ Step #3 - "compile-libfuzzer-coverage-x86_64": /src/junrar/src/main/java/com/github/junrar/unpack/Unpack5.java:1069: error: unmappable character (0xA7) for encoding US-ASCII Step #3 - "compile-libfuzzer-coverage-x86_64": // Real copy-out, wrap split into two copies (manual ??4.3): the window Step #3 - "compile-libfuzzer-coverage-x86_64": ^ Step #3 - "compile-libfuzzer-coverage-x86_64": /src/junrar/src/main/java/com/github/junrar/unpack/Unpack.java:119: error: unmappable character (0xC2) for encoding US-ASCII Step #3 - "compile-libfuzzer-coverage-x86_64": // (reports/unrar-delta-map.md ??3) Step #3 - "compile-libfuzzer-coverage-x86_64": ^ Step #3 - "compile-libfuzzer-coverage-x86_64": /src/junrar/src/main/java/com/github/junrar/unpack/Unpack.java:119: error: unmappable character (0xA7) for encoding US-ASCII Step #3 - "compile-libfuzzer-coverage-x86_64": // (reports/unrar-delta-map.md ??3) Step #3 - "compile-libfuzzer-coverage-x86_64": ^ Step #3 - "compile-libfuzzer-coverage-x86_64": /src/junrar/src/main/java/com/github/junrar/unpack/ComprDataIO.java:219: error: unmappable character (0xE2) for encoding US-ASCII Step #3 - "compile-libfuzzer-coverage-x86_64": * (never by constructing names here ??? manual ??4.12), re-parse it, and continue the entry Step #3 - "compile-libfuzzer-coverage-x86_64": ^ Step #3 - "compile-libfuzzer-coverage-x86_64": /src/junrar/src/main/java/com/github/junrar/unpack/ComprDataIO.java:219: error: unmappable character (0x80) for encoding US-ASCII Step #3 - "compile-libfuzzer-coverage-x86_64": * (never by constructing names here ??? manual ??4.12), re-parse it, and continue the entry Step #3 - "compile-libfuzzer-coverage-x86_64": ^ Step #3 - "compile-libfuzzer-coverage-x86_64": /src/junrar/src/main/java/com/github/junrar/unpack/ComprDataIO.java:219: error: unmappable character (0x94) for encoding US-ASCII Step #3 - "compile-libfuzzer-coverage-x86_64": * (never by constructing names here ??? manual ??4.12), re-parse it, and continue the entry Step #3 - "compile-libfuzzer-coverage-x86_64": ^ Step #3 - "compile-libfuzzer-coverage-x86_64": /src/junrar/src/main/java/com/github/junrar/unpack/ComprDataIO.java:219: error: unmappable character (0xC2) for encoding US-ASCII Step #3 - "compile-libfuzzer-coverage-x86_64": * (never by constructing names here ??? manual ??4.12), re-parse it, and continue the entry Step #3 - "compile-libfuzzer-coverage-x86_64": ^ Step #3 - "compile-libfuzzer-coverage-x86_64": /src/junrar/src/main/java/com/github/junrar/unpack/ComprDataIO.java:219: error: unmappable character (0xA7) for encoding US-ASCII Step #3 - "compile-libfuzzer-coverage-x86_64": * (never by constructing names here ??? manual ??4.12), re-parse it, and continue the entry Step #3 - "compile-libfuzzer-coverage-x86_64": ^ Step #3 - "compile-libfuzzer-coverage-x86_64": /src/junrar/src/main/java/com/github/junrar/unpack/ComprDataIO.java:222: error: unmappable character (0xE2) for encoding US-ASCII Step #3 - "compile-libfuzzer-coverage-x86_64": * the unpacked-side accumulators survive ??? the final part stores the end-to-end unpacked Step #3 - "compile-libfuzzer-coverage-x86_64": ^ Step #3 - "compile-libfuzzer-coverage-x86_64": /src/junrar/src/main/java/com/github/junrar/unpack/ComprDataIO.java:222: error: unmappable character (0x80) for encoding US-ASCII Step #3 - "compile-libfuzzer-coverage-x86_64": * the unpacked-side accumulators survive ??? the final part stores the end-to-end unpacked Step #3 - "compile-libfuzzer-coverage-x86_64": ^ Step #3 - "compile-libfuzzer-coverage-x86_64": /src/junrar/src/main/java/com/github/junrar/unpack/ComprDataIO.java:222: error: unmappable character (0x94) for encoding US-ASCII Step #3 - "compile-libfuzzer-coverage-x86_64": * the unpacked-side accumulators survive ??? the final part stores the end-to-end unpacked Step #3 - "compile-libfuzzer-coverage-x86_64": ^ Step #3 - "compile-libfuzzer-coverage-x86_64": /src/junrar/src/main/java/com/github/junrar/unpack/ComprDataIO.java:258: error: unmappable character (0xE2) for encoding US-ASCII Step #3 - "compile-libfuzzer-coverage-x86_64": * decrypting {@link RawDataIo} seam, while unrar hashes the raw pre-decryption stream ??? Step #3 - "compile-libfuzzer-coverage-x86_64": ^ Step #3 - "compile-libfuzzer-coverage-x86_64": /src/junrar/src/main/java/com/github/junrar/unpack/ComprDataIO.java:258: error: unmappable character (0x80) for encoding US-ASCII Step #3 - "compile-libfuzzer-coverage-x86_64": * decrypting {@link RawDataIo} seam, while unrar hashes the raw pre-decryption stream ??? Step #3 - "compile-libfuzzer-coverage-x86_64": ^ Step #3 - "compile-libfuzzer-coverage-x86_64": /src/junrar/src/main/java/com/github/junrar/unpack/ComprDataIO.java:258: error: unmappable character (0x94) for encoding US-ASCII Step #3 - "compile-libfuzzer-coverage-x86_64": * decrypting {@link RawDataIo} seam, while unrar hashes the raw pre-decryption stream ??? Step #3 - "compile-libfuzzer-coverage-x86_64": ^ Step #3 - "compile-libfuzzer-coverage-x86_64": /src/junrar/src/main/java/com/github/junrar/unpack/ComprDataIO.java:583: error: unmappable character (0xE2) for encoding US-ASCII Step #3 - "compile-libfuzzer-coverage-x86_64": * {@link DataHash} seam ??? converted to MAC space ({@code ConvertHashToMAC}) when the Step #3 - "compile-libfuzzer-coverage-x86_64": ^ Step #3 - "compile-libfuzzer-coverage-x86_64": /src/junrar/src/main/java/com/github/junrar/unpack/ComprDataIO.java:583: error: unmappable character (0x80) for encoding US-ASCII Step #3 - "compile-libfuzzer-coverage-x86_64": * {@link DataHash} seam ??? converted to MAC space ({@code ConvertHashToMAC}) when the Step #3 - "compile-libfuzzer-coverage-x86_64": ^ Step #3 - "compile-libfuzzer-coverage-x86_64": 100 errors Step #3 - "compile-libfuzzer-coverage-x86_64": Step #3 - "compile-libfuzzer-coverage-x86_64": [Incubating] Problems report is available at: file:///src/junrar/build/reports/problems/problems-report.html Step #3 - "compile-libfuzzer-coverage-x86_64": Step #3 - "compile-libfuzzer-coverage-x86_64": FAILURE: Build failed with an exception. Step #3 - "compile-libfuzzer-coverage-x86_64": Step #3 - "compile-libfuzzer-coverage-x86_64": * What went wrong: Step #3 - "compile-libfuzzer-coverage-x86_64": Execution failed for task ':javadoc' (registered by plugin class 'org.gradle.api.plugins.JavaPlugin'). Step #3 - "compile-libfuzzer-coverage-x86_64": > Javadoc generation failed. Generated Javadoc options file (useful for troubleshooting): '/src/junrar/build/tmp/javadoc/javadoc.options' Step #3 - "compile-libfuzzer-coverage-x86_64": Step #3 - "compile-libfuzzer-coverage-x86_64": * Try: Step #3 - "compile-libfuzzer-coverage-x86_64": > Run with --stacktrace option to get the stack trace. Step #3 - "compile-libfuzzer-coverage-x86_64": > Run with --info or --debug option to get more log output. Step #3 - "compile-libfuzzer-coverage-x86_64": > Run with --scan to get full insights from a Build Scan (powered by Develocity). Step #3 - "compile-libfuzzer-coverage-x86_64": > Get more help at https://help.gradle.org. Step #3 - "compile-libfuzzer-coverage-x86_64": Step #3 - "compile-libfuzzer-coverage-x86_64": Deprecated Gradle features were used in this build, making it incompatible with Gradle 10. Step #3 - "compile-libfuzzer-coverage-x86_64": Step #3 - "compile-libfuzzer-coverage-x86_64": You can use '--warning-mode all' to show the individual deprecation warnings and determine if they come from your own scripts or plugins. Step #3 - "compile-libfuzzer-coverage-x86_64": Step #3 - "compile-libfuzzer-coverage-x86_64": For more on this, please refer to https://docs.gradle.org/9.7.1/userguide/command_line_interface.html#sec:command_line_warnings in the Gradle documentation. Step #3 - "compile-libfuzzer-coverage-x86_64": Step #3 - "compile-libfuzzer-coverage-x86_64": BUILD FAILED in 35s Step #3 - "compile-libfuzzer-coverage-x86_64": 3 actionable tasks: 3 executed Step #3 - "compile-libfuzzer-coverage-x86_64":  Step #3 - "compile-libfuzzer-coverage-x86_64":  Step #3 - "compile-libfuzzer-coverage-x86_64":  Step #3 - "compile-libfuzzer-coverage-x86_64":  Step #3 - "compile-libfuzzer-coverage-x86_64":  Step #3 - "compile-libfuzzer-coverage-x86_64": โ”‚ยทยทยทยทยทยทยทยทยทยทยทยทยทยทยทโ”‚ 0% WAITING> IDLE> IDLE> IDLE> IDLE[?12l[?25h********************************************************************************\nFailed to build.\nTo reproduce, run:\npython infra/helper.py build_image junrar\npython infra/helper.py build_fuzzers --sanitizer coverage --engine libfuzzer --architecture x86_64 junrar\n******************************************************************************** Finished Step #3 - "compile-libfuzzer-coverage-x86_64" ERROR ERROR: build step 3 "gcr.io/cloud-builders/docker" failed: step exited with non-zero status: 1