starting build "5e943fd5-fa4f-4f01-8ed6-3ad1edb5364e"
FETCHSOURCE
BUILD
Starting Step #0
Step #0: Pulling image: gcr.io/oss-fuzz-base/base-runner
Step #0: Using default tag: latest
Step #0: latest: Pulling from oss-fuzz-base/base-runner
Step #0: b549f31133a9: Pulling fs layer
Step #0: ba55ba96b8bd: Pulling fs layer
Step #0: a818626f80f7: Pulling fs layer
Step #0: 7b23d78f86ee: Pulling fs layer
Step #0: b284694d9b9a: Pulling fs layer
Step #0: 05bb11104daf: Pulling fs layer
Step #0: 38fb054979e9: Pulling fs layer
Step #0: 1b605f796c33: Pulling fs layer
Step #0: 87b00ecabcec: Pulling fs layer
Step #0: 34ff1800f4bc: Pulling fs layer
Step #0: 2d95903e79c7: Pulling fs layer
Step #0: 1876a74c5e86: Pulling fs layer
Step #0: 9fe222fe3b7b: Pulling fs layer
Step #0: b283710435d3: Pulling fs layer
Step #0: 7b23d78f86ee: Waiting
Step #0: b284694d9b9a: Waiting
Step #0: 7e16469c796f: Pulling fs layer
Step #0: 05bb11104daf: Waiting
Step #0: c0e42ff0535d: Pulling fs layer
Step #0: 0a8d02ccb880: Pulling fs layer
Step #0: 726113021b55: Pulling fs layer
Step #0: 1ebf7bb23e51: Pulling fs layer
Step #0: 5751e97fd677: Pulling fs layer
Step #0: 38fb054979e9: Waiting
Step #0: 921a36366d78: Pulling fs layer
Step #0: cae9e01b2582: Pulling fs layer
Step #0: 1b605f796c33: Waiting
Step #0: 87b00ecabcec: Waiting
Step #0: 1517a9ff1b89: Pulling fs layer
Step #0: 1e5af94d5c28: Pulling fs layer
Step #0: 34ff1800f4bc: Waiting
Step #0: 38d5208102ba: Pulling fs layer
Step #0: 2b7e8f4b240b: Pulling fs layer
Step #0: 2d95903e79c7: Waiting
Step #0: 1876a74c5e86: Waiting
Step #0: 9fe222fe3b7b: Waiting
Step #0: b283710435d3: Waiting
Step #0: 38d5208102ba: Waiting
Step #0: 921a36366d78: Waiting
Step #0: 7e16469c796f: Waiting
Step #0: 2b7e8f4b240b: Waiting
Step #0: cae9e01b2582: Waiting
Step #0: c0e42ff0535d: Waiting
Step #0: 1517a9ff1b89: Waiting
Step #0: 1e5af94d5c28: Waiting
Step #0: 0a8d02ccb880: Waiting
Step #0: 5751e97fd677: Waiting
Step #0: 726113021b55: Waiting
Step #0: 1ebf7bb23e51: Waiting
Step #0: a818626f80f7: Verifying Checksum
Step #0: a818626f80f7: Download complete
Step #0: 7b23d78f86ee: Verifying Checksum
Step #0: 7b23d78f86ee: Download complete
Step #0: b549f31133a9: Verifying Checksum
Step #0: b549f31133a9: Download complete
Step #0: 05bb11104daf: Download complete
Step #0: b284694d9b9a: Verifying Checksum
Step #0: b284694d9b9a: Download complete
Step #0: 1b605f796c33: Verifying Checksum
Step #0: 1b605f796c33: Download complete
Step #0: 38fb054979e9: Verifying Checksum
Step #0: 38fb054979e9: Download complete
Step #0: 34ff1800f4bc: Download complete
Step #0: ba55ba96b8bd: Verifying Checksum
Step #0: ba55ba96b8bd: Download complete
Step #0: 2d95903e79c7: Verifying Checksum
Step #0: 2d95903e79c7: Download complete
Step #0: 1876a74c5e86: Download complete
Step #0: 87b00ecabcec: Verifying Checksum
Step #0: 87b00ecabcec: Download complete
Step #0: 7e16469c796f: Verifying Checksum
Step #0: 7e16469c796f: Download complete
Step #0: b283710435d3: Verifying Checksum
Step #0: b283710435d3: Download complete
Step #0: b549f31133a9: Pull complete
Step #0: c0e42ff0535d: Verifying Checksum
Step #0: c0e42ff0535d: Download complete
Step #0: 726113021b55: Verifying Checksum
Step #0: 726113021b55: Download complete
Step #0: 9fe222fe3b7b: Verifying Checksum
Step #0: 9fe222fe3b7b: Download complete
Step #0: 0a8d02ccb880: Verifying Checksum
Step #0: 0a8d02ccb880: Download complete
Step #0: 5751e97fd677: Verifying Checksum
Step #0: 5751e97fd677: Download complete
Step #0: 921a36366d78: Verifying Checksum
Step #0: 921a36366d78: Download complete
Step #0: cae9e01b2582: Verifying Checksum
Step #0: cae9e01b2582: Download complete
Step #0: 1517a9ff1b89: Verifying Checksum
Step #0: 1517a9ff1b89: Download complete
Step #0: 1e5af94d5c28: Verifying Checksum
Step #0: 1e5af94d5c28: Download complete
Step #0: 38d5208102ba: Verifying Checksum
Step #0: 38d5208102ba: Download complete
Step #0: 2b7e8f4b240b: Download complete
Step #0: 1ebf7bb23e51: Verifying Checksum
Step #0: 1ebf7bb23e51: Download complete
Step #0: ba55ba96b8bd: Pull complete
Step #0: a818626f80f7: Pull complete
Step #0: 7b23d78f86ee: Pull complete
Step #0: b284694d9b9a: Pull complete
Step #0: 05bb11104daf: Pull complete
Step #0: 38fb054979e9: Pull complete
Step #0: 1b605f796c33: Pull complete
Step #0: 87b00ecabcec: Pull complete
Step #0: 34ff1800f4bc: Pull complete
Step #0: 2d95903e79c7: Pull complete
Step #0: 1876a74c5e86: Pull complete
Step #0: 9fe222fe3b7b: Pull complete
Step #0: b283710435d3: Pull complete
Step #0: 7e16469c796f: Pull complete
Step #0: c0e42ff0535d: Pull complete
Step #0: 0a8d02ccb880: Pull complete
Step #0: 726113021b55: Pull complete
Step #0: 1ebf7bb23e51: Pull complete
Step #0: 5751e97fd677: Pull complete
Step #0: 921a36366d78: Pull complete
Step #0: cae9e01b2582: Pull complete
Step #0: 1517a9ff1b89: Pull complete
Step #0: 1e5af94d5c28: Pull complete
Step #0: 38d5208102ba: Pull complete
Step #0: 2b7e8f4b240b: Pull complete
Step #0: Digest: sha256:47421060a7b985a7375e5e07b60d8a5fc629dd53bea770b879055c3e91cfcad8
Step #0: Status: Downloaded newer image for gcr.io/oss-fuzz-base/base-runner:latest
Step #0: gcr.io/oss-fuzz-base/base-runner:latest
Finished Step #0
Starting Step #1
Step #1: Already have image (with digest): gcr.io/cloud-builders/gsutil
Step #1: CommandException: No URLs matched: gs://oss-fuzz-coverage/libucl/textcov_reports/20250810/*
Step #1: CommandException: 1 file/object could not be transferred.
Finished Step #1
ERROR: step exited with non-zero status: 1
Starting Step #2
Step #2: Already have image (with digest): gcr.io/oss-fuzz-base/base-runner
Step #2: total 0
Finished Step #2
Starting Step #3
Step #3: Already have image (with digest): gcr.io/cloud-builders/git
Step #3: Cloning into 'oss-fuzz'...
Finished Step #3
Starting Step #4 - "build-a326c393-a262-48d1-a102-59e881b9d51b"
Step #4 - "build-a326c393-a262-48d1-a102-59e881b9d51b": Already have image (with digest): gcr.io/cloud-builders/docker
Step #4 - "build-a326c393-a262-48d1-a102-59e881b9d51b": Sending build context to Docker daemon 6.656kB
Step #4 - "build-a326c393-a262-48d1-a102-59e881b9d51b": Step 1/6 : FROM gcr.io/oss-fuzz-base/base-builder
Step #4 - "build-a326c393-a262-48d1-a102-59e881b9d51b": latest: Pulling from oss-fuzz-base/base-builder
Step #4 - "build-a326c393-a262-48d1-a102-59e881b9d51b": b549f31133a9: Already exists
Step #4 - "build-a326c393-a262-48d1-a102-59e881b9d51b": ba55ba96b8bd: Already exists
Step #4 - "build-a326c393-a262-48d1-a102-59e881b9d51b": a818626f80f7: Already exists
Step #4 - "build-a326c393-a262-48d1-a102-59e881b9d51b": adddfb19fb7f: Pulling fs layer
Step #4 - "build-a326c393-a262-48d1-a102-59e881b9d51b": 46ac04e949b9: Pulling fs layer
Step #4 - "build-a326c393-a262-48d1-a102-59e881b9d51b": 1f030a2544b3: Pulling fs layer
Step #4 - "build-a326c393-a262-48d1-a102-59e881b9d51b": b8b45dd8feaf: Pulling fs layer
Step #4 - "build-a326c393-a262-48d1-a102-59e881b9d51b": 5286c37c1350: Pulling fs layer
Step #4 - "build-a326c393-a262-48d1-a102-59e881b9d51b": 80698809cbc9: Pulling fs layer
Step #4 - "build-a326c393-a262-48d1-a102-59e881b9d51b": 0cc34922d605: Pulling fs layer
Step #4 - "build-a326c393-a262-48d1-a102-59e881b9d51b": 9160991258df: Pulling fs layer
Step #4 - "build-a326c393-a262-48d1-a102-59e881b9d51b": 0eabc581572f: Pulling fs layer
Step #4 - "build-a326c393-a262-48d1-a102-59e881b9d51b": 75246140bf05: Pulling fs layer
Step #4 - "build-a326c393-a262-48d1-a102-59e881b9d51b": 5027b2655612: Pulling fs layer
Step #4 - "build-a326c393-a262-48d1-a102-59e881b9d51b": 20fde22fd174: Pulling fs layer
Step #4 - "build-a326c393-a262-48d1-a102-59e881b9d51b": f1fdec200c64: Pulling fs layer
Step #4 - "build-a326c393-a262-48d1-a102-59e881b9d51b": 07f962afa698: Pulling fs layer
Step #4 - "build-a326c393-a262-48d1-a102-59e881b9d51b": 8b22cbe37b29: Pulling fs layer
Step #4 - "build-a326c393-a262-48d1-a102-59e881b9d51b": cee2c3f5ef74: Pulling fs layer
Step #4 - "build-a326c393-a262-48d1-a102-59e881b9d51b": 33101c776cff: Pulling fs layer
Step #4 - "build-a326c393-a262-48d1-a102-59e881b9d51b": ed060b31ce38: Pulling fs layer
Step #4 - "build-a326c393-a262-48d1-a102-59e881b9d51b": b3832ceea9f7: Pulling fs layer
Step #4 - "build-a326c393-a262-48d1-a102-59e881b9d51b": fd37a3fd5991: Pulling fs layer
Step #4 - "build-a326c393-a262-48d1-a102-59e881b9d51b": 446cbff305d8: Pulling fs layer
Step #4 - "build-a326c393-a262-48d1-a102-59e881b9d51b": cc5a5584cf8e: Pulling fs layer
Step #4 - "build-a326c393-a262-48d1-a102-59e881b9d51b": d723dd9ae3f9: Pulling fs layer
Step #4 - "build-a326c393-a262-48d1-a102-59e881b9d51b": 45ec608030bc: Pulling fs layer
Step #4 - "build-a326c393-a262-48d1-a102-59e881b9d51b": 6305af7b926c: Pulling fs layer
Step #4 - "build-a326c393-a262-48d1-a102-59e881b9d51b": 83a409becaa4: Pulling fs layer
Step #4 - "build-a326c393-a262-48d1-a102-59e881b9d51b": 874969c78a2d: Pulling fs layer
Step #4 - "build-a326c393-a262-48d1-a102-59e881b9d51b": 900e2d9ee827: Pulling fs layer
Step #4 - "build-a326c393-a262-48d1-a102-59e881b9d51b": 391f496bd6c5: Pulling fs layer
Step #4 - "build-a326c393-a262-48d1-a102-59e881b9d51b": 3a9213fd0cbd: Pulling fs layer
Step #4 - "build-a326c393-a262-48d1-a102-59e881b9d51b": 3625ff551591: Pulling fs layer
Step #4 - "build-a326c393-a262-48d1-a102-59e881b9d51b": b8b45dd8feaf: Waiting
Step #4 - "build-a326c393-a262-48d1-a102-59e881b9d51b": fd332961cd5a: Pulling fs layer
Step #4 - "build-a326c393-a262-48d1-a102-59e881b9d51b": 0614c41c9680: Pulling fs layer
Step #4 - "build-a326c393-a262-48d1-a102-59e881b9d51b": f084ae8f7fe3: Pulling fs layer
Step #4 - "build-a326c393-a262-48d1-a102-59e881b9d51b": 5286c37c1350: Waiting
Step #4 - "build-a326c393-a262-48d1-a102-59e881b9d51b": 13dc1503d7f1: Pulling fs layer
Step #4 - "build-a326c393-a262-48d1-a102-59e881b9d51b": 0cc34922d605: Waiting
Step #4 - "build-a326c393-a262-48d1-a102-59e881b9d51b": 80698809cbc9: Waiting
Step #4 - "build-a326c393-a262-48d1-a102-59e881b9d51b": 9160991258df: Waiting
Step #4 - "build-a326c393-a262-48d1-a102-59e881b9d51b": 0eabc581572f: Waiting
Step #4 - "build-a326c393-a262-48d1-a102-59e881b9d51b": d723dd9ae3f9: Waiting
Step #4 - "build-a326c393-a262-48d1-a102-59e881b9d51b": 75246140bf05: Waiting
Step #4 - "build-a326c393-a262-48d1-a102-59e881b9d51b": 45ec608030bc: Waiting
Step #4 - "build-a326c393-a262-48d1-a102-59e881b9d51b": 20fde22fd174: Waiting
Step #4 - "build-a326c393-a262-48d1-a102-59e881b9d51b": 6305af7b926c: Waiting
Step #4 - "build-a326c393-a262-48d1-a102-59e881b9d51b": 5027b2655612: Waiting
Step #4 - "build-a326c393-a262-48d1-a102-59e881b9d51b": 83a409becaa4: Waiting
Step #4 - "build-a326c393-a262-48d1-a102-59e881b9d51b": 07f962afa698: Waiting
Step #4 - "build-a326c393-a262-48d1-a102-59e881b9d51b": 874969c78a2d: Waiting
Step #4 - "build-a326c393-a262-48d1-a102-59e881b9d51b": 900e2d9ee827: Waiting
Step #4 - "build-a326c393-a262-48d1-a102-59e881b9d51b": fd37a3fd5991: Waiting
Step #4 - "build-a326c393-a262-48d1-a102-59e881b9d51b": ed060b31ce38: Waiting
Step #4 - "build-a326c393-a262-48d1-a102-59e881b9d51b": b3832ceea9f7: Waiting
Step #4 - "build-a326c393-a262-48d1-a102-59e881b9d51b": 13dc1503d7f1: Waiting
Step #4 - "build-a326c393-a262-48d1-a102-59e881b9d51b": 0614c41c9680: Waiting
Step #4 - "build-a326c393-a262-48d1-a102-59e881b9d51b": cee2c3f5ef74: Waiting
Step #4 - "build-a326c393-a262-48d1-a102-59e881b9d51b": fd332961cd5a: Waiting
Step #4 - "build-a326c393-a262-48d1-a102-59e881b9d51b": 3a9213fd0cbd: Waiting
Step #4 - "build-a326c393-a262-48d1-a102-59e881b9d51b": 391f496bd6c5: Waiting
Step #4 - "build-a326c393-a262-48d1-a102-59e881b9d51b": 1f030a2544b3: Download complete
Step #4 - "build-a326c393-a262-48d1-a102-59e881b9d51b": 46ac04e949b9: Verifying Checksum
Step #4 - "build-a326c393-a262-48d1-a102-59e881b9d51b": 46ac04e949b9: Download complete
Step #4 - "build-a326c393-a262-48d1-a102-59e881b9d51b": 5286c37c1350: Download complete
Step #4 - "build-a326c393-a262-48d1-a102-59e881b9d51b": 80698809cbc9: Verifying Checksum
Step #4 - "build-a326c393-a262-48d1-a102-59e881b9d51b": 80698809cbc9: Download complete
Step #4 - "build-a326c393-a262-48d1-a102-59e881b9d51b": adddfb19fb7f: Verifying Checksum
Step #4 - "build-a326c393-a262-48d1-a102-59e881b9d51b": adddfb19fb7f: Download complete
Step #4 - "build-a326c393-a262-48d1-a102-59e881b9d51b": 9160991258df: Verifying Checksum
Step #4 - "build-a326c393-a262-48d1-a102-59e881b9d51b": 9160991258df: Download complete
Step #4 - "build-a326c393-a262-48d1-a102-59e881b9d51b": 0eabc581572f: Verifying Checksum
Step #4 - "build-a326c393-a262-48d1-a102-59e881b9d51b": 0eabc581572f: Download complete
Step #4 - "build-a326c393-a262-48d1-a102-59e881b9d51b": 75246140bf05: Verifying Checksum
Step #4 - "build-a326c393-a262-48d1-a102-59e881b9d51b": 75246140bf05: Download complete
Step #4 - "build-a326c393-a262-48d1-a102-59e881b9d51b": 5027b2655612: Verifying Checksum
Step #4 - "build-a326c393-a262-48d1-a102-59e881b9d51b": 5027b2655612: Download complete
Step #4 - "build-a326c393-a262-48d1-a102-59e881b9d51b": adddfb19fb7f: Pull complete
Step #4 - "build-a326c393-a262-48d1-a102-59e881b9d51b": 20fde22fd174: Verifying Checksum
Step #4 - "build-a326c393-a262-48d1-a102-59e881b9d51b": 20fde22fd174: Download complete
Step #4 - "build-a326c393-a262-48d1-a102-59e881b9d51b": f1fdec200c64: Verifying Checksum
Step #4 - "build-a326c393-a262-48d1-a102-59e881b9d51b": f1fdec200c64: Download complete
Step #4 - "build-a326c393-a262-48d1-a102-59e881b9d51b": 46ac04e949b9: Pull complete
Step #4 - "build-a326c393-a262-48d1-a102-59e881b9d51b": 1f030a2544b3: Pull complete
Step #4 - "build-a326c393-a262-48d1-a102-59e881b9d51b": 07f962afa698: Verifying Checksum
Step #4 - "build-a326c393-a262-48d1-a102-59e881b9d51b": 07f962afa698: Download complete
Step #4 - "build-a326c393-a262-48d1-a102-59e881b9d51b": 8b22cbe37b29: Verifying Checksum
Step #4 - "build-a326c393-a262-48d1-a102-59e881b9d51b": 8b22cbe37b29: Download complete
Step #4 - "build-a326c393-a262-48d1-a102-59e881b9d51b": cee2c3f5ef74: Verifying Checksum
Step #4 - "build-a326c393-a262-48d1-a102-59e881b9d51b": cee2c3f5ef74: Download complete
Step #4 - "build-a326c393-a262-48d1-a102-59e881b9d51b": b8b45dd8feaf: Verifying Checksum
Step #4 - "build-a326c393-a262-48d1-a102-59e881b9d51b": b8b45dd8feaf: Download complete
Step #4 - "build-a326c393-a262-48d1-a102-59e881b9d51b": ed060b31ce38: Verifying Checksum
Step #4 - "build-a326c393-a262-48d1-a102-59e881b9d51b": ed060b31ce38: Download complete
Step #4 - "build-a326c393-a262-48d1-a102-59e881b9d51b": 33101c776cff: Verifying Checksum
Step #4 - "build-a326c393-a262-48d1-a102-59e881b9d51b": 33101c776cff: Download complete
Step #4 - "build-a326c393-a262-48d1-a102-59e881b9d51b": b3832ceea9f7: Verifying Checksum
Step #4 - "build-a326c393-a262-48d1-a102-59e881b9d51b": b3832ceea9f7: Download complete
Step #4 - "build-a326c393-a262-48d1-a102-59e881b9d51b": fd37a3fd5991: Verifying Checksum
Step #4 - "build-a326c393-a262-48d1-a102-59e881b9d51b": fd37a3fd5991: Download complete
Step #4 - "build-a326c393-a262-48d1-a102-59e881b9d51b": 446cbff305d8: Verifying Checksum
Step #4 - "build-a326c393-a262-48d1-a102-59e881b9d51b": 446cbff305d8: Download complete
Step #4 - "build-a326c393-a262-48d1-a102-59e881b9d51b": cc5a5584cf8e: Verifying Checksum
Step #4 - "build-a326c393-a262-48d1-a102-59e881b9d51b": cc5a5584cf8e: Download complete
Step #4 - "build-a326c393-a262-48d1-a102-59e881b9d51b": d723dd9ae3f9: Download complete
Step #4 - "build-a326c393-a262-48d1-a102-59e881b9d51b": 45ec608030bc: Verifying Checksum
Step #4 - "build-a326c393-a262-48d1-a102-59e881b9d51b": 45ec608030bc: Download complete
Step #4 - "build-a326c393-a262-48d1-a102-59e881b9d51b": 6305af7b926c: Verifying Checksum
Step #4 - "build-a326c393-a262-48d1-a102-59e881b9d51b": 6305af7b926c: Download complete
Step #4 - "build-a326c393-a262-48d1-a102-59e881b9d51b": 83a409becaa4: Verifying Checksum
Step #4 - "build-a326c393-a262-48d1-a102-59e881b9d51b": 83a409becaa4: Download complete
Step #4 - "build-a326c393-a262-48d1-a102-59e881b9d51b": 874969c78a2d: Verifying Checksum
Step #4 - "build-a326c393-a262-48d1-a102-59e881b9d51b": 874969c78a2d: Download complete
Step #4 - "build-a326c393-a262-48d1-a102-59e881b9d51b": 900e2d9ee827: Verifying Checksum
Step #4 - "build-a326c393-a262-48d1-a102-59e881b9d51b": 900e2d9ee827: Download complete
Step #4 - "build-a326c393-a262-48d1-a102-59e881b9d51b": 391f496bd6c5: Verifying Checksum
Step #4 - "build-a326c393-a262-48d1-a102-59e881b9d51b": 391f496bd6c5: Download complete
Step #4 - "build-a326c393-a262-48d1-a102-59e881b9d51b": 3a9213fd0cbd: Download complete
Step #4 - "build-a326c393-a262-48d1-a102-59e881b9d51b": 3625ff551591: Verifying Checksum
Step #4 - "build-a326c393-a262-48d1-a102-59e881b9d51b": 3625ff551591: Download complete
Step #4 - "build-a326c393-a262-48d1-a102-59e881b9d51b": fd332961cd5a: Verifying Checksum
Step #4 - "build-a326c393-a262-48d1-a102-59e881b9d51b": fd332961cd5a: Download complete
Step #4 - "build-a326c393-a262-48d1-a102-59e881b9d51b": 0614c41c9680: Verifying Checksum
Step #4 - "build-a326c393-a262-48d1-a102-59e881b9d51b": 0614c41c9680: Download complete
Step #4 - "build-a326c393-a262-48d1-a102-59e881b9d51b": 13dc1503d7f1: Verifying Checksum
Step #4 - "build-a326c393-a262-48d1-a102-59e881b9d51b": 13dc1503d7f1: Download complete
Step #4 - "build-a326c393-a262-48d1-a102-59e881b9d51b": f084ae8f7fe3: Verifying Checksum
Step #4 - "build-a326c393-a262-48d1-a102-59e881b9d51b": f084ae8f7fe3: Download complete
Step #4 - "build-a326c393-a262-48d1-a102-59e881b9d51b": 0cc34922d605: Verifying Checksum
Step #4 - "build-a326c393-a262-48d1-a102-59e881b9d51b": 0cc34922d605: Download complete
Step #4 - "build-a326c393-a262-48d1-a102-59e881b9d51b": b8b45dd8feaf: Pull complete
Step #4 - "build-a326c393-a262-48d1-a102-59e881b9d51b": 5286c37c1350: Pull complete
Step #4 - "build-a326c393-a262-48d1-a102-59e881b9d51b": 80698809cbc9: Pull complete
Step #4 - "build-a326c393-a262-48d1-a102-59e881b9d51b": 0cc34922d605: Pull complete
Step #4 - "build-a326c393-a262-48d1-a102-59e881b9d51b": 9160991258df: Pull complete
Step #4 - "build-a326c393-a262-48d1-a102-59e881b9d51b": 0eabc581572f: Pull complete
Step #4 - "build-a326c393-a262-48d1-a102-59e881b9d51b": 75246140bf05: Pull complete
Step #4 - "build-a326c393-a262-48d1-a102-59e881b9d51b": 5027b2655612: Pull complete
Step #4 - "build-a326c393-a262-48d1-a102-59e881b9d51b": 20fde22fd174: Pull complete
Step #4 - "build-a326c393-a262-48d1-a102-59e881b9d51b": f1fdec200c64: Pull complete
Step #4 - "build-a326c393-a262-48d1-a102-59e881b9d51b": 07f962afa698: Pull complete
Step #4 - "build-a326c393-a262-48d1-a102-59e881b9d51b": 8b22cbe37b29: Pull complete
Step #4 - "build-a326c393-a262-48d1-a102-59e881b9d51b": cee2c3f5ef74: Pull complete
Step #4 - "build-a326c393-a262-48d1-a102-59e881b9d51b": 33101c776cff: Pull complete
Step #4 - "build-a326c393-a262-48d1-a102-59e881b9d51b": ed060b31ce38: Pull complete
Step #4 - "build-a326c393-a262-48d1-a102-59e881b9d51b": b3832ceea9f7: Pull complete
Step #4 - "build-a326c393-a262-48d1-a102-59e881b9d51b": fd37a3fd5991: Pull complete
Step #4 - "build-a326c393-a262-48d1-a102-59e881b9d51b": 446cbff305d8: Pull complete
Step #4 - "build-a326c393-a262-48d1-a102-59e881b9d51b": cc5a5584cf8e: Pull complete
Step #4 - "build-a326c393-a262-48d1-a102-59e881b9d51b": d723dd9ae3f9: Pull complete
Step #4 - "build-a326c393-a262-48d1-a102-59e881b9d51b": 45ec608030bc: Pull complete
Step #4 - "build-a326c393-a262-48d1-a102-59e881b9d51b": 6305af7b926c: Pull complete
Step #4 - "build-a326c393-a262-48d1-a102-59e881b9d51b": 83a409becaa4: Pull complete
Step #4 - "build-a326c393-a262-48d1-a102-59e881b9d51b": 874969c78a2d: Pull complete
Step #4 - "build-a326c393-a262-48d1-a102-59e881b9d51b": 900e2d9ee827: Pull complete
Step #4 - "build-a326c393-a262-48d1-a102-59e881b9d51b": 391f496bd6c5: Pull complete
Step #4 - "build-a326c393-a262-48d1-a102-59e881b9d51b": 3a9213fd0cbd: Pull complete
Step #4 - "build-a326c393-a262-48d1-a102-59e881b9d51b": 3625ff551591: Pull complete
Step #4 - "build-a326c393-a262-48d1-a102-59e881b9d51b": fd332961cd5a: Pull complete
Step #4 - "build-a326c393-a262-48d1-a102-59e881b9d51b": 0614c41c9680: Pull complete
Step #4 - "build-a326c393-a262-48d1-a102-59e881b9d51b": f084ae8f7fe3: Pull complete
Step #4 - "build-a326c393-a262-48d1-a102-59e881b9d51b": 13dc1503d7f1: Pull complete
Step #4 - "build-a326c393-a262-48d1-a102-59e881b9d51b": Digest: sha256:4a5429ae6f8295cb00f0708a92891927b72cbdcf947680e8e97634206e8c6fbd
Step #4 - "build-a326c393-a262-48d1-a102-59e881b9d51b": Status: Downloaded newer image for gcr.io/oss-fuzz-base/base-builder:latest
Step #4 - "build-a326c393-a262-48d1-a102-59e881b9d51b": ---> a6eb66d139b1
Step #4 - "build-a326c393-a262-48d1-a102-59e881b9d51b": Step 2/6 : RUN apt-get update && apt-get install -y make cmake autoconf pkg-config libtool
Step #4 - "build-a326c393-a262-48d1-a102-59e881b9d51b": ---> Running in 5686a574ee3b
Step #4 - "build-a326c393-a262-48d1-a102-59e881b9d51b": Hit:1 http://archive.ubuntu.com/ubuntu focal InRelease
Step #4 - "build-a326c393-a262-48d1-a102-59e881b9d51b": Get:2 http://archive.ubuntu.com/ubuntu focal-updates InRelease [128 kB]
Step #4 - "build-a326c393-a262-48d1-a102-59e881b9d51b": Get:3 http://security.ubuntu.com/ubuntu focal-security InRelease [128 kB]
Step #4 - "build-a326c393-a262-48d1-a102-59e881b9d51b": Get:4 http://archive.ubuntu.com/ubuntu focal-backports InRelease [128 kB]
Step #4 - "build-a326c393-a262-48d1-a102-59e881b9d51b": Fetched 383 kB in 1s (530 kB/s)
Step #4 - "build-a326c393-a262-48d1-a102-59e881b9d51b": Reading package lists...
Step #4 - "build-a326c393-a262-48d1-a102-59e881b9d51b": Reading package lists...
Step #4 - "build-a326c393-a262-48d1-a102-59e881b9d51b": Building dependency tree...
Step #4 - "build-a326c393-a262-48d1-a102-59e881b9d51b": Reading state information...
Step #4 - "build-a326c393-a262-48d1-a102-59e881b9d51b": make is already the newest version (4.2.1-1.2).
Step #4 - "build-a326c393-a262-48d1-a102-59e881b9d51b": make set to manually installed.
Step #4 - "build-a326c393-a262-48d1-a102-59e881b9d51b": The following additional packages will be installed:
Step #4 - "build-a326c393-a262-48d1-a102-59e881b9d51b": automake cmake-data file libarchive13 libglib2.0-0 libglib2.0-data libicu66
Step #4 - "build-a326c393-a262-48d1-a102-59e881b9d51b": libjsoncpp1 libltdl-dev libltdl7 libmagic-mgc libmagic1 librhash0 libuv1
Step #4 - "build-a326c393-a262-48d1-a102-59e881b9d51b": libxml2 shared-mime-info xdg-user-dirs
Step #4 - "build-a326c393-a262-48d1-a102-59e881b9d51b": Suggested packages:
Step #4 - "build-a326c393-a262-48d1-a102-59e881b9d51b": autoconf-archive gnu-standards autoconf-doc gettext cmake-doc ninja-build
Step #4 - "build-a326c393-a262-48d1-a102-59e881b9d51b": lrzip libtool-doc gfortran | fortran95-compiler gcj-jdk
Step #4 - "build-a326c393-a262-48d1-a102-59e881b9d51b": The following NEW packages will be installed:
Step #4 - "build-a326c393-a262-48d1-a102-59e881b9d51b": autoconf automake cmake cmake-data file libarchive13 libglib2.0-0
Step #4 - "build-a326c393-a262-48d1-a102-59e881b9d51b": libglib2.0-data libicu66 libjsoncpp1 libltdl-dev libltdl7 libmagic-mgc
Step #4 - "build-a326c393-a262-48d1-a102-59e881b9d51b": libmagic1 librhash0 libtool libuv1 libxml2 pkg-config shared-mime-info
Step #4 - "build-a326c393-a262-48d1-a102-59e881b9d51b": xdg-user-dirs
Step #4 - "build-a326c393-a262-48d1-a102-59e881b9d51b": 0 upgraded, 21 newly installed, 0 to remove and 0 not upgraded.
Step #4 - "build-a326c393-a262-48d1-a102-59e881b9d51b": Need to get 18.4 MB of archives.
Step #4 - "build-a326c393-a262-48d1-a102-59e881b9d51b": After this operation, 84.9 MB of additional disk space will be used.
Step #4 - "build-a326c393-a262-48d1-a102-59e881b9d51b": Get:1 http://archive.ubuntu.com/ubuntu focal/main amd64 libmagic-mgc amd64 1:5.38-4 [218 kB]
Step #4 - "build-a326c393-a262-48d1-a102-59e881b9d51b": Get:2 http://archive.ubuntu.com/ubuntu focal/main amd64 libmagic1 amd64 1:5.38-4 [75.9 kB]
Step #4 - "build-a326c393-a262-48d1-a102-59e881b9d51b": Get:3 http://archive.ubuntu.com/ubuntu focal/main amd64 file amd64 1:5.38-4 [23.3 kB]
Step #4 - "build-a326c393-a262-48d1-a102-59e881b9d51b": Get:4 http://archive.ubuntu.com/ubuntu focal-updates/main amd64 libglib2.0-0 amd64 2.64.6-1~ubuntu20.04.9 [1290 kB]
Step #4 - "build-a326c393-a262-48d1-a102-59e881b9d51b": Get:5 http://archive.ubuntu.com/ubuntu focal-updates/main amd64 libglib2.0-data all 2.64.6-1~ubuntu20.04.9 [5836 B]
Step #4 - "build-a326c393-a262-48d1-a102-59e881b9d51b": Get:6 http://archive.ubuntu.com/ubuntu focal-updates/main amd64 libicu66 amd64 66.1-2ubuntu2.1 [8515 kB]
Step #4 - "build-a326c393-a262-48d1-a102-59e881b9d51b": Get:7 http://archive.ubuntu.com/ubuntu focal-updates/main amd64 libxml2 amd64 2.9.10+dfsg-5ubuntu0.20.04.10 [640 kB]
Step #4 - "build-a326c393-a262-48d1-a102-59e881b9d51b": Get:8 http://archive.ubuntu.com/ubuntu focal/main amd64 shared-mime-info amd64 1.15-1 [430 kB]
Step #4 - "build-a326c393-a262-48d1-a102-59e881b9d51b": Get:9 http://archive.ubuntu.com/ubuntu focal/main amd64 xdg-user-dirs amd64 0.17-2ubuntu1 [48.3 kB]
Step #4 - "build-a326c393-a262-48d1-a102-59e881b9d51b": Get:10 http://archive.ubuntu.com/ubuntu focal-updates/main amd64 libuv1 amd64 1.34.2-1ubuntu1.5 [80.9 kB]
Step #4 - "build-a326c393-a262-48d1-a102-59e881b9d51b": Get:11 http://archive.ubuntu.com/ubuntu focal/main amd64 autoconf all 2.69-11.1 [321 kB]
Step #4 - "build-a326c393-a262-48d1-a102-59e881b9d51b": Get:12 http://archive.ubuntu.com/ubuntu focal/main amd64 automake all 1:1.16.1-4ubuntu6 [522 kB]
Step #4 - "build-a326c393-a262-48d1-a102-59e881b9d51b": Get:13 http://archive.ubuntu.com/ubuntu focal-updates/main amd64 cmake-data all 3.16.3-1ubuntu1.20.04.1 [1613 kB]
Step #4 - "build-a326c393-a262-48d1-a102-59e881b9d51b": Get:14 http://archive.ubuntu.com/ubuntu focal-updates/main amd64 libarchive13 amd64 3.4.0-2ubuntu1.5 [327 kB]
Step #4 - "build-a326c393-a262-48d1-a102-59e881b9d51b": Get:15 http://archive.ubuntu.com/ubuntu focal/main amd64 libjsoncpp1 amd64 1.7.4-3.1ubuntu2 [75.6 kB]
Step #4 - "build-a326c393-a262-48d1-a102-59e881b9d51b": Get:16 http://archive.ubuntu.com/ubuntu focal/main amd64 librhash0 amd64 1.3.9-1 [113 kB]
Step #4 - "build-a326c393-a262-48d1-a102-59e881b9d51b": Get:17 http://archive.ubuntu.com/ubuntu focal-updates/main amd64 cmake amd64 3.16.3-1ubuntu1.20.04.1 [3668 kB]
Step #4 - "build-a326c393-a262-48d1-a102-59e881b9d51b": Get:18 http://archive.ubuntu.com/ubuntu focal/main amd64 libltdl7 amd64 2.4.6-14 [38.5 kB]
Step #4 - "build-a326c393-a262-48d1-a102-59e881b9d51b": Get:19 http://archive.ubuntu.com/ubuntu focal/main amd64 libltdl-dev amd64 2.4.6-14 [162 kB]
Step #4 - "build-a326c393-a262-48d1-a102-59e881b9d51b": Get:20 http://archive.ubuntu.com/ubuntu focal/main amd64 libtool all 2.4.6-14 [161 kB]
Step #4 - "build-a326c393-a262-48d1-a102-59e881b9d51b": Get:21 http://archive.ubuntu.com/ubuntu focal/main amd64 pkg-config amd64 0.29.1-0ubuntu4 [45.5 kB]
Step #4 - "build-a326c393-a262-48d1-a102-59e881b9d51b": [91mdebconf: delaying package configuration, since apt-utils is not installed
Step #4 - "build-a326c393-a262-48d1-a102-59e881b9d51b": [0mFetched 18.4 MB in 1s (33.4 MB/s)
Step #4 - "build-a326c393-a262-48d1-a102-59e881b9d51b": Selecting previously unselected package libmagic-mgc.
Step #4 - "build-a326c393-a262-48d1-a102-59e881b9d51b": (Reading database ...
(Reading database ... 5%
(Reading database ... 10%
(Reading database ... 15%
(Reading database ... 20%
(Reading database ... 25%
(Reading database ... 30%
(Reading database ... 35%
(Reading database ... 40%
(Reading database ... 45%
(Reading database ... 50%
(Reading database ... 55%
(Reading database ... 60%
(Reading database ... 65%
(Reading database ... 70%
(Reading database ... 75%
(Reading database ... 80%
(Reading database ... 85%
(Reading database ... 90%
(Reading database ... 95%
(Reading database ... 100%
(Reading database ... 17483 files and directories currently installed.)
Step #4 - "build-a326c393-a262-48d1-a102-59e881b9d51b": Preparing to unpack .../00-libmagic-mgc_1%3a5.38-4_amd64.deb ...
Step #4 - "build-a326c393-a262-48d1-a102-59e881b9d51b": Unpacking libmagic-mgc (1:5.38-4) ...
Step #4 - "build-a326c393-a262-48d1-a102-59e881b9d51b": Selecting previously unselected package libmagic1:amd64.
Step #4 - "build-a326c393-a262-48d1-a102-59e881b9d51b": Preparing to unpack .../01-libmagic1_1%3a5.38-4_amd64.deb ...
Step #4 - "build-a326c393-a262-48d1-a102-59e881b9d51b": Unpacking libmagic1:amd64 (1:5.38-4) ...
Step #4 - "build-a326c393-a262-48d1-a102-59e881b9d51b": Selecting previously unselected package file.
Step #4 - "build-a326c393-a262-48d1-a102-59e881b9d51b": Preparing to unpack .../02-file_1%3a5.38-4_amd64.deb ...
Step #4 - "build-a326c393-a262-48d1-a102-59e881b9d51b": Unpacking file (1:5.38-4) ...
Step #4 - "build-a326c393-a262-48d1-a102-59e881b9d51b": Selecting previously unselected package libglib2.0-0:amd64.
Step #4 - "build-a326c393-a262-48d1-a102-59e881b9d51b": Preparing to unpack .../03-libglib2.0-0_2.64.6-1~ubuntu20.04.9_amd64.deb ...
Step #4 - "build-a326c393-a262-48d1-a102-59e881b9d51b": Unpacking libglib2.0-0:amd64 (2.64.6-1~ubuntu20.04.9) ...
Step #4 - "build-a326c393-a262-48d1-a102-59e881b9d51b": Selecting previously unselected package libglib2.0-data.
Step #4 - "build-a326c393-a262-48d1-a102-59e881b9d51b": Preparing to unpack .../04-libglib2.0-data_2.64.6-1~ubuntu20.04.9_all.deb ...
Step #4 - "build-a326c393-a262-48d1-a102-59e881b9d51b": Unpacking libglib2.0-data (2.64.6-1~ubuntu20.04.9) ...
Step #4 - "build-a326c393-a262-48d1-a102-59e881b9d51b": Selecting previously unselected package libicu66:amd64.
Step #4 - "build-a326c393-a262-48d1-a102-59e881b9d51b": Preparing to unpack .../05-libicu66_66.1-2ubuntu2.1_amd64.deb ...
Step #4 - "build-a326c393-a262-48d1-a102-59e881b9d51b": Unpacking libicu66:amd64 (66.1-2ubuntu2.1) ...
Step #4 - "build-a326c393-a262-48d1-a102-59e881b9d51b": Selecting previously unselected package libxml2:amd64.
Step #4 - "build-a326c393-a262-48d1-a102-59e881b9d51b": Preparing to unpack .../06-libxml2_2.9.10+dfsg-5ubuntu0.20.04.10_amd64.deb ...
Step #4 - "build-a326c393-a262-48d1-a102-59e881b9d51b": Unpacking libxml2:amd64 (2.9.10+dfsg-5ubuntu0.20.04.10) ...
Step #4 - "build-a326c393-a262-48d1-a102-59e881b9d51b": Selecting previously unselected package shared-mime-info.
Step #4 - "build-a326c393-a262-48d1-a102-59e881b9d51b": Preparing to unpack .../07-shared-mime-info_1.15-1_amd64.deb ...
Step #4 - "build-a326c393-a262-48d1-a102-59e881b9d51b": Unpacking shared-mime-info (1.15-1) ...
Step #4 - "build-a326c393-a262-48d1-a102-59e881b9d51b": Selecting previously unselected package xdg-user-dirs.
Step #4 - "build-a326c393-a262-48d1-a102-59e881b9d51b": Preparing to unpack .../08-xdg-user-dirs_0.17-2ubuntu1_amd64.deb ...
Step #4 - "build-a326c393-a262-48d1-a102-59e881b9d51b": Unpacking xdg-user-dirs (0.17-2ubuntu1) ...
Step #4 - "build-a326c393-a262-48d1-a102-59e881b9d51b": Selecting previously unselected package libuv1:amd64.
Step #4 - "build-a326c393-a262-48d1-a102-59e881b9d51b": Preparing to unpack .../09-libuv1_1.34.2-1ubuntu1.5_amd64.deb ...
Step #4 - "build-a326c393-a262-48d1-a102-59e881b9d51b": Unpacking libuv1:amd64 (1.34.2-1ubuntu1.5) ...
Step #4 - "build-a326c393-a262-48d1-a102-59e881b9d51b": Selecting previously unselected package autoconf.
Step #4 - "build-a326c393-a262-48d1-a102-59e881b9d51b": Preparing to unpack .../10-autoconf_2.69-11.1_all.deb ...
Step #4 - "build-a326c393-a262-48d1-a102-59e881b9d51b": Unpacking autoconf (2.69-11.1) ...
Step #4 - "build-a326c393-a262-48d1-a102-59e881b9d51b": Selecting previously unselected package automake.
Step #4 - "build-a326c393-a262-48d1-a102-59e881b9d51b": Preparing to unpack .../11-automake_1%3a1.16.1-4ubuntu6_all.deb ...
Step #4 - "build-a326c393-a262-48d1-a102-59e881b9d51b": Unpacking automake (1:1.16.1-4ubuntu6) ...
Step #4 - "build-a326c393-a262-48d1-a102-59e881b9d51b": Selecting previously unselected package cmake-data.
Step #4 - "build-a326c393-a262-48d1-a102-59e881b9d51b": Preparing to unpack .../12-cmake-data_3.16.3-1ubuntu1.20.04.1_all.deb ...
Step #4 - "build-a326c393-a262-48d1-a102-59e881b9d51b": Unpacking cmake-data (3.16.3-1ubuntu1.20.04.1) ...
Step #4 - "build-a326c393-a262-48d1-a102-59e881b9d51b": Selecting previously unselected package libarchive13:amd64.
Step #4 - "build-a326c393-a262-48d1-a102-59e881b9d51b": Preparing to unpack .../13-libarchive13_3.4.0-2ubuntu1.5_amd64.deb ...
Step #4 - "build-a326c393-a262-48d1-a102-59e881b9d51b": Unpacking libarchive13:amd64 (3.4.0-2ubuntu1.5) ...
Step #4 - "build-a326c393-a262-48d1-a102-59e881b9d51b": Selecting previously unselected package libjsoncpp1:amd64.
Step #4 - "build-a326c393-a262-48d1-a102-59e881b9d51b": Preparing to unpack .../14-libjsoncpp1_1.7.4-3.1ubuntu2_amd64.deb ...
Step #4 - "build-a326c393-a262-48d1-a102-59e881b9d51b": Unpacking libjsoncpp1:amd64 (1.7.4-3.1ubuntu2) ...
Step #4 - "build-a326c393-a262-48d1-a102-59e881b9d51b": Selecting previously unselected package librhash0:amd64.
Step #4 - "build-a326c393-a262-48d1-a102-59e881b9d51b": Preparing to unpack .../15-librhash0_1.3.9-1_amd64.deb ...
Step #4 - "build-a326c393-a262-48d1-a102-59e881b9d51b": Unpacking librhash0:amd64 (1.3.9-1) ...
Step #4 - "build-a326c393-a262-48d1-a102-59e881b9d51b": Selecting previously unselected package cmake.
Step #4 - "build-a326c393-a262-48d1-a102-59e881b9d51b": Preparing to unpack .../16-cmake_3.16.3-1ubuntu1.20.04.1_amd64.deb ...
Step #4 - "build-a326c393-a262-48d1-a102-59e881b9d51b": Unpacking cmake (3.16.3-1ubuntu1.20.04.1) ...
Step #4 - "build-a326c393-a262-48d1-a102-59e881b9d51b": Selecting previously unselected package libltdl7:amd64.
Step #4 - "build-a326c393-a262-48d1-a102-59e881b9d51b": Preparing to unpack .../17-libltdl7_2.4.6-14_amd64.deb ...
Step #4 - "build-a326c393-a262-48d1-a102-59e881b9d51b": Unpacking libltdl7:amd64 (2.4.6-14) ...
Step #4 - "build-a326c393-a262-48d1-a102-59e881b9d51b": Selecting previously unselected package libltdl-dev:amd64.
Step #4 - "build-a326c393-a262-48d1-a102-59e881b9d51b": Preparing to unpack .../18-libltdl-dev_2.4.6-14_amd64.deb ...
Step #4 - "build-a326c393-a262-48d1-a102-59e881b9d51b": Unpacking libltdl-dev:amd64 (2.4.6-14) ...
Step #4 - "build-a326c393-a262-48d1-a102-59e881b9d51b": Selecting previously unselected package libtool.
Step #4 - "build-a326c393-a262-48d1-a102-59e881b9d51b": Preparing to unpack .../19-libtool_2.4.6-14_all.deb ...
Step #4 - "build-a326c393-a262-48d1-a102-59e881b9d51b": Unpacking libtool (2.4.6-14) ...
Step #4 - "build-a326c393-a262-48d1-a102-59e881b9d51b": Selecting previously unselected package pkg-config.
Step #4 - "build-a326c393-a262-48d1-a102-59e881b9d51b": Preparing to unpack .../20-pkg-config_0.29.1-0ubuntu4_amd64.deb ...
Step #4 - "build-a326c393-a262-48d1-a102-59e881b9d51b": Unpacking pkg-config (0.29.1-0ubuntu4) ...
Step #4 - "build-a326c393-a262-48d1-a102-59e881b9d51b": Setting up xdg-user-dirs (0.17-2ubuntu1) ...
Step #4 - "build-a326c393-a262-48d1-a102-59e881b9d51b": Setting up libmagic-mgc (1:5.38-4) ...
Step #4 - "build-a326c393-a262-48d1-a102-59e881b9d51b": Setting up libglib2.0-0:amd64 (2.64.6-1~ubuntu20.04.9) ...
Step #4 - "build-a326c393-a262-48d1-a102-59e881b9d51b": No schema files found: doing nothing.
Step #4 - "build-a326c393-a262-48d1-a102-59e881b9d51b": Setting up libicu66:amd64 (66.1-2ubuntu2.1) ...
Step #4 - "build-a326c393-a262-48d1-a102-59e881b9d51b": Setting up libmagic1:amd64 (1:5.38-4) ...
Step #4 - "build-a326c393-a262-48d1-a102-59e881b9d51b": Setting up file (1:5.38-4) ...
Step #4 - "build-a326c393-a262-48d1-a102-59e881b9d51b": Setting up libglib2.0-data (2.64.6-1~ubuntu20.04.9) ...
Step #4 - "build-a326c393-a262-48d1-a102-59e881b9d51b": Setting up libuv1:amd64 (1.34.2-1ubuntu1.5) ...
Step #4 - "build-a326c393-a262-48d1-a102-59e881b9d51b": Setting up pkg-config (0.29.1-0ubuntu4) ...
Step #4 - "build-a326c393-a262-48d1-a102-59e881b9d51b": Setting up libltdl7:amd64 (2.4.6-14) ...
Step #4 - "build-a326c393-a262-48d1-a102-59e881b9d51b": Setting up autoconf (2.69-11.1) ...
Step #4 - "build-a326c393-a262-48d1-a102-59e881b9d51b": Setting up librhash0:amd64 (1.3.9-1) ...
Step #4 - "build-a326c393-a262-48d1-a102-59e881b9d51b": Setting up cmake-data (3.16.3-1ubuntu1.20.04.1) ...
Step #4 - "build-a326c393-a262-48d1-a102-59e881b9d51b": Setting up libxml2:amd64 (2.9.10+dfsg-5ubuntu0.20.04.10) ...
Step #4 - "build-a326c393-a262-48d1-a102-59e881b9d51b": Setting up libjsoncpp1:amd64 (1.7.4-3.1ubuntu2) ...
Step #4 - "build-a326c393-a262-48d1-a102-59e881b9d51b": Setting up automake (1:1.16.1-4ubuntu6) ...
Step #4 - "build-a326c393-a262-48d1-a102-59e881b9d51b": update-alternatives: using /usr/bin/automake-1.16 to provide /usr/bin/automake (automake) in auto mode
Step #4 - "build-a326c393-a262-48d1-a102-59e881b9d51b": update-alternatives: warning: skip creation of /usr/share/man/man1/automake.1.gz because associated file /usr/share/man/man1/automake-1.16.1.gz (of link group automake) doesn't exist
Step #4 - "build-a326c393-a262-48d1-a102-59e881b9d51b": update-alternatives: warning: skip creation of /usr/share/man/man1/aclocal.1.gz because associated file /usr/share/man/man1/aclocal-1.16.1.gz (of link group automake) doesn't exist
Step #4 - "build-a326c393-a262-48d1-a102-59e881b9d51b": Setting up libtool (2.4.6-14) ...
Step #4 - "build-a326c393-a262-48d1-a102-59e881b9d51b": Setting up libarchive13:amd64 (3.4.0-2ubuntu1.5) ...
Step #4 - "build-a326c393-a262-48d1-a102-59e881b9d51b": Setting up libltdl-dev:amd64 (2.4.6-14) ...
Step #4 - "build-a326c393-a262-48d1-a102-59e881b9d51b": Setting up shared-mime-info (1.15-1) ...
Step #4 - "build-a326c393-a262-48d1-a102-59e881b9d51b": Setting up cmake (3.16.3-1ubuntu1.20.04.1) ...
Step #4 - "build-a326c393-a262-48d1-a102-59e881b9d51b": Processing triggers for libc-bin (2.31-0ubuntu9.18) ...
Step #4 - "build-a326c393-a262-48d1-a102-59e881b9d51b": Removing intermediate container 5686a574ee3b
Step #4 - "build-a326c393-a262-48d1-a102-59e881b9d51b": ---> ebaaec173f83
Step #4 - "build-a326c393-a262-48d1-a102-59e881b9d51b": Step 3/6 : RUN git clone https://github.com/vstakhov/libucl
Step #4 - "build-a326c393-a262-48d1-a102-59e881b9d51b": ---> Running in e80ea862d6eb
Step #4 - "build-a326c393-a262-48d1-a102-59e881b9d51b": [91mCloning into 'libucl'...
Step #4 - "build-a326c393-a262-48d1-a102-59e881b9d51b": [0mRemoving intermediate container e80ea862d6eb
Step #4 - "build-a326c393-a262-48d1-a102-59e881b9d51b": ---> 95db26ddb207
Step #4 - "build-a326c393-a262-48d1-a102-59e881b9d51b": Step 4/6 : WORKDIR $SRC
Step #4 - "build-a326c393-a262-48d1-a102-59e881b9d51b": ---> Running in 8523f292d506
Step #4 - "build-a326c393-a262-48d1-a102-59e881b9d51b": Removing intermediate container 8523f292d506
Step #4 - "build-a326c393-a262-48d1-a102-59e881b9d51b": ---> e53193660c78
Step #4 - "build-a326c393-a262-48d1-a102-59e881b9d51b": Step 5/6 : COPY build.sh $SRC/
Step #4 - "build-a326c393-a262-48d1-a102-59e881b9d51b": ---> 061e74d98419
Step #4 - "build-a326c393-a262-48d1-a102-59e881b9d51b": Step 6/6 : COPY ucl_add_string_fuzzer.options $SRC/ucl_add_string_fuzzer.options
Step #4 - "build-a326c393-a262-48d1-a102-59e881b9d51b": ---> 64a715e5e055
Step #4 - "build-a326c393-a262-48d1-a102-59e881b9d51b": Successfully built 64a715e5e055
Step #4 - "build-a326c393-a262-48d1-a102-59e881b9d51b": Successfully tagged gcr.io/oss-fuzz/libucl:latest
Step #4 - "build-a326c393-a262-48d1-a102-59e881b9d51b": Successfully tagged us-central1-docker.pkg.dev/oss-fuzz/unsafe/libucl:latest
Finished Step #4 - "build-a326c393-a262-48d1-a102-59e881b9d51b"
Starting Step #5 - "srcmap"
Step #5 - "srcmap": Already have image: gcr.io/oss-fuzz/libucl
Step #5 - "srcmap": ++ tempfile
Step #5 - "srcmap": + SRCMAP=/tmp/file3HTzGL
Step #5 - "srcmap": + echo '{}'
Step #5 - "srcmap": + PATHS_TO_SCAN=/src
Step #5 - "srcmap": + [[ c == \g\o ]]
Step #5 - "srcmap": ++ find /src -name .git -type d
Step #5 - "srcmap": + for DOT_GIT_DIR in $(find $PATHS_TO_SCAN -name ".git" -type d)
Step #5 - "srcmap": ++ dirname /src/libucl/.git
Step #5 - "srcmap": + GIT_DIR=/src/libucl
Step #5 - "srcmap": + cd /src/libucl
Step #5 - "srcmap": ++ git config --get remote.origin.url
Step #5 - "srcmap": + GIT_URL=https://github.com/vstakhov/libucl
Step #5 - "srcmap": ++ git rev-parse HEAD
Step #5 - "srcmap": + GIT_REV=d8af9539dfb387f45a864deefec62609c26132d3
Step #5 - "srcmap": + jq_inplace /tmp/file3HTzGL '."/src/libucl" = { type: "git", url: "https://github.com/vstakhov/libucl", rev: "d8af9539dfb387f45a864deefec62609c26132d3" }'
Step #5 - "srcmap": ++ tempfile
Step #5 - "srcmap": + F=/tmp/fileaPgBpb
Step #5 - "srcmap": + cat /tmp/file3HTzGL
Step #5 - "srcmap": + jq '."/src/libucl" = { type: "git", url: "https://github.com/vstakhov/libucl", rev: "d8af9539dfb387f45a864deefec62609c26132d3" }'
Step #5 - "srcmap": + mv /tmp/fileaPgBpb /tmp/file3HTzGL
Step #5 - "srcmap": ++ find /src -name .svn -type d
Step #5 - "srcmap": ++ find /src -name .hg -type d
Step #5 - "srcmap": + '[' '' '!=' '' ']'
Step #5 - "srcmap": + cat /tmp/file3HTzGL
Step #5 - "srcmap": + rm /tmp/file3HTzGL
Step #5 - "srcmap": {
Step #5 - "srcmap": "/src/libucl": {
Step #5 - "srcmap": "type": "git",
Step #5 - "srcmap": "url": "https://github.com/vstakhov/libucl",
Step #5 - "srcmap": "rev": "d8af9539dfb387f45a864deefec62609c26132d3"
Step #5 - "srcmap": }
Step #5 - "srcmap": }
Finished Step #5 - "srcmap"
Starting Step #6 - "compile-libfuzzer-introspector-x86_64"
Step #6 - "compile-libfuzzer-introspector-x86_64": Already have image (with digest): gcr.io/cloud-builders/docker
Step #6 - "compile-libfuzzer-introspector-x86_64": ---------------------------------------------------------------
Step #6 - "compile-libfuzzer-introspector-x86_64": vm.mmap_rnd_bits = 28
Step #6 - "compile-libfuzzer-introspector-x86_64": Compiling libFuzzer to /usr/lib/libFuzzingEngine.a... done.
Step #6 - "compile-libfuzzer-introspector-x86_64":
Reading package lists... 0%
Reading package lists... 0%
Reading package lists... 0%
Reading package lists... 2%
Reading package lists... 2%
Reading package lists... 4%
Reading package lists... 4%
Reading package lists... 4%
Reading package lists... 4%
Reading package lists... 4%
Reading package lists... 4%
Reading package lists... 28%
Reading package lists... 28%
Reading package lists... 32%
Reading package lists... 41%
Reading package lists... 41%
Reading package lists... 41%
Reading package lists... 41%
Reading package lists... 42%
Reading package lists... 42%
Reading package lists... 52%
Reading package lists... 52%
Reading package lists... 55%
Reading package lists... 55%
Reading package lists... 66%
Reading package lists... 66%
Reading package lists... 66%
Reading package lists... 66%
Reading package lists... 69%
Reading package lists... 69%
Reading package lists... 72%
Reading package lists... 72%
Reading package lists... 72%
Reading package lists... 72%
Reading package lists... 72%
Reading package lists... 72%
Reading package lists... 72%
Reading package lists... 72%
Reading package lists... 72%
Reading package lists... 72%
Reading package lists... 72%
Reading package lists... 72%
Reading package lists... 72%
Reading package lists... 72%
Reading package lists... 75%
Reading package lists... 82%
Reading package lists... 82%
Reading package lists... 84%
Reading package lists... 84%
Reading package lists... 94%
Reading package lists... 94%
Reading package lists... 94%
Reading package lists... 94%
Reading package lists... 97%
Reading package lists... 97%
Reading package lists... 99%
Reading package lists... 99%
Reading package lists... 99%
Reading package lists... 99%
Reading package lists... 99%
Reading package lists... 99%
Reading package lists... Done
Step #6 - "compile-libfuzzer-introspector-x86_64":
Building dependency tree... 0%
Building dependency tree... 0%
Building dependency tree... 50%
Building dependency tree... 50%
Building dependency tree
Step #6 - "compile-libfuzzer-introspector-x86_64":
Reading state information... 0%
Reading state information... 0%
Reading state information... Done
Step #6 - "compile-libfuzzer-introspector-x86_64": The following additional packages will be installed:
Step #6 - "compile-libfuzzer-introspector-x86_64": libjpeg-turbo8 libjpeg-turbo8-dev libjpeg8 libjpeg8-dev libyaml-0-2
Step #6 - "compile-libfuzzer-introspector-x86_64": Suggested packages:
Step #6 - "compile-libfuzzer-introspector-x86_64": libyaml-doc
Step #6 - "compile-libfuzzer-introspector-x86_64": The following NEW packages will be installed:
Step #6 - "compile-libfuzzer-introspector-x86_64": libjpeg-dev libjpeg-turbo8 libjpeg-turbo8-dev libjpeg8 libjpeg8-dev
Step #6 - "compile-libfuzzer-introspector-x86_64": libyaml-0-2 libyaml-dev zlib1g-dev
Step #6 - "compile-libfuzzer-introspector-x86_64": 0 upgraded, 8 newly installed, 0 to remove and 0 not upgraded.
Step #6 - "compile-libfuzzer-introspector-x86_64": Need to get 624 kB of archives.
Step #6 - "compile-libfuzzer-introspector-x86_64": After this operation, 2657 kB of additional disk space will be used.
Step #6 - "compile-libfuzzer-introspector-x86_64":
0% [Working]
Get:1 http://archive.ubuntu.com/ubuntu focal/main amd64 libyaml-0-2 amd64 0.2.2-1 [48.9 kB]
Step #6 - "compile-libfuzzer-introspector-x86_64":
2% [1 libyaml-0-2 14.2 kB/48.9 kB 29%]
9% [Working]
Get:2 http://archive.ubuntu.com/ubuntu focal-updates/main amd64 libjpeg-turbo8 amd64 2.0.3-0ubuntu1.20.04.3 [118 kB]
Step #6 - "compile-libfuzzer-introspector-x86_64":
9% [2 libjpeg-turbo8 5500 B/118 kB 5%]
26% [Waiting for headers]
Get:3 http://archive.ubuntu.com/ubuntu focal-updates/main amd64 libjpeg-turbo8-dev amd64 2.0.3-0ubuntu1.20.04.3 [238 kB]
Step #6 - "compile-libfuzzer-introspector-x86_64":
27% [3 libjpeg-turbo8-dev 1552 B/238 kB 1%]
59% [Waiting for headers]
Get:4 http://archive.ubuntu.com/ubuntu focal/main amd64 libjpeg8 amd64 8c-2ubuntu8 [2194 B]
Step #6 - "compile-libfuzzer-introspector-x86_64":
62% [Waiting for headers]
Get:5 http://archive.ubuntu.com/ubuntu focal/main amd64 libjpeg8-dev amd64 8c-2ubuntu8 [1552 B]
Step #6 - "compile-libfuzzer-introspector-x86_64":
65% [Waiting for headers]
Get:6 http://archive.ubuntu.com/ubuntu focal/main amd64 libjpeg-dev amd64 8c-2ubuntu8 [1546 B]
Step #6 - "compile-libfuzzer-introspector-x86_64":
68% [Waiting for headers]
Get:7 http://archive.ubuntu.com/ubuntu focal-updates/main amd64 zlib1g-dev amd64 1:1.2.11.dfsg-2ubuntu1.5 [155 kB]
Step #6 - "compile-libfuzzer-introspector-x86_64":
69% [7 zlib1g-dev 8396 B/155 kB 5%]
90% [Waiting for headers]
Get:8 http://archive.ubuntu.com/ubuntu focal/main amd64 libyaml-dev amd64 0.2.2-1 [58.2 kB]
Step #6 - "compile-libfuzzer-introspector-x86_64":
91% [8 libyaml-dev 7546 B/58.2 kB 13%]
100% [Working]
Fetched 624 kB in 0s (2112 kB/s)
Step #6 - "compile-libfuzzer-introspector-x86_64": debconf: delaying package configuration, since apt-utils is not installed
Step #6 - "compile-libfuzzer-introspector-x86_64": Selecting previously unselected package libyaml-0-2:amd64.
Step #6 - "compile-libfuzzer-introspector-x86_64": (Reading database ...
(Reading database ... 5%
(Reading database ... 10%
(Reading database ... 15%
(Reading database ... 20%
(Reading database ... 25%
(Reading database ... 30%
(Reading database ... 35%
(Reading database ... 40%
(Reading database ... 45%
(Reading database ... 50%
(Reading database ... 55%
(Reading database ... 60%
(Reading database ... 65%
(Reading database ... 70%
(Reading database ... 75%
(Reading database ... 80%
(Reading database ... 85%
(Reading database ... 90%
(Reading database ... 95%
(Reading database ... 100%
(Reading database ... 20966 files and directories currently installed.)
Step #6 - "compile-libfuzzer-introspector-x86_64": Preparing to unpack .../0-libyaml-0-2_0.2.2-1_amd64.deb ...
Step #6 - "compile-libfuzzer-introspector-x86_64": Unpacking libyaml-0-2:amd64 (0.2.2-1) ...
Step #6 - "compile-libfuzzer-introspector-x86_64": Selecting previously unselected package libjpeg-turbo8:amd64.
Step #6 - "compile-libfuzzer-introspector-x86_64": Preparing to unpack .../1-libjpeg-turbo8_2.0.3-0ubuntu1.20.04.3_amd64.deb ...
Step #6 - "compile-libfuzzer-introspector-x86_64": Unpacking libjpeg-turbo8:amd64 (2.0.3-0ubuntu1.20.04.3) ...
Step #6 - "compile-libfuzzer-introspector-x86_64": Selecting previously unselected package libjpeg-turbo8-dev:amd64.
Step #6 - "compile-libfuzzer-introspector-x86_64": Preparing to unpack .../2-libjpeg-turbo8-dev_2.0.3-0ubuntu1.20.04.3_amd64.deb ...
Step #6 - "compile-libfuzzer-introspector-x86_64": Unpacking libjpeg-turbo8-dev:amd64 (2.0.3-0ubuntu1.20.04.3) ...
Step #6 - "compile-libfuzzer-introspector-x86_64": Selecting previously unselected package libjpeg8:amd64.
Step #6 - "compile-libfuzzer-introspector-x86_64": Preparing to unpack .../3-libjpeg8_8c-2ubuntu8_amd64.deb ...
Step #6 - "compile-libfuzzer-introspector-x86_64": Unpacking libjpeg8:amd64 (8c-2ubuntu8) ...
Step #6 - "compile-libfuzzer-introspector-x86_64": Selecting previously unselected package libjpeg8-dev:amd64.
Step #6 - "compile-libfuzzer-introspector-x86_64": Preparing to unpack .../4-libjpeg8-dev_8c-2ubuntu8_amd64.deb ...
Step #6 - "compile-libfuzzer-introspector-x86_64": Unpacking libjpeg8-dev:amd64 (8c-2ubuntu8) ...
Step #6 - "compile-libfuzzer-introspector-x86_64": Selecting previously unselected package libjpeg-dev:amd64.
Step #6 - "compile-libfuzzer-introspector-x86_64": Preparing to unpack .../5-libjpeg-dev_8c-2ubuntu8_amd64.deb ...
Step #6 - "compile-libfuzzer-introspector-x86_64": Unpacking libjpeg-dev:amd64 (8c-2ubuntu8) ...
Step #6 - "compile-libfuzzer-introspector-x86_64": Selecting previously unselected package zlib1g-dev:amd64.
Step #6 - "compile-libfuzzer-introspector-x86_64": Preparing to unpack .../6-zlib1g-dev_1%3a1.2.11.dfsg-2ubuntu1.5_amd64.deb ...
Step #6 - "compile-libfuzzer-introspector-x86_64": Unpacking zlib1g-dev:amd64 (1:1.2.11.dfsg-2ubuntu1.5) ...
Step #6 - "compile-libfuzzer-introspector-x86_64": Selecting previously unselected package libyaml-dev:amd64.
Step #6 - "compile-libfuzzer-introspector-x86_64": Preparing to unpack .../7-libyaml-dev_0.2.2-1_amd64.deb ...
Step #6 - "compile-libfuzzer-introspector-x86_64": Unpacking libyaml-dev:amd64 (0.2.2-1) ...
Step #6 - "compile-libfuzzer-introspector-x86_64": Setting up libyaml-0-2:amd64 (0.2.2-1) ...
Step #6 - "compile-libfuzzer-introspector-x86_64": Setting up libjpeg-turbo8:amd64 (2.0.3-0ubuntu1.20.04.3) ...
Step #6 - "compile-libfuzzer-introspector-x86_64": Setting up zlib1g-dev:amd64 (1:1.2.11.dfsg-2ubuntu1.5) ...
Step #6 - "compile-libfuzzer-introspector-x86_64": Setting up libjpeg8:amd64 (8c-2ubuntu8) ...
Step #6 - "compile-libfuzzer-introspector-x86_64": Setting up libjpeg-turbo8-dev:amd64 (2.0.3-0ubuntu1.20.04.3) ...
Step #6 - "compile-libfuzzer-introspector-x86_64": Setting up libyaml-dev:amd64 (0.2.2-1) ...
Step #6 - "compile-libfuzzer-introspector-x86_64": Setting up libjpeg8-dev:amd64 (8c-2ubuntu8) ...
Step #6 - "compile-libfuzzer-introspector-x86_64": Setting up libjpeg-dev:amd64 (8c-2ubuntu8) ...
Step #6 - "compile-libfuzzer-introspector-x86_64": Processing triggers for libc-bin (2.31-0ubuntu9.18) ...
Step #6 - "compile-libfuzzer-introspector-x86_64": Requirement already satisfied: pip in /usr/local/lib/python3.11/site-packages (25.2)
Step #6 - "compile-libfuzzer-introspector-x86_64": Requirement already satisfied: setuptools in /usr/local/lib/python3.11/site-packages (65.5.0)
Step #6 - "compile-libfuzzer-introspector-x86_64": Collecting setuptools
Step #6 - "compile-libfuzzer-introspector-x86_64": Downloading setuptools-80.9.0-py3-none-any.whl.metadata (6.6 kB)
Step #6 - "compile-libfuzzer-introspector-x86_64": Downloading setuptools-80.9.0-py3-none-any.whl (1.2 MB)
Step #6 - "compile-libfuzzer-introspector-x86_64": [?25l [90m━━━━━━━━━━━━━━━━━━━━━━━━━━━━━━━━━━━━━━━━[0m [32m0.0/1.2 MB[0m [31m?[0m eta [36m-:--:--[0m
[2K [90m━━━━━━━━━━━━━━━━━━━━━━━━━━━━━━━━━━━━━━━━[0m [32m1.2/1.2 MB[0m [31m28.4 MB/s[0m [33m0:00:00[0m
Step #6 - "compile-libfuzzer-introspector-x86_64": [?25hInstalling collected packages: setuptools
Step #6 - "compile-libfuzzer-introspector-x86_64": Attempting uninstall: setuptools
Step #6 - "compile-libfuzzer-introspector-x86_64": Found existing installation: setuptools 65.5.0
Step #6 - "compile-libfuzzer-introspector-x86_64": Uninstalling setuptools-65.5.0:
Step #6 - "compile-libfuzzer-introspector-x86_64": Successfully uninstalled setuptools-65.5.0
Step #6 - "compile-libfuzzer-introspector-x86_64": Successfully installed setuptools-80.9.0
Step #6 - "compile-libfuzzer-introspector-x86_64": [33mWARNING: Running pip as the 'root' user can result in broken permissions and conflicting behaviour with the system package manager, possibly rendering your system unusable. It is recommended to use a virtual environment instead: https://pip.pypa.io/warnings/venv. Use the --root-user-action option if you know what you are doing and want to suppress this warning.[0m[33m
Step #6 - "compile-libfuzzer-introspector-x86_64": [0mCollecting cxxfilt
Step #6 - "compile-libfuzzer-introspector-x86_64": Downloading cxxfilt-0.3.0-py2.py3-none-any.whl.metadata (3.5 kB)
Step #6 - "compile-libfuzzer-introspector-x86_64": Collecting pyyaml
Step #6 - "compile-libfuzzer-introspector-x86_64": Downloading PyYAML-6.0.2-cp311-cp311-manylinux_2_17_x86_64.manylinux2014_x86_64.whl.metadata (2.1 kB)
Step #6 - "compile-libfuzzer-introspector-x86_64": Collecting beautifulsoup4
Step #6 - "compile-libfuzzer-introspector-x86_64": Downloading beautifulsoup4-4.13.4-py3-none-any.whl.metadata (3.8 kB)
Step #6 - "compile-libfuzzer-introspector-x86_64": Collecting lxml
Step #6 - "compile-libfuzzer-introspector-x86_64": Downloading lxml-6.0.0-cp311-cp311-manylinux_2_27_x86_64.manylinux_2_28_x86_64.whl.metadata (6.6 kB)
Step #6 - "compile-libfuzzer-introspector-x86_64": Collecting soupsieve
Step #6 - "compile-libfuzzer-introspector-x86_64": Downloading soupsieve-2.7-py3-none-any.whl.metadata (4.6 kB)
Step #6 - "compile-libfuzzer-introspector-x86_64": Collecting rust-demangler
Step #6 - "compile-libfuzzer-introspector-x86_64": Downloading rust_demangler-1.0-py3-none-any.whl.metadata (866 bytes)
Step #6 - "compile-libfuzzer-introspector-x86_64": Collecting typing-extensions>=4.0.0 (from beautifulsoup4)
Step #6 - "compile-libfuzzer-introspector-x86_64": Downloading typing_extensions-4.14.1-py3-none-any.whl.metadata (3.0 kB)
Step #6 - "compile-libfuzzer-introspector-x86_64": Downloading cxxfilt-0.3.0-py2.py3-none-any.whl (4.6 kB)
Step #6 - "compile-libfuzzer-introspector-x86_64": Downloading PyYAML-6.0.2-cp311-cp311-manylinux_2_17_x86_64.manylinux2014_x86_64.whl (762 kB)
Step #6 - "compile-libfuzzer-introspector-x86_64": [?25l [90m━━━━━━━━━━━━━━━━━━━━━━━━━━━━━━━━━━━━━━━━[0m [32m0.0/763.0 kB[0m [31m?[0m eta [36m-:--:--[0m
[2K [90m━━━━━━━━━━━━━━━━━━━━━━━━━━━━━━━━━━━━━━━━[0m [32m763.0/763.0 kB[0m [31m24.2 MB/s[0m [33m0:00:00[0m
Step #6 - "compile-libfuzzer-introspector-x86_64": [?25hDownloading beautifulsoup4-4.13.4-py3-none-any.whl (187 kB)
Step #6 - "compile-libfuzzer-introspector-x86_64": Downloading lxml-6.0.0-cp311-cp311-manylinux_2_27_x86_64.manylinux_2_28_x86_64.whl (5.2 MB)
Step #6 - "compile-libfuzzer-introspector-x86_64": [?25l [90m━━━━━━━━━━━━━━━━━━━━━━━━━━━━━━━━━━━━━━━━[0m [32m0.0/5.2 MB[0m [31m?[0m eta [36m-:--:--[0m
[2K [90m━━━━━━━━━━━━━━━━━━━━━━━━━━━━━━━━━━━━━━━━[0m [32m5.2/5.2 MB[0m [31m107.3 MB/s[0m [33m0:00:00[0m
Step #6 - "compile-libfuzzer-introspector-x86_64": [?25hDownloading soupsieve-2.7-py3-none-any.whl (36 kB)
Step #6 - "compile-libfuzzer-introspector-x86_64": Downloading rust_demangler-1.0-py3-none-any.whl (8.3 kB)
Step #6 - "compile-libfuzzer-introspector-x86_64": Downloading typing_extensions-4.14.1-py3-none-any.whl (43 kB)
Step #6 - "compile-libfuzzer-introspector-x86_64": Installing collected packages: rust-demangler, cxxfilt, typing-extensions, soupsieve, pyyaml, lxml, beautifulsoup4
Step #6 - "compile-libfuzzer-introspector-x86_64": [?25l
[2K [91m━━━━━━━━━━━━━━━━━━━━━━[0m[91m╸[0m[90m━━━━━━━━━━━━━━━━━[0m [32m4/7[0m [pyyaml]
[2K [91m━━━━━━━━━━━━━━━━━━━━━━━━━━━━[0m[91m╸[0m[90m━━━━━━━━━━━[0m [32m5/7[0m [lxml]
[2K [90m━━━━━━━━━━━━━━━━━━━━━━━━━━━━━━━━━━━━━━━━[0m [32m7/7[0m [beautifulsoup4]
Step #6 - "compile-libfuzzer-introspector-x86_64": [?25h
[1A[2KSuccessfully installed beautifulsoup4-4.13.4 cxxfilt-0.3.0 lxml-6.0.0 pyyaml-6.0.2 rust-demangler-1.0 soupsieve-2.7 typing-extensions-4.14.1
Step #6 - "compile-libfuzzer-introspector-x86_64": [33mWARNING: Running pip as the 'root' user can result in broken permissions and conflicting behaviour with the system package manager, possibly rendering your system unusable. It is recommended to use a virtual environment instead: https://pip.pypa.io/warnings/venv. Use the --root-user-action option if you know what you are doing and want to suppress this warning.[0m[33m
Step #6 - "compile-libfuzzer-introspector-x86_64": [0mCollecting matplotlib
Step #6 - "compile-libfuzzer-introspector-x86_64": Downloading matplotlib-3.10.5-cp311-cp311-manylinux2014_x86_64.manylinux_2_17_x86_64.whl.metadata (11 kB)
Step #6 - "compile-libfuzzer-introspector-x86_64": Collecting contourpy>=1.0.1 (from matplotlib)
Step #6 - "compile-libfuzzer-introspector-x86_64": Downloading contourpy-1.3.3-cp311-cp311-manylinux_2_27_x86_64.manylinux_2_28_x86_64.whl.metadata (5.5 kB)
Step #6 - "compile-libfuzzer-introspector-x86_64": Collecting cycler>=0.10 (from matplotlib)
Step #6 - "compile-libfuzzer-introspector-x86_64": Downloading cycler-0.12.1-py3-none-any.whl.metadata (3.8 kB)
Step #6 - "compile-libfuzzer-introspector-x86_64": Collecting fonttools>=4.22.0 (from matplotlib)
Step #6 - "compile-libfuzzer-introspector-x86_64": Downloading fonttools-4.59.0-cp311-cp311-manylinux2014_x86_64.manylinux_2_17_x86_64.whl.metadata (107 kB)
Step #6 - "compile-libfuzzer-introspector-x86_64": Collecting kiwisolver>=1.3.1 (from matplotlib)
Step #6 - "compile-libfuzzer-introspector-x86_64": Downloading kiwisolver-1.4.8-cp311-cp311-manylinux_2_17_x86_64.manylinux2014_x86_64.whl.metadata (6.2 kB)
Step #6 - "compile-libfuzzer-introspector-x86_64": Collecting numpy>=1.23 (from matplotlib)
Step #6 - "compile-libfuzzer-introspector-x86_64": Downloading numpy-2.3.2-cp311-cp311-manylinux_2_27_x86_64.manylinux_2_28_x86_64.whl.metadata (62 kB)
Step #6 - "compile-libfuzzer-introspector-x86_64": Collecting packaging>=20.0 (from matplotlib)
Step #6 - "compile-libfuzzer-introspector-x86_64": Downloading packaging-25.0-py3-none-any.whl.metadata (3.3 kB)
Step #6 - "compile-libfuzzer-introspector-x86_64": Collecting pillow>=8 (from matplotlib)
Step #6 - "compile-libfuzzer-introspector-x86_64": Downloading pillow-11.3.0-cp311-cp311-manylinux_2_27_x86_64.manylinux_2_28_x86_64.whl.metadata (9.0 kB)
Step #6 - "compile-libfuzzer-introspector-x86_64": Collecting pyparsing>=2.3.1 (from matplotlib)
Step #6 - "compile-libfuzzer-introspector-x86_64": Downloading pyparsing-3.2.3-py3-none-any.whl.metadata (5.0 kB)
Step #6 - "compile-libfuzzer-introspector-x86_64": Collecting python-dateutil>=2.7 (from matplotlib)
Step #6 - "compile-libfuzzer-introspector-x86_64": Downloading python_dateutil-2.9.0.post0-py2.py3-none-any.whl.metadata (8.4 kB)
Step #6 - "compile-libfuzzer-introspector-x86_64": Requirement already satisfied: six>=1.5 in /usr/local/lib/python3.11/site-packages (from python-dateutil>=2.7->matplotlib) (1.15.0)
Step #6 - "compile-libfuzzer-introspector-x86_64": Downloading matplotlib-3.10.5-cp311-cp311-manylinux2014_x86_64.manylinux_2_17_x86_64.whl (8.7 MB)
Step #6 - "compile-libfuzzer-introspector-x86_64": [?25l [90m━━━━━━━━━━━━━━━━━━━━━━━━━━━━━━━━━━━━━━━━[0m [32m0.0/8.7 MB[0m [31m?[0m eta [36m-:--:--[0m
[2K [90m━━━━━━━━━━━━━━━━━━━━━━━━━━━━━━━━━━━━━━━━[0m [32m8.7/8.7 MB[0m [31m102.0 MB/s[0m [33m0:00:00[0m
Step #6 - "compile-libfuzzer-introspector-x86_64": [?25hDownloading contourpy-1.3.3-cp311-cp311-manylinux_2_27_x86_64.manylinux_2_28_x86_64.whl (355 kB)
Step #6 - "compile-libfuzzer-introspector-x86_64": Downloading cycler-0.12.1-py3-none-any.whl (8.3 kB)
Step #6 - "compile-libfuzzer-introspector-x86_64": Downloading fonttools-4.59.0-cp311-cp311-manylinux2014_x86_64.manylinux_2_17_x86_64.whl (5.0 MB)
Step #6 - "compile-libfuzzer-introspector-x86_64": [?25l [90m━━━━━━━━━━━━━━━━━━━━━━━━━━━━━━━━━━━━━━━━[0m [32m0.0/5.0 MB[0m [31m?[0m eta [36m-:--:--[0m
[2K [90m━━━━━━━━━━━━━━━━━━━━━━━━━━━━━━━━━━━━━━━━[0m [32m5.0/5.0 MB[0m [31m110.5 MB/s[0m [33m0:00:00[0m
Step #6 - "compile-libfuzzer-introspector-x86_64": [?25hDownloading kiwisolver-1.4.8-cp311-cp311-manylinux_2_17_x86_64.manylinux2014_x86_64.whl (1.4 MB)
Step #6 - "compile-libfuzzer-introspector-x86_64": [?25l [90m━━━━━━━━━━━━━━━━━━━━━━━━━━━━━━━━━━━━━━━━[0m [32m0.0/1.4 MB[0m [31m?[0m eta [36m-:--:--[0m
[2K [90m━━━━━━━━━━━━━━━━━━━━━━━━━━━━━━━━━━━━━━━━[0m [32m1.4/1.4 MB[0m [31m82.9 MB/s[0m [33m0:00:00[0m
Step #6 - "compile-libfuzzer-introspector-x86_64": [?25hDownloading numpy-2.3.2-cp311-cp311-manylinux_2_27_x86_64.manylinux_2_28_x86_64.whl (16.9 MB)
Step #6 - "compile-libfuzzer-introspector-x86_64": [?25l [90m━━━━━━━━━━━━━━━━━━━━━━━━━━━━━━━━━━━━━━━━[0m [32m0.0/16.9 MB[0m [31m?[0m eta [36m-:--:--[0m
[2K [90m━━━━━━━━━━━━━━━━━━━━━━━━━━━━━━━━━━━━━━━━[0m [32m16.9/16.9 MB[0m [31m140.4 MB/s[0m [33m0:00:00[0m
Step #6 - "compile-libfuzzer-introspector-x86_64": [?25hDownloading packaging-25.0-py3-none-any.whl (66 kB)
Step #6 - "compile-libfuzzer-introspector-x86_64": Downloading pillow-11.3.0-cp311-cp311-manylinux_2_27_x86_64.manylinux_2_28_x86_64.whl (6.6 MB)
Step #6 - "compile-libfuzzer-introspector-x86_64": [?25l [90m━━━━━━━━━━━━━━━━━━━━━━━━━━━━━━━━━━━━━━━━[0m [32m0.0/6.6 MB[0m [31m?[0m eta [36m-:--:--[0m
[2K [90m━━━━━━━━━━━━━━━━━━━━━━━━━━━━━━━━━━━━━━━━[0m [32m6.6/6.6 MB[0m [31m124.6 MB/s[0m [33m0:00:00[0m
Step #6 - "compile-libfuzzer-introspector-x86_64": [?25hDownloading pyparsing-3.2.3-py3-none-any.whl (111 kB)
Step #6 - "compile-libfuzzer-introspector-x86_64": Downloading python_dateutil-2.9.0.post0-py2.py3-none-any.whl (229 kB)
Step #6 - "compile-libfuzzer-introspector-x86_64": Installing collected packages: python-dateutil, pyparsing, pillow, packaging, numpy, kiwisolver, fonttools, cycler, contourpy, matplotlib
Step #6 - "compile-libfuzzer-introspector-x86_64": [?25l
[2K [91m━━━━━━━━[0m[90m╺[0m[90m━━━━━━━━━━━━━━━━━━━━━━━━━━━━━━━[0m [32m 2/10[0m [pillow]
[2K [91m━━━━━━━━[0m[90m╺[0m[90m━━━━━━━━━━━━━━━━━━━━━━━━━━━━━━━[0m [32m 2/10[0m [pillow]
[2K [91m━━━━━━━━[0m[90m╺[0m[90m━━━━━━━━━━━━━━━━━━━━━━━━━━━━━━━[0m [32m 2/10[0m [pillow]
[2K [91m━━━━━━━━━━━━━━━━[0m[90m╺[0m[90m━━━━━━━━━━━━━━━━━━━━━━━[0m [32m 4/10[0m [numpy]
[2K [91m━━━━━━━━━━━━━━━━[0m[90m╺[0m[90m━━━━━━━━━━━━━━━━━━━━━━━[0m [32m 4/10[0m [numpy]
[2K [91m━━━━━━━━━━━━━━━━[0m[90m╺[0m[90m━━━━━━━━━━━━━━━━━━━━━━━[0m [32m 4/10[0m [numpy]
[2K [91m━━━━━━━━━━━━━━━━[0m[90m╺[0m[90m━━━━━━━━━━━━━━━━━━━━━━━[0m [32m 4/10[0m [numpy]
[2K [91m━━━━━━━━━━━━━━━━[0m[90m╺[0m[90m━━━━━━━━━━━━━━━━━━━━━━━[0m [32m 4/10[0m [numpy]
[2K [91m━━━━━━━━━━━━━━━━[0m[90m╺[0m[90m━━━━━━━━━━━━━━━━━━━━━━━[0m [32m 4/10[0m [numpy]
[2K [91m━━━━━━━━━━━━━━━━[0m[90m╺[0m[90m━━━━━━━━━━━━━━━━━━━━━━━[0m [32m 4/10[0m [numpy]
[2K [91m━━━━━━━━━━━━━━━━[0m[90m╺[0m[90m━━━━━━━━━━━━━━━━━━━━━━━[0m [32m 4/10[0m [numpy]
[2K [91m━━━━━━━━━━━━━━━━[0m[90m╺[0m[90m━━━━━━━━━━━━━━━━━━━━━━━[0m [32m 4/10[0m [numpy]
[2K [91m━━━━━━━━━━━━━━━━[0m[90m╺[0m[90m━━━━━━━━━━━━━━━━━━━━━━━[0m [32m 4/10[0m [numpy]
[2K [91m━━━━━━━━━━━━━━━━[0m[90m╺[0m[90m━━━━━━━━━━━━━━━━━━━━━━━[0m [32m 4/10[0m [numpy]
[2K [91m━━━━━━━━━━━━━━━━[0m[90m╺[0m[90m━━━━━━━━━━━━━━━━━━━━━━━[0m [32m 4/10[0m [numpy]
[2K [91m━━━━━━━━━━━━━━━━[0m[90m╺[0m[90m━━━━━━━━━━━━━━━━━━━━━━━[0m [32m 4/10[0m [numpy]
[2K [91m━━━━━━━━━━━━━━━━[0m[90m╺[0m[90m━━━━━━━━━━━━━━━━━━━━━━━[0m [32m 4/10[0m [numpy]
[2K [91m━━━━━━━━━━━━━━━━[0m[90m╺[0m[90m━━━━━━━━━━━━━━━━━━━━━━━[0m [32m 4/10[0m [numpy]
[2K [91m━━━━━━━━━━━━━━━━[0m[90m╺[0m[90m━━━━━━━━━━━━━━━━━━━━━━━[0m [32m 4/10[0m [numpy]
[2K [91m━━━━━━━━━━━━━━━━━━━━━━━━[0m[90m╺[0m[90m━━━━━━━━━━━━━━━[0m [32m 6/10[0m [fonttools]
[2K [91m━━━━━━━━━━━━━━━━━━━━━━━━[0m[90m╺[0m[90m━━━━━━━━━━━━━━━[0m [32m 6/10[0m [fonttools]
[2K [91m━━━━━━━━━━━━━━━━━━━━━━━━[0m[90m╺[0m[90m━━━━━━━━━━━━━━━[0m [32m 6/10[0m [fonttools]
[2K [91m━━━━━━━━━━━━━━━━━━━━━━━━[0m[90m╺[0m[90m━━━━━━━━━━━━━━━[0m [32m 6/10[0m [fonttools]
[2K [91m━━━━━━━━━━━━━━━━━━━━━━━━[0m[90m╺[0m[90m━━━━━━━━━━━━━━━[0m [32m 6/10[0m [fonttools]
[2K [91m━━━━━━━━━━━━━━━━━━━━━━━━[0m[90m╺[0m[90m━━━━━━━━━━━━━━━[0m [32m 6/10[0m [fonttools]
[2K [91m━━━━━━━━━━━━━━━━━━━━━━━━━━━━━━━━[0m[90m╺[0m[90m━━━━━━━[0m [32m 8/10[0m [contourpy]
[2K [91m━━━━━━━━━━━━━━━━━━━━━━━━━━━━━━━━━━━━[0m[90m╺[0m[90m━━━[0m [32m 9/10[0m [matplotlib]
[2K [91m━━━━━━━━━━━━━━━━━━━━━━━━━━━━━━━━━━━━[0m[90m╺[0m[90m━━━[0m [32m 9/10[0m [matplotlib]
[2K [91m━━━━━━━━━━━━━━━━━━━━━━━━━━━━━━━━━━━━[0m[90m╺[0m[90m━━━[0m [32m 9/10[0m [matplotlib]
[2K [91m━━━━━━━━━━━━━━━━━━━━━━━━━━━━━━━━━━━━[0m[90m╺[0m[90m━━━[0m [32m 9/10[0m [matplotlib]
[2K [91m━━━━━━━━━━━━━━━━━━━━━━━━━━━━━━━━━━━━[0m[90m╺[0m[90m━━━[0m [32m 9/10[0m [matplotlib]
[2K [91m━━━━━━━━━━━━━━━━━━━━━━━━━━━━━━━━━━━━[0m[90m╺[0m[90m━━━[0m [32m 9/10[0m [matplotlib]
[2K [91m━━━━━━━━━━━━━━━━━━━━━━━━━━━━━━━━━━━━[0m[90m╺[0m[90m━━━[0m [32m 9/10[0m [matplotlib]
[2K [91m━━━━━━━━━━━━━━━━━━━━━━━━━━━━━━━━━━━━[0m[90m╺[0m[90m━━━[0m [32m 9/10[0m [matplotlib]
[2K [91m━━━━━━━━━━━━━━━━━━━━━━━━━━━━━━━━━━━━[0m[90m╺[0m[90m━━━[0m [32m 9/10[0m [matplotlib]
[2K [91m━━━━━━━━━━━━━━━━━━━━━━━━━━━━━━━━━━━━[0m[90m╺[0m[90m━━━[0m [32m 9/10[0m [matplotlib]
[2K [90m━━━━━━━━━━━━━━━━━━━━━━━━━━━━━━━━━━━━━━━━[0m [32m10/10[0m [matplotlib]
Step #6 - "compile-libfuzzer-introspector-x86_64": [?25h
[1A[2KSuccessfully installed contourpy-1.3.3 cycler-0.12.1 fonttools-4.59.0 kiwisolver-1.4.8 matplotlib-3.10.5 numpy-2.3.2 packaging-25.0 pillow-11.3.0 pyparsing-3.2.3 python-dateutil-2.9.0.post0
Step #6 - "compile-libfuzzer-introspector-x86_64": [33mWARNING: Running pip as the 'root' user can result in broken permissions and conflicting behaviour with the system package manager, possibly rendering your system unusable. It is recommended to use a virtual environment instead: https://pip.pypa.io/warnings/venv. Use the --root-user-action option if you know what you are doing and want to suppress this warning.[0m[33m
Step #6 - "compile-libfuzzer-introspector-x86_64": [0m/fuzz-introspector/src /src
Step #6 - "compile-libfuzzer-introspector-x86_64": Obtaining file:///fuzz-introspector/src
Step #6 - "compile-libfuzzer-introspector-x86_64": Installing build dependencies ... [?25l- \ | done
Step #6 - "compile-libfuzzer-introspector-x86_64": [?25h Checking if build backend supports build_editable ... [?25ldone
Step #6 - "compile-libfuzzer-introspector-x86_64": [?25h Getting requirements to build editable ... [?25l- done
Step #6 - "compile-libfuzzer-introspector-x86_64": [?25h Preparing editable metadata (pyproject.toml) ... [?25l- done
Step #6 - "compile-libfuzzer-introspector-x86_64": [?25hCollecting beautifulsoup4==4.10.0 (from fuzz-introspector==0.1.10)
Step #6 - "compile-libfuzzer-introspector-x86_64": Downloading beautifulsoup4-4.10.0-py3-none-any.whl.metadata (3.5 kB)
Step #6 - "compile-libfuzzer-introspector-x86_64": Requirement already satisfied: cxxfilt==0.3.0 in /usr/local/lib/python3.11/site-packages (from fuzz-introspector==0.1.10) (0.3.0)
Step #6 - "compile-libfuzzer-introspector-x86_64": Collecting lxml==5.3.0 (from fuzz-introspector==0.1.10)
Step #6 - "compile-libfuzzer-introspector-x86_64": Downloading lxml-5.3.0-cp311-cp311-manylinux_2_28_x86_64.whl.metadata (3.8 kB)
Step #6 - "compile-libfuzzer-introspector-x86_64": Collecting matplotlib==3.10.0 (from fuzz-introspector==0.1.10)
Step #6 - "compile-libfuzzer-introspector-x86_64": Downloading matplotlib-3.10.0-cp311-cp311-manylinux_2_17_x86_64.manylinux2014_x86_64.whl.metadata (11 kB)
Step #6 - "compile-libfuzzer-introspector-x86_64": Requirement already satisfied: PyYAML==6.0.2 in /usr/local/lib/python3.11/site-packages (from fuzz-introspector==0.1.10) (6.0.2)
Step #6 - "compile-libfuzzer-introspector-x86_64": Collecting soupsieve==2.2.1 (from fuzz-introspector==0.1.10)
Step #6 - "compile-libfuzzer-introspector-x86_64": Downloading soupsieve-2.2.1-py3-none-any.whl.metadata (5.5 kB)
Step #6 - "compile-libfuzzer-introspector-x86_64": Collecting yapf==0.40.1 (from fuzz-introspector==0.1.10)
Step #6 - "compile-libfuzzer-introspector-x86_64": Downloading yapf-0.40.1-py3-none-any.whl.metadata (35 kB)
Step #6 - "compile-libfuzzer-introspector-x86_64": Collecting flake8 (from fuzz-introspector==0.1.10)
Step #6 - "compile-libfuzzer-introspector-x86_64": Downloading flake8-7.3.0-py2.py3-none-any.whl.metadata (3.8 kB)
Step #6 - "compile-libfuzzer-introspector-x86_64": Collecting pep8 (from fuzz-introspector==0.1.10)
Step #6 - "compile-libfuzzer-introspector-x86_64": Downloading pep8-1.7.1-py2.py3-none-any.whl.metadata (22 kB)
Step #6 - "compile-libfuzzer-introspector-x86_64": Collecting mypy (from fuzz-introspector==0.1.10)
Step #6 - "compile-libfuzzer-introspector-x86_64": Downloading mypy-1.17.1-cp311-cp311-manylinux2014_x86_64.manylinux_2_17_x86_64.manylinux_2_28_x86_64.whl.metadata (2.2 kB)
Step #6 - "compile-libfuzzer-introspector-x86_64": Collecting psutil (from fuzz-introspector==0.1.10)
Step #6 - "compile-libfuzzer-introspector-x86_64": Downloading psutil-7.0.0-cp36-abi3-manylinux_2_12_x86_64.manylinux2010_x86_64.manylinux_2_17_x86_64.manylinux2014_x86_64.whl.metadata (22 kB)
Step #6 - "compile-libfuzzer-introspector-x86_64": Collecting toml (from fuzz-introspector==0.1.10)
Step #6 - "compile-libfuzzer-introspector-x86_64": Downloading toml-0.10.2-py2.py3-none-any.whl.metadata (7.1 kB)
Step #6 - "compile-libfuzzer-introspector-x86_64": Collecting pytest (from fuzz-introspector==0.1.10)
Step #6 - "compile-libfuzzer-introspector-x86_64": Downloading pytest-8.4.1-py3-none-any.whl.metadata (7.7 kB)
Step #6 - "compile-libfuzzer-introspector-x86_64": Collecting sphinx==6.0.0 (from fuzz-introspector==0.1.10)
Step #6 - "compile-libfuzzer-introspector-x86_64": Downloading sphinx-6.0.0-py3-none-any.whl.metadata (6.2 kB)
Step #6 - "compile-libfuzzer-introspector-x86_64": Collecting sphinx_rtd_theme (from fuzz-introspector==0.1.10)
Step #6 - "compile-libfuzzer-introspector-x86_64": Downloading sphinx_rtd_theme-3.0.2-py2.py3-none-any.whl.metadata (4.4 kB)
Step #6 - "compile-libfuzzer-introspector-x86_64": Collecting configparser (from fuzz-introspector==0.1.10)
Step #6 - "compile-libfuzzer-introspector-x86_64": Downloading configparser-7.2.0-py3-none-any.whl.metadata (5.5 kB)
Step #6 - "compile-libfuzzer-introspector-x86_64": Collecting coverage (from fuzz-introspector==0.1.10)
Step #6 - "compile-libfuzzer-introspector-x86_64": Downloading coverage-7.10.2-cp311-cp311-manylinux1_x86_64.manylinux_2_28_x86_64.manylinux_2_5_x86_64.whl.metadata (8.9 kB)
Step #6 - "compile-libfuzzer-introspector-x86_64": Requirement already satisfied: setuptools>=65.5.1 in /usr/local/lib/python3.11/site-packages (from fuzz-introspector==0.1.10) (80.9.0)
Step #6 - "compile-libfuzzer-introspector-x86_64": Collecting tqdm (from fuzz-introspector==0.1.10)
Step #6 - "compile-libfuzzer-introspector-x86_64": Downloading tqdm-4.67.1-py3-none-any.whl.metadata (57 kB)
Step #6 - "compile-libfuzzer-introspector-x86_64": Requirement already satisfied: rust-demangler in /usr/local/lib/python3.11/site-packages (from fuzz-introspector==0.1.10) (1.0)
Step #6 - "compile-libfuzzer-introspector-x86_64": Collecting numpy==2.1.0 (from fuzz-introspector==0.1.10)
Step #6 - "compile-libfuzzer-introspector-x86_64": Downloading numpy-2.1.0-cp311-cp311-manylinux_2_17_x86_64.manylinux2014_x86_64.whl.metadata (60 kB)
Step #6 - "compile-libfuzzer-introspector-x86_64": Collecting tree-sitter==0.23.2 (from fuzz-introspector==0.1.10)
Step #6 - "compile-libfuzzer-introspector-x86_64": Downloading tree_sitter-0.23.2-cp311-cp311-manylinux_2_17_x86_64.manylinux2014_x86_64.whl.metadata (9.8 kB)
Step #6 - "compile-libfuzzer-introspector-x86_64": Collecting tree-sitter-python==0.23.6 (from fuzz-introspector==0.1.10)
Step #6 - "compile-libfuzzer-introspector-x86_64": Downloading tree_sitter_python-0.23.6-cp39-abi3-manylinux_2_5_x86_64.manylinux1_x86_64.manylinux_2_17_x86_64.manylinux2014_x86_64.whl.metadata (1.9 kB)
Step #6 - "compile-libfuzzer-introspector-x86_64": Collecting networkx (from fuzz-introspector==0.1.10)
Step #6 - "compile-libfuzzer-introspector-x86_64": Downloading networkx-3.5-py3-none-any.whl.metadata (6.3 kB)
Step #6 - "compile-libfuzzer-introspector-x86_64": Collecting tree-sitter-languages==1.10.2 (from fuzz-introspector==0.1.10)
Step #6 - "compile-libfuzzer-introspector-x86_64": Downloading tree_sitter_languages-1.10.2-cp311-cp311-manylinux_2_17_x86_64.manylinux2014_x86_64.whl.metadata (10 kB)
Step #6 - "compile-libfuzzer-introspector-x86_64": Collecting tree-sitter-cpp==0.23.4 (from fuzz-introspector==0.1.10)
Step #6 - "compile-libfuzzer-introspector-x86_64": Downloading tree_sitter_cpp-0.23.4-cp39-abi3-manylinux_2_17_x86_64.manylinux2014_x86_64.whl.metadata (1.8 kB)
Step #6 - "compile-libfuzzer-introspector-x86_64": Collecting tree-sitter-go==0.23.4 (from fuzz-introspector==0.1.10)
Step #6 - "compile-libfuzzer-introspector-x86_64": Downloading tree_sitter_go-0.23.4-cp39-abi3-manylinux_2_5_x86_64.manylinux1_x86_64.manylinux_2_17_x86_64.manylinux2014_x86_64.whl.metadata (1.7 kB)
Step #6 - "compile-libfuzzer-introspector-x86_64": Collecting tree-sitter-java==0.23.5 (from fuzz-introspector==0.1.10)
Step #6 - "compile-libfuzzer-introspector-x86_64": Downloading tree_sitter_java-0.23.5-cp39-abi3-manylinux_2_5_x86_64.manylinux1_x86_64.manylinux_2_17_x86_64.manylinux2014_x86_64.whl.metadata (1.7 kB)
Step #6 - "compile-libfuzzer-introspector-x86_64": Collecting tree-sitter-rust==0.23.2 (from fuzz-introspector==0.1.10)
Step #6 - "compile-libfuzzer-introspector-x86_64": Downloading tree_sitter_rust-0.23.2-cp39-abi3-manylinux_2_5_x86_64.manylinux1_x86_64.manylinux_2_17_x86_64.manylinux2014_x86_64.whl.metadata (2.8 kB)
Step #6 - "compile-libfuzzer-introspector-x86_64": Requirement already satisfied: contourpy>=1.0.1 in /usr/local/lib/python3.11/site-packages (from matplotlib==3.10.0->fuzz-introspector==0.1.10) (1.3.3)
Step #6 - "compile-libfuzzer-introspector-x86_64": Requirement already satisfied: cycler>=0.10 in /usr/local/lib/python3.11/site-packages (from matplotlib==3.10.0->fuzz-introspector==0.1.10) (0.12.1)
Step #6 - "compile-libfuzzer-introspector-x86_64": Requirement already satisfied: fonttools>=4.22.0 in /usr/local/lib/python3.11/site-packages (from matplotlib==3.10.0->fuzz-introspector==0.1.10) (4.59.0)
Step #6 - "compile-libfuzzer-introspector-x86_64": Requirement already satisfied: kiwisolver>=1.3.1 in /usr/local/lib/python3.11/site-packages (from matplotlib==3.10.0->fuzz-introspector==0.1.10) (1.4.8)
Step #6 - "compile-libfuzzer-introspector-x86_64": Requirement already satisfied: packaging>=20.0 in /usr/local/lib/python3.11/site-packages (from matplotlib==3.10.0->fuzz-introspector==0.1.10) (25.0)
Step #6 - "compile-libfuzzer-introspector-x86_64": Requirement already satisfied: pillow>=8 in /usr/local/lib/python3.11/site-packages (from matplotlib==3.10.0->fuzz-introspector==0.1.10) (11.3.0)
Step #6 - "compile-libfuzzer-introspector-x86_64": Requirement already satisfied: pyparsing>=2.3.1 in /usr/local/lib/python3.11/site-packages (from matplotlib==3.10.0->fuzz-introspector==0.1.10) (3.2.3)
Step #6 - "compile-libfuzzer-introspector-x86_64": Requirement already satisfied: python-dateutil>=2.7 in /usr/local/lib/python3.11/site-packages (from matplotlib==3.10.0->fuzz-introspector==0.1.10) (2.9.0.post0)
Step #6 - "compile-libfuzzer-introspector-x86_64": Collecting sphinxcontrib-applehelp (from sphinx==6.0.0->fuzz-introspector==0.1.10)
Step #6 - "compile-libfuzzer-introspector-x86_64": Downloading sphinxcontrib_applehelp-2.0.0-py3-none-any.whl.metadata (2.3 kB)
Step #6 - "compile-libfuzzer-introspector-x86_64": Collecting sphinxcontrib-devhelp (from sphinx==6.0.0->fuzz-introspector==0.1.10)
Step #6 - "compile-libfuzzer-introspector-x86_64": Downloading sphinxcontrib_devhelp-2.0.0-py3-none-any.whl.metadata (2.3 kB)
Step #6 - "compile-libfuzzer-introspector-x86_64": Collecting sphinxcontrib-jsmath (from sphinx==6.0.0->fuzz-introspector==0.1.10)
Step #6 - "compile-libfuzzer-introspector-x86_64": Downloading sphinxcontrib_jsmath-1.0.1-py2.py3-none-any.whl.metadata (1.4 kB)
Step #6 - "compile-libfuzzer-introspector-x86_64": Collecting sphinxcontrib-htmlhelp>=2.0.0 (from sphinx==6.0.0->fuzz-introspector==0.1.10)
Step #6 - "compile-libfuzzer-introspector-x86_64": Downloading sphinxcontrib_htmlhelp-2.1.0-py3-none-any.whl.metadata (2.3 kB)
Step #6 - "compile-libfuzzer-introspector-x86_64": Collecting sphinxcontrib-serializinghtml>=1.1.5 (from sphinx==6.0.0->fuzz-introspector==0.1.10)
Step #6 - "compile-libfuzzer-introspector-x86_64": Downloading sphinxcontrib_serializinghtml-2.0.0-py3-none-any.whl.metadata (2.4 kB)
Step #6 - "compile-libfuzzer-introspector-x86_64": Collecting sphinxcontrib-qthelp (from sphinx==6.0.0->fuzz-introspector==0.1.10)
Step #6 - "compile-libfuzzer-introspector-x86_64": Downloading sphinxcontrib_qthelp-2.0.0-py3-none-any.whl.metadata (2.3 kB)
Step #6 - "compile-libfuzzer-introspector-x86_64": Collecting Jinja2>=3.0 (from sphinx==6.0.0->fuzz-introspector==0.1.10)
Step #6 - "compile-libfuzzer-introspector-x86_64": Downloading jinja2-3.1.6-py3-none-any.whl.metadata (2.9 kB)
Step #6 - "compile-libfuzzer-introspector-x86_64": Collecting Pygments>=2.12 (from sphinx==6.0.0->fuzz-introspector==0.1.10)
Step #6 - "compile-libfuzzer-introspector-x86_64": Downloading pygments-2.19.2-py3-none-any.whl.metadata (2.5 kB)
Step #6 - "compile-libfuzzer-introspector-x86_64": Collecting docutils<0.20,>=0.18 (from sphinx==6.0.0->fuzz-introspector==0.1.10)
Step #6 - "compile-libfuzzer-introspector-x86_64": Downloading docutils-0.19-py3-none-any.whl.metadata (2.7 kB)
Step #6 - "compile-libfuzzer-introspector-x86_64": Collecting snowballstemmer>=2.0 (from sphinx==6.0.0->fuzz-introspector==0.1.10)
Step #6 - "compile-libfuzzer-introspector-x86_64": Downloading snowballstemmer-3.0.1-py3-none-any.whl.metadata (7.9 kB)
Step #6 - "compile-libfuzzer-introspector-x86_64": Collecting babel>=2.9 (from sphinx==6.0.0->fuzz-introspector==0.1.10)
Step #6 - "compile-libfuzzer-introspector-x86_64": Downloading babel-2.17.0-py3-none-any.whl.metadata (2.0 kB)
Step #6 - "compile-libfuzzer-introspector-x86_64": Collecting alabaster<0.8,>=0.7 (from sphinx==6.0.0->fuzz-introspector==0.1.10)
Step #6 - "compile-libfuzzer-introspector-x86_64": Downloading alabaster-0.7.16-py3-none-any.whl.metadata (2.9 kB)
Step #6 - "compile-libfuzzer-introspector-x86_64": Collecting imagesize>=1.3 (from sphinx==6.0.0->fuzz-introspector==0.1.10)
Step #6 - "compile-libfuzzer-introspector-x86_64": Downloading imagesize-1.4.1-py2.py3-none-any.whl.metadata (1.5 kB)
Step #6 - "compile-libfuzzer-introspector-x86_64": Collecting requests>=2.25.0 (from sphinx==6.0.0->fuzz-introspector==0.1.10)
Step #6 - "compile-libfuzzer-introspector-x86_64": Downloading requests-2.32.4-py3-none-any.whl.metadata (4.9 kB)
Step #6 - "compile-libfuzzer-introspector-x86_64": Collecting importlib-metadata>=6.6.0 (from yapf==0.40.1->fuzz-introspector==0.1.10)
Step #6 - "compile-libfuzzer-introspector-x86_64": Downloading importlib_metadata-8.7.0-py3-none-any.whl.metadata (4.8 kB)
Step #6 - "compile-libfuzzer-introspector-x86_64": Collecting platformdirs>=3.5.1 (from yapf==0.40.1->fuzz-introspector==0.1.10)
Step #6 - "compile-libfuzzer-introspector-x86_64": Downloading platformdirs-4.3.8-py3-none-any.whl.metadata (12 kB)
Step #6 - "compile-libfuzzer-introspector-x86_64": Collecting tomli>=2.0.1 (from yapf==0.40.1->fuzz-introspector==0.1.10)
Step #6 - "compile-libfuzzer-introspector-x86_64": Downloading tomli-2.2.1-cp311-cp311-manylinux_2_17_x86_64.manylinux2014_x86_64.whl.metadata (11 kB)
Step #6 - "compile-libfuzzer-introspector-x86_64": Collecting zipp>=3.20 (from importlib-metadata>=6.6.0->yapf==0.40.1->fuzz-introspector==0.1.10)
Step #6 - "compile-libfuzzer-introspector-x86_64": Downloading zipp-3.23.0-py3-none-any.whl.metadata (3.6 kB)
Step #6 - "compile-libfuzzer-introspector-x86_64": Collecting MarkupSafe>=2.0 (from Jinja2>=3.0->sphinx==6.0.0->fuzz-introspector==0.1.10)
Step #6 - "compile-libfuzzer-introspector-x86_64": Downloading MarkupSafe-3.0.2-cp311-cp311-manylinux_2_17_x86_64.manylinux2014_x86_64.whl.metadata (4.0 kB)
Step #6 - "compile-libfuzzer-introspector-x86_64": Requirement already satisfied: six>=1.5 in /usr/local/lib/python3.11/site-packages (from python-dateutil>=2.7->matplotlib==3.10.0->fuzz-introspector==0.1.10) (1.15.0)
Step #6 - "compile-libfuzzer-introspector-x86_64": Collecting charset_normalizer<4,>=2 (from requests>=2.25.0->sphinx==6.0.0->fuzz-introspector==0.1.10)
Step #6 - "compile-libfuzzer-introspector-x86_64": Downloading charset_normalizer-3.4.3-cp311-cp311-manylinux2014_x86_64.manylinux_2_17_x86_64.manylinux_2_28_x86_64.whl.metadata (36 kB)
Step #6 - "compile-libfuzzer-introspector-x86_64": Collecting idna<4,>=2.5 (from requests>=2.25.0->sphinx==6.0.0->fuzz-introspector==0.1.10)
Step #6 - "compile-libfuzzer-introspector-x86_64": Downloading idna-3.10-py3-none-any.whl.metadata (10 kB)
Step #6 - "compile-libfuzzer-introspector-x86_64": Collecting urllib3<3,>=1.21.1 (from requests>=2.25.0->sphinx==6.0.0->fuzz-introspector==0.1.10)
Step #6 - "compile-libfuzzer-introspector-x86_64": Downloading urllib3-2.5.0-py3-none-any.whl.metadata (6.5 kB)
Step #6 - "compile-libfuzzer-introspector-x86_64": Collecting certifi>=2017.4.17 (from requests>=2.25.0->sphinx==6.0.0->fuzz-introspector==0.1.10)
Step #6 - "compile-libfuzzer-introspector-x86_64": Downloading certifi-2025.8.3-py3-none-any.whl.metadata (2.4 kB)
Step #6 - "compile-libfuzzer-introspector-x86_64": Collecting mccabe<0.8.0,>=0.7.0 (from flake8->fuzz-introspector==0.1.10)
Step #6 - "compile-libfuzzer-introspector-x86_64": Downloading mccabe-0.7.0-py2.py3-none-any.whl.metadata (5.0 kB)
Step #6 - "compile-libfuzzer-introspector-x86_64": Collecting pycodestyle<2.15.0,>=2.14.0 (from flake8->fuzz-introspector==0.1.10)
Step #6 - "compile-libfuzzer-introspector-x86_64": Downloading pycodestyle-2.14.0-py2.py3-none-any.whl.metadata (4.5 kB)
Step #6 - "compile-libfuzzer-introspector-x86_64": Collecting pyflakes<3.5.0,>=3.4.0 (from flake8->fuzz-introspector==0.1.10)
Step #6 - "compile-libfuzzer-introspector-x86_64": Downloading pyflakes-3.4.0-py2.py3-none-any.whl.metadata (3.5 kB)
Step #6 - "compile-libfuzzer-introspector-x86_64": Requirement already satisfied: typing_extensions>=4.6.0 in /usr/local/lib/python3.11/site-packages (from mypy->fuzz-introspector==0.1.10) (4.14.1)
Step #6 - "compile-libfuzzer-introspector-x86_64": Collecting mypy_extensions>=1.0.0 (from mypy->fuzz-introspector==0.1.10)
Step #6 - "compile-libfuzzer-introspector-x86_64": Downloading mypy_extensions-1.1.0-py3-none-any.whl.metadata (1.1 kB)
Step #6 - "compile-libfuzzer-introspector-x86_64": Collecting pathspec>=0.9.0 (from mypy->fuzz-introspector==0.1.10)
Step #6 - "compile-libfuzzer-introspector-x86_64": Downloading pathspec-0.12.1-py3-none-any.whl.metadata (21 kB)
Step #6 - "compile-libfuzzer-introspector-x86_64": Collecting iniconfig>=1 (from pytest->fuzz-introspector==0.1.10)
Step #6 - "compile-libfuzzer-introspector-x86_64": Downloading iniconfig-2.1.0-py3-none-any.whl.metadata (2.7 kB)
Step #6 - "compile-libfuzzer-introspector-x86_64": Collecting pluggy<2,>=1.5 (from pytest->fuzz-introspector==0.1.10)
Step #6 - "compile-libfuzzer-introspector-x86_64": Downloading pluggy-1.6.0-py3-none-any.whl.metadata (4.8 kB)
Step #6 - "compile-libfuzzer-introspector-x86_64": Collecting sphinxcontrib-jquery<5,>=4 (from sphinx_rtd_theme->fuzz-introspector==0.1.10)
Step #6 - "compile-libfuzzer-introspector-x86_64": Downloading sphinxcontrib_jquery-4.1-py2.py3-none-any.whl.metadata (2.6 kB)
Step #6 - "compile-libfuzzer-introspector-x86_64": Downloading beautifulsoup4-4.10.0-py3-none-any.whl (97 kB)
Step #6 - "compile-libfuzzer-introspector-x86_64": Downloading lxml-5.3.0-cp311-cp311-manylinux_2_28_x86_64.whl (5.0 MB)
Step #6 - "compile-libfuzzer-introspector-x86_64": [?25l [90m━━━━━━━━━━━━━━━━━━━━━━━━━━━━━━━━━━━━━━━━[0m [32m0.0/5.0 MB[0m [31m?[0m eta [36m-:--:--[0m
[2K [90m━━━━━━━━━━━━━━━━━━━━━━━━━━━━━━━━━━━━━━━━[0m [32m5.0/5.0 MB[0m [31m81.5 MB/s[0m [33m0:00:00[0m
Step #6 - "compile-libfuzzer-introspector-x86_64": [?25hDownloading matplotlib-3.10.0-cp311-cp311-manylinux_2_17_x86_64.manylinux2014_x86_64.whl (8.6 MB)
Step #6 - "compile-libfuzzer-introspector-x86_64": [?25l [90m━━━━━━━━━━━━━━━━━━━━━━━━━━━━━━━━━━━━━━━━[0m [32m0.0/8.6 MB[0m [31m?[0m eta [36m-:--:--[0m
[2K [90m━━━━━━━━━━━━━━━━━━━━━━━━━━━━━━━━━━━━━━━━[0m [32m8.6/8.6 MB[0m [31m126.8 MB/s[0m [33m0:00:00[0m
Step #6 - "compile-libfuzzer-introspector-x86_64": [?25hDownloading numpy-2.1.0-cp311-cp311-manylinux_2_17_x86_64.manylinux2014_x86_64.whl (16.3 MB)
Step #6 - "compile-libfuzzer-introspector-x86_64": [?25l [90m━━━━━━━━━━━━━━━━━━━━━━━━━━━━━━━━━━━━━━━━[0m [32m0.0/16.3 MB[0m [31m?[0m eta [36m-:--:--[0m
[2K [90m━━━━━━━━━━━━━━━━━━━━━━━━━━━━━━━━━━━━━━━━[0m [32m16.3/16.3 MB[0m [31m152.0 MB/s[0m [33m0:00:00[0m
Step #6 - "compile-libfuzzer-introspector-x86_64": [?25hDownloading soupsieve-2.2.1-py3-none-any.whl (33 kB)
Step #6 - "compile-libfuzzer-introspector-x86_64": Downloading sphinx-6.0.0-py3-none-any.whl (3.0 MB)
Step #6 - "compile-libfuzzer-introspector-x86_64": [?25l [90m━━━━━━━━━━━━━━━━━━━━━━━━━━━━━━━━━━━━━━━━[0m [32m0.0/3.0 MB[0m [31m?[0m eta [36m-:--:--[0m
[2K [90m━━━━━━━━━━━━━━━━━━━━━━━━━━━━━━━━━━━━━━━━[0m [32m3.0/3.0 MB[0m [31m129.9 MB/s[0m [33m0:00:00[0m
Step #6 - "compile-libfuzzer-introspector-x86_64": [?25hDownloading tree_sitter-0.23.2-cp311-cp311-manylinux_2_17_x86_64.manylinux2014_x86_64.whl (567 kB)
Step #6 - "compile-libfuzzer-introspector-x86_64": [?25l [90m━━━━━━━━━━━━━━━━━━━━━━━━━━━━━━━━━━━━━━━━[0m [32m0.0/567.6 kB[0m [31m?[0m eta [36m-:--:--[0m
[2K [90m━━━━━━━━━━━━━━━━━━━━━━━━━━━━━━━━━━━━━━━━[0m [32m567.6/567.6 kB[0m [31m32.0 MB/s[0m [33m0:00:00[0m
Step #6 - "compile-libfuzzer-introspector-x86_64": [?25hDownloading tree_sitter_cpp-0.23.4-cp39-abi3-manylinux_2_17_x86_64.manylinux2014_x86_64.whl (316 kB)
Step #6 - "compile-libfuzzer-introspector-x86_64": Downloading tree_sitter_go-0.23.4-cp39-abi3-manylinux_2_5_x86_64.manylinux1_x86_64.manylinux_2_17_x86_64.manylinux2014_x86_64.whl (65 kB)
Step #6 - "compile-libfuzzer-introspector-x86_64": Downloading tree_sitter_java-0.23.5-cp39-abi3-manylinux_2_5_x86_64.manylinux1_x86_64.manylinux_2_17_x86_64.manylinux2014_x86_64.whl (84 kB)
Step #6 - "compile-libfuzzer-introspector-x86_64": Downloading tree_sitter_languages-1.10.2-cp311-cp311-manylinux_2_17_x86_64.manylinux2014_x86_64.whl (8.4 MB)
Step #6 - "compile-libfuzzer-introspector-x86_64": [?25l [90m━━━━━━━━━━━━━━━━━━━━━━━━━━━━━━━━━━━━━━━━[0m [32m0.0/8.4 MB[0m [31m?[0m eta [36m-:--:--[0m
[2K [90m━━━━━━━━━━━━━━━━━━━━━━━━━━━━━━━━━━━━━━━━[0m [32m8.4/8.4 MB[0m [31m142.3 MB/s[0m [33m0:00:00[0m
Step #6 - "compile-libfuzzer-introspector-x86_64": [?25hDownloading tree_sitter_python-0.23.6-cp39-abi3-manylinux_2_5_x86_64.manylinux1_x86_64.manylinux_2_17_x86_64.manylinux2014_x86_64.whl (112 kB)
Step #6 - "compile-libfuzzer-introspector-x86_64": Downloading tree_sitter_rust-0.23.2-cp39-abi3-manylinux_2_5_x86_64.manylinux1_x86_64.manylinux_2_17_x86_64.manylinux2014_x86_64.whl (157 kB)
Step #6 - "compile-libfuzzer-introspector-x86_64": Downloading yapf-0.40.1-py3-none-any.whl (250 kB)
Step #6 - "compile-libfuzzer-introspector-x86_64": Downloading alabaster-0.7.16-py3-none-any.whl (13 kB)
Step #6 - "compile-libfuzzer-introspector-x86_64": Downloading docutils-0.19-py3-none-any.whl (570 kB)
Step #6 - "compile-libfuzzer-introspector-x86_64": [?25l [90m━━━━━━━━━━━━━━━━━━━━━━━━━━━━━━━━━━━━━━━━[0m [32m0.0/570.5 kB[0m [31m?[0m eta [36m-:--:--[0m
[2K [90m━━━━━━━━━━━━━━━━━━━━━━━━━━━━━━━━━━━━━━━━[0m [32m570.5/570.5 kB[0m [31m33.2 MB/s[0m [33m0:00:00[0m
Step #6 - "compile-libfuzzer-introspector-x86_64": [?25hDownloading babel-2.17.0-py3-none-any.whl (10.2 MB)
Step #6 - "compile-libfuzzer-introspector-x86_64": [?25l [90m━━━━━━━━━━━━━━━━━━━━━━━━━━━━━━━━━━━━━━━━[0m [32m0.0/10.2 MB[0m [31m?[0m eta [36m-:--:--[0m
[2K [90m━━━━━━━━━━━━━━━━━━━━━━━━━━━━━━━━━━━━━━━━[0m [32m10.2/10.2 MB[0m [31m134.8 MB/s[0m [33m0:00:00[0m
Step #6 - "compile-libfuzzer-introspector-x86_64": [?25hDownloading imagesize-1.4.1-py2.py3-none-any.whl (8.8 kB)
Step #6 - "compile-libfuzzer-introspector-x86_64": Downloading importlib_metadata-8.7.0-py3-none-any.whl (27 kB)
Step #6 - "compile-libfuzzer-introspector-x86_64": Downloading jinja2-3.1.6-py3-none-any.whl (134 kB)
Step #6 - "compile-libfuzzer-introspector-x86_64": Downloading MarkupSafe-3.0.2-cp311-cp311-manylinux_2_17_x86_64.manylinux2014_x86_64.whl (23 kB)
Step #6 - "compile-libfuzzer-introspector-x86_64": Downloading platformdirs-4.3.8-py3-none-any.whl (18 kB)
Step #6 - "compile-libfuzzer-introspector-x86_64": Downloading pygments-2.19.2-py3-none-any.whl (1.2 MB)
Step #6 - "compile-libfuzzer-introspector-x86_64": [?25l [90m━━━━━━━━━━━━━━━━━━━━━━━━━━━━━━━━━━━━━━━━[0m [32m0.0/1.2 MB[0m [31m?[0m eta [36m-:--:--[0m
[2K [90m━━━━━━━━━━━━━━━━━━━━━━━━━━━━━━━━━━━━━━━━[0m [32m1.2/1.2 MB[0m [31m75.8 MB/s[0m [33m0:00:00[0m
Step #6 - "compile-libfuzzer-introspector-x86_64": [?25hDownloading requests-2.32.4-py3-none-any.whl (64 kB)
Step #6 - "compile-libfuzzer-introspector-x86_64": Downloading charset_normalizer-3.4.3-cp311-cp311-manylinux2014_x86_64.manylinux_2_17_x86_64.manylinux_2_28_x86_64.whl (150 kB)
Step #6 - "compile-libfuzzer-introspector-x86_64": Downloading idna-3.10-py3-none-any.whl (70 kB)
Step #6 - "compile-libfuzzer-introspector-x86_64": Downloading urllib3-2.5.0-py3-none-any.whl (129 kB)
Step #6 - "compile-libfuzzer-introspector-x86_64": Downloading certifi-2025.8.3-py3-none-any.whl (161 kB)
Step #6 - "compile-libfuzzer-introspector-x86_64": Downloading snowballstemmer-3.0.1-py3-none-any.whl (103 kB)
Step #6 - "compile-libfuzzer-introspector-x86_64": Downloading sphinxcontrib_htmlhelp-2.1.0-py3-none-any.whl (98 kB)
Step #6 - "compile-libfuzzer-introspector-x86_64": Downloading sphinxcontrib_serializinghtml-2.0.0-py3-none-any.whl (92 kB)
Step #6 - "compile-libfuzzer-introspector-x86_64": Downloading tomli-2.2.1-cp311-cp311-manylinux_2_17_x86_64.manylinux2014_x86_64.whl (236 kB)
Step #6 - "compile-libfuzzer-introspector-x86_64": Downloading zipp-3.23.0-py3-none-any.whl (10 kB)
Step #6 - "compile-libfuzzer-introspector-x86_64": Downloading configparser-7.2.0-py3-none-any.whl (17 kB)
Step #6 - "compile-libfuzzer-introspector-x86_64": Downloading coverage-7.10.2-cp311-cp311-manylinux1_x86_64.manylinux_2_28_x86_64.manylinux_2_5_x86_64.whl (247 kB)
Step #6 - "compile-libfuzzer-introspector-x86_64": Downloading flake8-7.3.0-py2.py3-none-any.whl (57 kB)
Step #6 - "compile-libfuzzer-introspector-x86_64": Downloading mccabe-0.7.0-py2.py3-none-any.whl (7.3 kB)
Step #6 - "compile-libfuzzer-introspector-x86_64": Downloading pycodestyle-2.14.0-py2.py3-none-any.whl (31 kB)
Step #6 - "compile-libfuzzer-introspector-x86_64": Downloading pyflakes-3.4.0-py2.py3-none-any.whl (63 kB)
Step #6 - "compile-libfuzzer-introspector-x86_64": Downloading mypy-1.17.1-cp311-cp311-manylinux2014_x86_64.manylinux_2_17_x86_64.manylinux_2_28_x86_64.whl (12.6 MB)
Step #6 - "compile-libfuzzer-introspector-x86_64": [?25l [90m━━━━━━━━━━━━━━━━━━━━━━━━━━━━━━━━━━━━━━━━[0m [32m0.0/12.6 MB[0m [31m?[0m eta [36m-:--:--[0m
[2K [90m━━━━━━━━━━━━━━━━━━━━━━━━━━━━━━━━━━━━━━━━[0m [32m12.6/12.6 MB[0m [31m154.5 MB/s[0m [33m0:00:00[0m
Step #6 - "compile-libfuzzer-introspector-x86_64": [?25hDownloading mypy_extensions-1.1.0-py3-none-any.whl (5.0 kB)
Step #6 - "compile-libfuzzer-introspector-x86_64": Downloading pathspec-0.12.1-py3-none-any.whl (31 kB)
Step #6 - "compile-libfuzzer-introspector-x86_64": Downloading networkx-3.5-py3-none-any.whl (2.0 MB)
Step #6 - "compile-libfuzzer-introspector-x86_64": [?25l [90m━━━━━━━━━━━━━━━━━━━━━━━━━━━━━━━━━━━━━━━━[0m [32m0.0/2.0 MB[0m [31m?[0m eta [36m-:--:--[0m
[2K [90m━━━━━━━━━━━━━━━━━━━━━━━━━━━━━━━━━━━━━━━━[0m [32m2.0/2.0 MB[0m [31m105.3 MB/s[0m [33m0:00:00[0m
Step #6 - "compile-libfuzzer-introspector-x86_64": [?25hDownloading pep8-1.7.1-py2.py3-none-any.whl (41 kB)
Step #6 - "compile-libfuzzer-introspector-x86_64": Downloading psutil-7.0.0-cp36-abi3-manylinux_2_12_x86_64.manylinux2010_x86_64.manylinux_2_17_x86_64.manylinux2014_x86_64.whl (277 kB)
Step #6 - "compile-libfuzzer-introspector-x86_64": Downloading pytest-8.4.1-py3-none-any.whl (365 kB)
Step #6 - "compile-libfuzzer-introspector-x86_64": Downloading pluggy-1.6.0-py3-none-any.whl (20 kB)
Step #6 - "compile-libfuzzer-introspector-x86_64": Downloading iniconfig-2.1.0-py3-none-any.whl (6.0 kB)
Step #6 - "compile-libfuzzer-introspector-x86_64": Downloading sphinx_rtd_theme-3.0.2-py2.py3-none-any.whl (7.7 MB)
Step #6 - "compile-libfuzzer-introspector-x86_64": [?25l [90m━━━━━━━━━━━━━━━━━━━━━━━━━━━━━━━━━━━━━━━━[0m [32m0.0/7.7 MB[0m [31m?[0m eta [36m-:--:--[0m
[2K [90m━━━━━━━━━━━━━━━━━━━━━━━━━━━━━━━━━━━━━━━━[0m [32m7.7/7.7 MB[0m [31m145.3 MB/s[0m [33m0:00:00[0m
Step #6 - "compile-libfuzzer-introspector-x86_64": [?25hDownloading sphinxcontrib_jquery-4.1-py2.py3-none-any.whl (121 kB)
Step #6 - "compile-libfuzzer-introspector-x86_64": Downloading sphinxcontrib_applehelp-2.0.0-py3-none-any.whl (119 kB)
Step #6 - "compile-libfuzzer-introspector-x86_64": Downloading sphinxcontrib_devhelp-2.0.0-py3-none-any.whl (82 kB)
Step #6 - "compile-libfuzzer-introspector-x86_64": Downloading sphinxcontrib_jsmath-1.0.1-py2.py3-none-any.whl (5.1 kB)
Step #6 - "compile-libfuzzer-introspector-x86_64": Downloading sphinxcontrib_qthelp-2.0.0-py3-none-any.whl (88 kB)
Step #6 - "compile-libfuzzer-introspector-x86_64": Downloading toml-0.10.2-py2.py3-none-any.whl (16 kB)
Step #6 - "compile-libfuzzer-introspector-x86_64": Downloading tqdm-4.67.1-py3-none-any.whl (78 kB)
Step #6 - "compile-libfuzzer-introspector-x86_64": Building wheels for collected packages: fuzz-introspector
Step #6 - "compile-libfuzzer-introspector-x86_64": Building editable for fuzz-introspector (pyproject.toml) ... [?25l- done
Step #6 - "compile-libfuzzer-introspector-x86_64": [?25h Created wheel for fuzz-introspector: filename=fuzz_introspector-0.1.10-0.editable-py3-none-any.whl size=3905 sha256=155dfc61e64e167d16965d688524924f0535e59e286a436008d32c65d1074098
Step #6 - "compile-libfuzzer-introspector-x86_64": Stored in directory: /tmp/pip-ephem-wheel-cache-2zenwd9y/wheels/44/ee/b6/7a2a30503e5336c67773d206f572139af7f7e84341b0b70950
Step #6 - "compile-libfuzzer-introspector-x86_64": Successfully built fuzz-introspector
Step #6 - "compile-libfuzzer-introspector-x86_64": Installing collected packages: pep8, zipp, urllib3, tree-sitter-rust, tree-sitter-python, tree-sitter-java, tree-sitter-go, tree-sitter-cpp, tree-sitter, tqdm, tomli, toml, sphinxcontrib-serializinghtml, sphinxcontrib-qthelp, sphinxcontrib-jsmath, sphinxcontrib-htmlhelp, sphinxcontrib-devhelp, sphinxcontrib-applehelp, soupsieve, snowballstemmer, Pygments, pyflakes, pycodestyle, psutil, pluggy, platformdirs, pathspec, numpy, networkx, mypy_extensions, mccabe, MarkupSafe, lxml, iniconfig, imagesize, idna, docutils, coverage, configparser, charset_normalizer, certifi, babel, alabaster, tree-sitter-languages, requests, pytest, mypy, Jinja2, importlib-metadata, flake8, beautifulsoup4, yapf, sphinx, matplotlib, sphinxcontrib-jquery, sphinx_rtd_theme, fuzz-introspector
Step #6 - "compile-libfuzzer-introspector-x86_64": [?25l
[2K [91m━━━[0m[91m╸[0m[90m━━━━━━━━━━━━━━━━━━━━━━━━━━━━━━━━━━━━[0m [32m 5/57[0m [tree-sitter-java]
[2K [91m━━━━━━━━[0m[90m╺[0m[90m━━━━━━━━━━━━━━━━━━━━━━━━━━━━━━[0m [32m12/57[0m [sphinxcontrib-serializinghtml]
[2K Attempting uninstall: soupsieve
Step #6 - "compile-libfuzzer-introspector-x86_64": [91m━━━━━━━━[0m[90m╺[0m[90m━━━━━━━━━━━━━━━━━━━━━━━━━━━━━━[0m [32m12/57[0m [sphinxcontrib-serializinghtml]
[2K Found existing installation: soupsieve 2.7
Step #6 - "compile-libfuzzer-introspector-x86_64": [91m━━━━━━━━[0m[90m╺[0m[90m━━━━━━━━━━━━━━━━━━━━━━━━━━━━━━[0m [32m12/57[0m [sphinxcontrib-serializinghtml]
[2K [91m━━━━━━━━━━━━[0m[91m╸[0m[90m━━━━━━━━━━━━━━━━━━━━━━━━━━━[0m [32m18/57[0m [soupsieve]
[2K Uninstalling soupsieve-2.7:
Step #6 - "compile-libfuzzer-introspector-x86_64": [91m━━━━━━━━━━━━[0m[91m╸[0m[90m━━━━━━━━━━━━━━━━━━━━━━━━━━━[0m [32m18/57[0m [soupsieve]
[2K Successfully uninstalled soupsieve-2.7
Step #6 - "compile-libfuzzer-introspector-x86_64": [91m━━━━━━━━━━━━[0m[91m╸[0m[90m━━━━━━━━━━━━━━━━━━━━━━━━━━━[0m [32m18/57[0m [soupsieve]
[2K [91m━━━━━━━━━━━━━[0m[90m╺[0m[90m━━━━━━━━━━━━━━━━━━━━━━━━━━[0m [32m19/57[0m [snowballstemmer]
[2K [91m━━━━━━━━━━━━━━[0m[90m╺[0m[90m━━━━━━━━━━━━━━━━━━━━━━━━━[0m [32m20/57[0m [Pygments]
[2K [91m━━━━━━━━━━━━━━[0m[90m╺[0m[90m━━━━━━━━━━━━━━━━━━━━━━━━━[0m [32m20/57[0m [Pygments]
[2K [91m━━━━━━━━━━━━━━[0m[90m╺[0m[90m━━━━━━━━━━━━━━━━━━━━━━━━━[0m [32m20/57[0m [Pygments]
[2K [91m━━━━━━━━━━━━━━[0m[90m╺[0m[90m━━━━━━━━━━━━━━━━━━━━━━━━━[0m [32m20/57[0m [Pygments]
[2K [91m━━━━━━━━━━━━━━[0m[90m╺[0m[90m━━━━━━━━━━━━━━━━━━━━━━━━━[0m [32m20/57[0m [Pygments]
[2K [91m━━━━━━━━━━━━━━[0m[91m╸[0m[90m━━━━━━━━━━━━━━━━━━━━━━━━━[0m [32m21/57[0m [pyflakes]
[2K [91m━━━━━━━━━━━━━━━━[0m[90m╺[0m[90m━━━━━━━━━━━━━━━━━━━━━━━[0m [32m23/57[0m [psutil]
[2K Attempting uninstall: numpy
Step #6 - "compile-libfuzzer-introspector-x86_64": [91m━━━━━━━━━━━━━━━━[0m[90m╺[0m[90m━━━━━━━━━━━━━━━━━━━━━━━[0m [32m23/57[0m [psutil]
[2K Found existing installation: numpy 2.3.2
Step #6 - "compile-libfuzzer-introspector-x86_64": [91m━━━━━━━━━━━━━━━━[0m[90m╺[0m[90m━━━━━━━━━━━━━━━━━━━━━━━[0m [32m23/57[0m [psutil]
[2K [91m━━━━━━━━━━━━━━━━━━[0m[91m╸[0m[90m━━━━━━━━━━━━━━━━━━━━━[0m [32m27/57[0m [numpy]
[2K Uninstalling numpy-2.3.2:
Step #6 - "compile-libfuzzer-introspector-x86_64": [91m━━━━━━━━━━━━━━━━━━[0m[91m╸[0m[90m━━━━━━━━━━━━━━━━━━━━━[0m [32m27/57[0m [numpy]
[2K Successfully uninstalled numpy-2.3.2
Step #6 - "compile-libfuzzer-introspector-x86_64": [91m━━━━━━━━━━━━━━━━━━[0m[91m╸[0m[90m━━━━━━━━━━━━━━━━━━━━━[0m [32m27/57[0m [numpy]
[2K [91m━━━━━━━━━━━━━━━━━━[0m[91m╸[0m[90m━━━━━━━━━━━━━━━━━━━━━[0m [32m27/57[0m [numpy]
[2K [91m━━━━━━━━━━━━━━━━━━[0m[91m╸[0m[90m━━━━━━━━━━━━━━━━━━━━━[0m [32m27/57[0m [numpy]
[2K [91m━━━━━━━━━━━━━━━━━━[0m[91m╸[0m[90m━━━━━━━━━━━━━━━━━━━━━[0m [32m27/57[0m [numpy]
[2K [91m━━━━━━━━━━━━━━━━━━[0m[91m╸[0m[90m━━━━━━━━━━━━━━━━━━━━━[0m [32m27/57[0m [numpy]
[2K [91m━━━━━━━━━━━━━━━━━━[0m[91m╸[0m[90m━━━━━━━━━━━━━━━━━━━━━[0m [32m27/57[0m [numpy]
[2K [91m━━━━━━━━━━━━━━━━━━[0m[91m╸[0m[90m━━━━━━━━━━━━━━━━━━━━━[0m [32m27/57[0m [numpy]
[2K [91m━━━━━━━━━━━━━━━━━━[0m[91m╸[0m[90m━━━━━━━━━━━━━━━━━━━━━[0m [32m27/57[0m [numpy]
[2K [91m━━━━━━━━━━━━━━━━━━[0m[91m╸[0m[90m━━━━━━━━━━━━━━━━━━━━━[0m [32m27/57[0m [numpy]
[2K [91m━━━━━━━━━━━━━━━━━━[0m[91m╸[0m[90m━━━━━━━━━━━━━━━━━━━━━[0m [32m27/57[0m [numpy]
[2K [91m━━━━━━━━━━━━━━━━━━[0m[91m╸[0m[90m━━━━━━━━━━━━━━━━━━━━━[0m [32m27/57[0m [numpy]
[2K [91m━━━━━━━━━━━━━━━━━━[0m[91m╸[0m[90m━━━━━━━━━━━━━━━━━━━━━[0m [32m27/57[0m [numpy]
[2K [91m━━━━━━━━━━━━━━━━━━[0m[91m╸[0m[90m━━━━━━━━━━━━━━━━━━━━━[0m [32m27/57[0m [numpy]
[2K [91m━━━━━━━━━━━━━━━━━━[0m[91m╸[0m[90m━━━━━━━━━━━━━━━━━━━━━[0m [32m27/57[0m [numpy]
[2K [91m━━━━━━━━━━━━━━━━━━[0m[91m╸[0m[90m━━━━━━━━━━━━━━━━━━━━━[0m [32m27/57[0m [numpy]
[2K [91m━━━━━━━━━━━━━━━━━━[0m[91m╸[0m[90m━━━━━━━━━━━━━━━━━━━━━[0m [32m27/57[0m [numpy]
[2K [91m━━━━━━━━━━━━━━━━━━[0m[91m╸[0m[90m━━━━━━━━━━━━━━━━━━━━━[0m [32m27/57[0m [numpy]
[2K [91m━━━━━━━━━━━━━━━━━━━[0m[91m╸[0m[90m━━━━━━━━━━━━━━━━━━━━[0m [32m28/57[0m [networkx]
[2K [91m━━━━━━━━━━━━━━━━━━━[0m[91m╸[0m[90m━━━━━━━━━━━━━━━━━━━━[0m [32m28/57[0m [networkx]
[2K [91m━━━━━━━━━━━━━━━━━━━[0m[91m╸[0m[90m━━━━━━━━━━━━━━━━━━━━[0m [32m28/57[0m [networkx]
[2K [91m━━━━━━━━━━━━━━━━━━━[0m[91m╸[0m[90m━━━━━━━━━━━━━━━━━━━━[0m [32m28/57[0m [networkx]
[2K [91m━━━━━━━━━━━━━━━━━━━[0m[91m╸[0m[90m━━━━━━━━━━━━━━━━━━━━[0m [32m28/57[0m [networkx]
[2K [91m━━━━━━━━━━━━━━━━━━━[0m[91m╸[0m[90m━━━━━━━━━━━━━━━━━━━━[0m [32m28/57[0m [networkx]
[2K [91m━━━━━━━━━━━━━━━━━━━[0m[91m╸[0m[90m━━━━━━━━━━━━━━━━━━━━[0m [32m28/57[0m [networkx]
[2K [91m━━━━━━━━━━━━━━━━━━━[0m[91m╸[0m[90m━━━━━━━━━━━━━━━━━━━━[0m [32m28/57[0m [networkx]
[2K [91m━━━━━━━━━━━━━━━━━━━[0m[91m╸[0m[90m━━━━━━━━━━━━━━━━━━━━[0m [32m28/57[0m [networkx]
[2K Attempting uninstall: lxml
Step #6 - "compile-libfuzzer-introspector-x86_64": [91m━━━━━━━━━━━━━━━━━━━[0m[91m╸[0m[90m━━━━━━━━━━━━━━━━━━━━[0m [32m28/57[0m [networkx]
[2K Found existing installation: lxml 6.0.0
Step #6 - "compile-libfuzzer-introspector-x86_64": [91m━━━━━━━━━━━━━━━━━━━[0m[91m╸[0m[90m━━━━━━━━━━━━━━━━━━━━[0m [32m28/57[0m [networkx]
[2K Uninstalling lxml-6.0.0:
Step #6 - "compile-libfuzzer-introspector-x86_64": [91m━━━━━━━━━━━━━━━━━━━[0m[91m╸[0m[90m━━━━━━━━━━━━━━━━━━━━[0m [32m28/57[0m [networkx]
[2K Successfully uninstalled lxml-6.0.0
Step #6 - "compile-libfuzzer-introspector-x86_64": [91m━━━━━━━━━━━━━━━━━━━[0m[91m╸[0m[90m━━━━━━━━━━━━━━━━━━━━[0m [32m28/57[0m [networkx]
[2K [91m━━━━━━━━━━━━━━━━━━━━━━[0m[90m╺[0m[90m━━━━━━━━━━━━━━━━━[0m [32m32/57[0m [lxml]
[2K [91m━━━━━━━━━━━━━━━━━━━━━━━━[0m[91m╸[0m[90m━━━━━━━━━━━━━━━[0m [32m35/57[0m [idna]
[2K [91m━━━━━━━━━━━━━━━━━━━━━━━━━[0m[90m╺[0m[90m━━━━━━━━━━━━━━[0m [32m36/57[0m [docutils]
[2K [91m━━━━━━━━━━━━━━━━━━━━━━━━━[0m[90m╺[0m[90m━━━━━━━━━━━━━━[0m [32m36/57[0m [docutils]
[2K [91m━━━━━━━━━━━━━━━━━━━━━━━━━━[0m[91m╸[0m[90m━━━━━━━━━━━━━[0m [32m38/57[0m [configparser]
[2K [91m━━━━━━━━━━━━━━━━━━━━━━━━━━━━[0m[91m╸[0m[90m━━━━━━━━━━━[0m [32m41/57[0m [babel]
[2K [91m━━━━━━━━━━━━━━━━━━━━━━━━━━━━[0m[91m╸[0m[90m━━━━━━━━━━━[0m [32m41/57[0m [babel]
[2K [91m━━━━━━━━━━━━━━━━━━━━━━━━━━━━[0m[91m╸[0m[90m━━━━━━━━━━━[0m [32m41/57[0m [babel]
[2K [91m━━━━━━━━━━━━━━━━━━━━━━━━━━━━━━[0m[90m╺[0m[90m━━━━━━━━━[0m [32m43/57[0m [tree-sitter-languages]
[2K [91m━━━━━━━━━━━━━━━━━━━━━━━━━━━━━━[0m[90m╺[0m[90m━━━━━━━━━[0m [32m43/57[0m [tree-sitter-languages]
[2K [91m━━━━━━━━━━━━━━━━━━━━━━━━━━━━━━━[0m[91m╸[0m[90m━━━━━━━━[0m [32m45/57[0m [pytest]
[2K [91m━━━━━━━━━━━━━━━━━━━━━━━━━━━━━━━[0m[91m╸[0m[90m━━━━━━━━[0m [32m45/57[0m [pytest]
[2K [91m━━━━━━━━━━━━━━━━━━━━━━━━━━━━━━━━[0m[90m╺[0m[90m━━━━━━━[0m [32m46/57[0m [mypy]
[2K [91m━━━━━━━━━━━━━━━━━━━━━━━━━━━━━━━━[0m[90m╺[0m[90m━━━━━━━[0m [32m46/57[0m [mypy]
[2K [91m━━━━━━━━━━━━━━━━━━━━━━━━━━━━━━━━[0m[90m╺[0m[90m━━━━━━━[0m [32m46/57[0m [mypy]
[2K [91m━━━━━━━━━━━━━━━━━━━━━━━━━━━━━━━━[0m[90m╺[0m[90m━━━━━━━[0m [32m46/57[0m [mypy]
[2K [91m━━━━━━━━━━━━━━━━━━━━━━━━━━━━━━━━[0m[90m╺[0m[90m━━━━━━━[0m [32m46/57[0m [mypy]
[2K [91m━━━━━━━━━━━━━━━━━━━━━━━━━━━━━━━━[0m[90m╺[0m[90m━━━━━━━[0m [32m46/57[0m [mypy]
[2K [91m━━━━━━━━━━━━━━━━━━━━━━━━━━━━━━━━[0m[90m╺[0m[90m━━━━━━━[0m [32m46/57[0m [mypy]
[2K [91m━━━━━━━━━━━━━━━━━━━━━━━━━━━━━━━━[0m[90m╺[0m[90m━━━━━━━[0m [32m46/57[0m [mypy]
[2K [91m━━━━━━━━━━━━━━━━━━━━━━━━━━━━━━━━[0m[90m╺[0m[90m━━━━━━━[0m [32m46/57[0m [mypy]
[2K [91m━━━━━━━━━━━━━━━━━━━━━━━━━━━━━━━━[0m[90m╺[0m[90m━━━━━━━[0m [32m46/57[0m [mypy]
[2K [91m━━━━━━━━━━━━━━━━━━━━━━━━━━━━━━━━[0m[90m╺[0m[90m━━━━━━━[0m [32m46/57[0m [mypy]
[2K [91m━━━━━━━━━━━━━━━━━━━━━━━━━━━━━━━━━━[0m[90m╺[0m[90m━━━━━[0m [32m49/57[0m [flake8]
[2K Attempting uninstall: beautifulsoup4
Step #6 - "compile-libfuzzer-introspector-x86_64": [91m━━━━━━━━━━━━━━━━━━━━━━━━━━━━━━━━━━[0m[90m╺[0m[90m━━━━━[0m [32m49/57[0m [flake8]
[2K Found existing installation: beautifulsoup4 4.13.4
Step #6 - "compile-libfuzzer-introspector-x86_64": [91m━━━━━━━━━━━━━━━━━━━━━━━━━━━━━━━━━━[0m[90m╺[0m[90m━━━━━[0m [32m49/57[0m [flake8]
[2K Uninstalling beautifulsoup4-4.13.4:
Step #6 - "compile-libfuzzer-introspector-x86_64": [91m━━━━━━━━━━━━━━━━━━━━━━━━━━━━━━━━━━[0m[90m╺[0m[90m━━━━━[0m [32m49/57[0m [flake8]
[2K Successfully uninstalled beautifulsoup4-4.13.4
Step #6 - "compile-libfuzzer-introspector-x86_64": [91m━━━━━━━━━━━━━━━━━━━━━━━━━━━━━━━━━━[0m[90m╺[0m[90m━━━━━[0m [32m49/57[0m [flake8]
[2K [91m━━━━━━━━━━━━━━━━━━━━━━━━━━━━━━━━━━━[0m[91m╸[0m[90m━━━━[0m [32m51/57[0m [yapf]
[2K [91m━━━━━━━━━━━━━━━━━━━━━━━━━━━━━━━━━━━━[0m[90m╺[0m[90m━━━[0m [32m52/57[0m [sphinx]
[2K [91m━━━━━━━━━━━━━━━━━━━━━━━━━━━━━━━━━━━━[0m[90m╺[0m[90m━━━[0m [32m52/57[0m [sphinx]
[2K [91m━━━━━━━━━━━━━━━━━━━━━━━━━━━━━━━━━━━━[0m[90m╺[0m[90m━━━[0m [32m52/57[0m [sphinx]
[2K [91m━━━━━━━━━━━━━━━━━━━━━━━━━━━━━━━━━━━━[0m[90m╺[0m[90m━━━[0m [32m52/57[0m [sphinx]
[2K [91m━━━━━━━━━━━━━━━━━━━━━━━━━━━━━━━━━━━━[0m[90m╺[0m[90m━━━[0m [32m52/57[0m [sphinx]
[2K Attempting uninstall: matplotlib
Step #6 - "compile-libfuzzer-introspector-x86_64": [91m━━━━━━━━━━━━━━━━━━━━━━━━━━━━━━━━━━━━[0m[90m╺[0m[90m━━━[0m [32m52/57[0m [sphinx]
[2K Found existing installation: matplotlib 3.10.5
Step #6 - "compile-libfuzzer-introspector-x86_64": [91m━━━━━━━━━━━━━━━━━━━━━━━━━━━━━━━━━━━━[0m[90m╺[0m[90m━━━[0m [32m52/57[0m [sphinx]
[2K Uninstalling matplotlib-3.10.5:
Step #6 - "compile-libfuzzer-introspector-x86_64": [91m━━━━━━━━━━━━━━━━━━━━━━━━━━━━━━━━━━━━[0m[90m╺[0m[90m━━━[0m [32m52/57[0m [sphinx]
[2K [91m━━━━━━━━━━━━━━━━━━━━━━━━━━━━━━━━━━━━━[0m[90m╺[0m[90m━━[0m [32m53/57[0m [matplotlib]
[2K Successfully uninstalled matplotlib-3.10.5
Step #6 - "compile-libfuzzer-introspector-x86_64": [91m━━━━━━━━━━━━━━━━━━━━━━━━━━━━━━━━━━━━━[0m[90m╺[0m[90m━━[0m [32m53/57[0m [matplotlib]
[2K [91m━━━━━━━━━━━━━━━━━━━━━━━━━━━━━━━━━━━━━[0m[90m╺[0m[90m━━[0m [32m53/57[0m [matplotlib]
[2K [91m━━━━━━━━━━━━━━━━━━━━━━━━━━━━━━━━━━━━━[0m[90m╺[0m[90m━━[0m [32m53/57[0m [matplotlib]
[2K [91m━━━━━━━━━━━━━━━━━━━━━━━━━━━━━━━━━━━━━[0m[90m╺[0m[90m━━[0m [32m53/57[0m [matplotlib]
[2K [91m━━━━━━━━━━━━━━━━━━━━━━━━━━━━━━━━━━━━━[0m[90m╺[0m[90m━━[0m [32m53/57[0m [matplotlib]
[2K [91m━━━━━━━━━━━━━━━━━━━━━━━━━━━━━━━━━━━━━[0m[90m╺[0m[90m━━[0m [32m53/57[0m [matplotlib]
[2K [91m━━━━━━━━━━━━━━━━━━━━━━━━━━━━━━━━━━━━━[0m[90m╺[0m[90m━━[0m [32m53/57[0m [matplotlib]
[2K [91m━━━━━━━━━━━━━━━━━━━━━━━━━━━━━━━━━━━━━[0m[90m╺[0m[90m━━[0m [32m53/57[0m [matplotlib]
[2K [91m━━━━━━━━━━━━━━━━━━━━━━━━━━━━━━━━━━━━━[0m[90m╺[0m[90m━━[0m [32m53/57[0m [matplotlib]
[2K [91m━━━━━━━━━━━━━━━━━━━━━━━━━━━━━━━━━━━━━[0m[90m╺[0m[90m━━[0m [32m53/57[0m [matplotlib]
[2K [91m━━━━━━━━━━━━━━━━━━━━━━━━━━━━━━━━━━━━━[0m[90m╺[0m[90m━━[0m [32m53/57[0m [matplotlib]
[2K [91m━━━━━━━━━━━━━━━━━━━━━━━━━━━━━━━━━━━━━[0m[90m╺[0m[90m━━[0m [32m53/57[0m [matplotlib]
[2K [90m━━━━━━━━━━━━━━━━━━━━━━━━━━━━━━━━━━━━━━━━[0m [32m57/57[0m [fuzz-introspector]
Step #6 - "compile-libfuzzer-introspector-x86_64": [?25h
[1A[2KSuccessfully installed Jinja2-3.1.6 MarkupSafe-3.0.2 Pygments-2.19.2 alabaster-0.7.16 babel-2.17.0 beautifulsoup4-4.10.0 certifi-2025.8.3 charset_normalizer-3.4.3 configparser-7.2.0 coverage-7.10.2 docutils-0.19 flake8-7.3.0 fuzz-introspector-0.1.10 idna-3.10 imagesize-1.4.1 importlib-metadata-8.7.0 iniconfig-2.1.0 lxml-5.3.0 matplotlib-3.10.0 mccabe-0.7.0 mypy-1.17.1 mypy_extensions-1.1.0 networkx-3.5 numpy-2.1.0 pathspec-0.12.1 pep8-1.7.1 platformdirs-4.3.8 pluggy-1.6.0 psutil-7.0.0 pycodestyle-2.14.0 pyflakes-3.4.0 pytest-8.4.1 requests-2.32.4 snowballstemmer-3.0.1 soupsieve-2.2.1 sphinx-6.0.0 sphinx_rtd_theme-3.0.2 sphinxcontrib-applehelp-2.0.0 sphinxcontrib-devhelp-2.0.0 sphinxcontrib-htmlhelp-2.1.0 sphinxcontrib-jquery-4.1 sphinxcontrib-jsmath-1.0.1 sphinxcontrib-qthelp-2.0.0 sphinxcontrib-serializinghtml-2.0.0 toml-0.10.2 tomli-2.2.1 tqdm-4.67.1 tree-sitter-0.23.2 tree-sitter-cpp-0.23.4 tree-sitter-go-0.23.4 tree-sitter-java-0.23.5 tree-sitter-languages-1.10.2 tree-sitter-python-0.23.6 tree-sitter-rust-0.23.2 urllib3-2.5.0 yapf-0.40.1 zipp-3.23.0
Step #6 - "compile-libfuzzer-introspector-x86_64": [33mWARNING: Running pip as the 'root' user can result in broken permissions and conflicting behaviour with the system package manager, possibly rendering your system unusable. It is recommended to use a virtual environment instead: https://pip.pypa.io/warnings/venv. Use the --root-user-action option if you know what you are doing and want to suppress this warning.[0m[33m
Step #6 - "compile-libfuzzer-introspector-x86_64": [0m/src
Step #6 - "compile-libfuzzer-introspector-x86_64": 2025-08-10 10:13:17.938 INFO cli - main: Running fuzz introspector post-processing
Step #6 - "compile-libfuzzer-introspector-x86_64": 2025-08-10 10:13:18.038 INFO analysis - extract_tests_from_directories: All test files
Step #6 - "compile-libfuzzer-introspector-x86_64": 2025-08-10 10:13:18.038 INFO analysis - extract_tests_from_directories: /src/libucl/tests/test_speed.c
Step #6 - "compile-libfuzzer-introspector-x86_64": 2025-08-10 10:13:18.038 INFO analysis - extract_tests_from_directories: /src/libucl/examples/ucl_cpp.cc
Step #6 - "compile-libfuzzer-introspector-x86_64": 2025-08-10 10:13:18.039 INFO analysis - extract_tests_from_directories: /src/libucl/tests/test_schema.c
Step #6 - "compile-libfuzzer-introspector-x86_64": 2025-08-10 10:13:18.039 INFO analysis - extract_tests_from_directories: /src/libucl/tests/test_basic.c
Step #6 - "compile-libfuzzer-introspector-x86_64": 2025-08-10 10:13:18.039 INFO analysis - extract_tests_from_directories: /src/libucl/tests/test_msgpack.c
Step #6 - "compile-libfuzzer-introspector-x86_64": 2025-08-10 10:13:18.039 INFO analysis - extract_tests_from_directories: /src/libucl/tests/test_streamline.c
Step #6 - "compile-libfuzzer-introspector-x86_64": 2025-08-10 10:13:18.039 INFO analysis - extract_tests_from_directories: /src/libucl/tests/test_generate.c
Step #6 - "compile-libfuzzer-introspector-x86_64": 2025-08-10 10:13:18.073 INFO cli - main: Ending fuzz introspector post-processing
Step #6 - "compile-libfuzzer-introspector-x86_64": 2025-08-10 10:13:18.295 INFO cli - main: Running fuzz introspector post-processing
Step #6 - "compile-libfuzzer-introspector-x86_64": 2025-08-10 10:13:18.304 INFO oss_fuzz - analyse_folder: Found 36 files to include in analysis
Step #6 - "compile-libfuzzer-introspector-x86_64": 2025-08-10 10:13:18.305 INFO oss_fuzz - analyse_folder: Going C/C++ route
Step #6 - "compile-libfuzzer-introspector-x86_64": 2025-08-10 10:13:18.305 INFO oss_fuzz - analyse_folder: Loading tree-sitter trees
Step #6 - "compile-libfuzzer-introspector-x86_64": 2025-08-10 10:13:20.805 INFO frontend_c_cpp - load_treesitter_trees: harness: /src/libucl/tests/fuzzers/ucl_add_string_fuzzer.c
Step #6 - "compile-libfuzzer-introspector-x86_64": 2025-08-10 10:13:20.836 INFO frontend_c_cpp - load_treesitter_trees: harness: /src/libucl/tests/fuzzers/ucl_msgpack_fuzzer.c
Step #6 - "compile-libfuzzer-introspector-x86_64": 2025-08-10 10:13:36.656 INFO oss_fuzz - analyse_folder: Dump methods for ucl_add_string_fuzzer
Step #6 - "compile-libfuzzer-introspector-x86_64": 2025-08-10 10:13:36.656 INFO datatypes - dump_module_logic: Generating report
Step #6 - "compile-libfuzzer-introspector-x86_64": 2025-08-10 10:13:38.200 INFO datatypes - dump_module_logic: Report generated
Step #6 - "compile-libfuzzer-introspector-x86_64": 2025-08-10 10:13:38.238 INFO datatypes - dump_module_logic: Dumping project-wide logic.
Step #6 - "compile-libfuzzer-introspector-x86_64": 2025-08-10 10:13:38.238 INFO datatypes - dump_module_logic: Using safe yaml safe C dumper.
Step #6 - "compile-libfuzzer-introspector-x86_64": 2025-08-10 10:13:38.637 INFO datatypes - dump_module_logic: Dumped
Step #6 - "compile-libfuzzer-introspector-x86_64": 2025-08-10 10:13:38.638 INFO oss_fuzz - analyse_folder: Extracting calltree for ucl_add_string_fuzzer
Step #6 - "compile-libfuzzer-introspector-x86_64": 2025-08-10 10:13:38.742 INFO oss_fuzz - analyse_folder: Calltree extracted
Step #6 - "compile-libfuzzer-introspector-x86_64": 2025-08-10 10:13:38.743 INFO datatypes - dump_type_definition: Dumping custom type definitions.
Step #6 - "compile-libfuzzer-introspector-x86_64": 2025-08-10 10:13:38.744 INFO datatypes - dump_type_definition: Custom type definitions dumping completed.
Step #6 - "compile-libfuzzer-introspector-x86_64": 2025-08-10 10:13:38.745 INFO datatypes - dump_macro_block_info: Dumping macro blocks information.
Step #6 - "compile-libfuzzer-introspector-x86_64": 2025-08-10 10:13:38.746 INFO datatypes - dump_macro_block_info: Macro blocks information dumping completed.
Step #6 - "compile-libfuzzer-introspector-x86_64": 2025-08-10 10:13:38.746 INFO oss_fuzz - analyse_folder: Dump methods for ucl_msgpack_fuzzer
Step #6 - "compile-libfuzzer-introspector-x86_64": 2025-08-10 10:13:38.746 INFO datatypes - dump_module_logic: Generating report
Step #6 - "compile-libfuzzer-introspector-x86_64": 2025-08-10 10:13:38.780 INFO datatypes - dump_module_logic: Report generated
Step #6 - "compile-libfuzzer-introspector-x86_64": 2025-08-10 10:13:38.851 INFO datatypes - dump_module_logic: Dumping project-wide logic.
Step #6 - "compile-libfuzzer-introspector-x86_64": 2025-08-10 10:13:38.851 INFO datatypes - dump_module_logic: Using safe yaml safe C dumper.
Step #6 - "compile-libfuzzer-introspector-x86_64": 2025-08-10 10:13:39.266 INFO datatypes - dump_module_logic: Dumped
Step #6 - "compile-libfuzzer-introspector-x86_64": 2025-08-10 10:13:39.268 INFO oss_fuzz - analyse_folder: Extracting calltree for ucl_msgpack_fuzzer
Step #6 - "compile-libfuzzer-introspector-x86_64": 2025-08-10 10:13:39.372 INFO oss_fuzz - analyse_folder: Calltree extracted
Step #6 - "compile-libfuzzer-introspector-x86_64": 2025-08-10 10:13:39.372 INFO datatypes - dump_type_definition: Dumping custom type definitions.
Step #6 - "compile-libfuzzer-introspector-x86_64": 2025-08-10 10:13:39.374 INFO datatypes - dump_type_definition: Custom type definitions dumping completed.
Step #6 - "compile-libfuzzer-introspector-x86_64": 2025-08-10 10:13:39.374 INFO datatypes - dump_macro_block_info: Dumping macro blocks information.
Step #6 - "compile-libfuzzer-introspector-x86_64": 2025-08-10 10:13:39.375 INFO datatypes - dump_macro_block_info: Macro blocks information dumping completed.
Step #6 - "compile-libfuzzer-introspector-x86_64": 2025-08-10 10:13:39.376 INFO commands - analyse_end_to_end: No harness list at place
Step #6 - "compile-libfuzzer-introspector-x86_64": 2025-08-10 10:13:39.376 INFO commands - run_analysis_on_dir: Running analysis
Step #6 - "compile-libfuzzer-introspector-x86_64": 2025-08-10 10:13:39.410 INFO analysis - load_data_files: Loading profiles using files
Step #6 - "compile-libfuzzer-introspector-x86_64": 2025-08-10 10:13:39.410 INFO data_loader - load_all_profiles: Loading profiles from /src/inspector
Step #6 - "compile-libfuzzer-introspector-x86_64": 2025-08-10 10:13:39.412 INFO data_loader - load_all_profiles: []
Step #6 - "compile-libfuzzer-introspector-x86_64": 2025-08-10 10:13:39.412 INFO data_loader - load_all_profiles: - found 2 profiles to load
Step #6 - "compile-libfuzzer-introspector-x86_64": 2025-08-10 10:13:39.440 INFO data_loader - read_fuzzer_data_file_to_profile: - loading /src/inspector/fuzzerLogFile-ucl_add_string_fuzzer.data
Step #6 - "compile-libfuzzer-introspector-x86_64": 2025-08-10 10:13:39.441 INFO data_loader - read_fuzzer_data_file_to_profile: target data f: /src/inspector/fuzzerLogFile-ucl_add_string_fuzzer.data
Step #6 - "compile-libfuzzer-introspector-x86_64": 2025-08-10 10:13:39.441 INFO utils - data_file_read_yaml: Set base loader to use CSafeLoader
Step #6 - "compile-libfuzzer-introspector-x86_64": 2025-08-10 10:13:39.443 INFO data_loader - read_fuzzer_data_file_to_profile: - loading /src/inspector/fuzzerLogFile-ucl_msgpack_fuzzer.data
Step #6 - "compile-libfuzzer-introspector-x86_64": 2025-08-10 10:13:39.443 INFO data_loader - read_fuzzer_data_file_to_profile: target data f: /src/inspector/fuzzerLogFile-ucl_msgpack_fuzzer.data
Step #6 - "compile-libfuzzer-introspector-x86_64": 2025-08-10 10:13:39.443 INFO utils - data_file_read_yaml: Set base loader to use CSafeLoader
Step #6 - "compile-libfuzzer-introspector-x86_64": 2025-08-10 10:13:40.107 INFO utils - data_file_read_yaml: Loaded single yaml module
Step #6 - "compile-libfuzzer-introspector-x86_64": 2025-08-10 10:13:40.114 INFO utils - data_file_read_yaml: Loaded single yaml module
Step #6 - "compile-libfuzzer-introspector-x86_64": 2025-08-10 10:13:40.128 INFO data_loader - read_fuzzer_data_file_to_profile: Returning profile
Step #6 - "compile-libfuzzer-introspector-x86_64": 2025-08-10 10:13:40.135 INFO data_loader - read_fuzzer_data_file_to_profile: Returning profile
Step #6 - "compile-libfuzzer-introspector-x86_64": 2025-08-10 10:13:40.261 INFO analysis - load_data_files: Found 2 profiles
Step #6 - "compile-libfuzzer-introspector-x86_64": 2025-08-10 10:13:40.261 INFO analysis - load_data_files: [+] Accummulating profiles
Step #6 - "compile-libfuzzer-introspector-x86_64": 2025-08-10 10:13:40.261 INFO analysis - load_data_files: Accummulating using multiprocessing
Step #6 - "compile-libfuzzer-introspector-x86_64": 2025-08-10 10:13:40.276 INFO fuzzer_profile - accummulate_profile: /src/libucl/tests/fuzzers/ucl_msgpack_fuzzer.c: propagating functions reached
Step #6 - "compile-libfuzzer-introspector-x86_64": 2025-08-10 10:13:40.279 INFO fuzzer_profile - accummulate_profile: /src/libucl/tests/fuzzers/ucl_add_string_fuzzer.c: propagating functions reached
Step #6 - "compile-libfuzzer-introspector-x86_64": 2025-08-10 10:13:40.293 INFO fuzzer_profile - accummulate_profile: /src/libucl/tests/fuzzers/ucl_msgpack_fuzzer.c: setting reached funcs
Step #6 - "compile-libfuzzer-introspector-x86_64": 2025-08-10 10:13:40.294 INFO fuzzer_profile - accummulate_profile: /src/libucl/tests/fuzzers/ucl_msgpack_fuzzer.c: setting unreached funcs
Step #6 - "compile-libfuzzer-introspector-x86_64": 2025-08-10 10:13:40.296 INFO fuzzer_profile - accummulate_profile: /src/libucl/tests/fuzzers/ucl_msgpack_fuzzer.c: loading coverage
Step #6 - "compile-libfuzzer-introspector-x86_64": 2025-08-10 10:13:40.296 INFO fuzzer_profile - _load_coverage: Loading coverage of type c-cpp
Step #6 - "compile-libfuzzer-introspector-x86_64": 2025-08-10 10:13:40.296 INFO code_coverage - load_llvm_coverage: Loading LLVM coverage for target /src/libucl/tests/fuzzers/ucl_msgpack_fuzzer.c
Step #6 - "compile-libfuzzer-introspector-x86_64": 2025-08-10 10:13:40.297 INFO fuzzer_profile - accummulate_profile: /src/libucl/tests/fuzzers/ucl_add_string_fuzzer.c: setting reached funcs
Step #6 - "compile-libfuzzer-introspector-x86_64": 2025-08-10 10:13:40.297 INFO code_coverage - load_llvm_coverage: Found 0 coverage reports
Step #6 - "compile-libfuzzer-introspector-x86_64": 2025-08-10 10:13:40.297 INFO code_coverage - load_llvm_coverage: Using the following coverages []
Step #6 - "compile-libfuzzer-introspector-x86_64": 2025-08-10 10:13:40.297 INFO fuzzer_profile - accummulate_profile: /src/libucl/tests/fuzzers/ucl_add_string_fuzzer.c: setting unreached funcs
Step #6 - "compile-libfuzzer-introspector-x86_64": 2025-08-10 10:13:40.297 INFO fuzzer_profile - accummulate_profile: /src/libucl/tests/fuzzers/ucl_msgpack_fuzzer.c: setting file targets
Step #6 - "compile-libfuzzer-introspector-x86_64": 2025-08-10 10:13:40.299 INFO fuzzer_profile - accummulate_profile: /src/libucl/tests/fuzzers/ucl_msgpack_fuzzer.c: setting total basic blocks
Step #6 - "compile-libfuzzer-introspector-x86_64": 2025-08-10 10:13:40.299 INFO fuzzer_profile - accummulate_profile: /src/libucl/tests/fuzzers/ucl_msgpack_fuzzer.c: setting cyclomatic complexity
Step #6 - "compile-libfuzzer-introspector-x86_64": 2025-08-10 10:13:40.299 INFO fuzzer_profile - accummulate_profile: /src/libucl/tests/fuzzers/ucl_msgpack_fuzzer.c: setting fd cache
Step #6 - "compile-libfuzzer-introspector-x86_64": 2025-08-10 10:13:40.300 INFO fuzzer_profile - accummulate_profile: /src/libucl/tests/fuzzers/ucl_add_string_fuzzer.c: loading coverage
Step #6 - "compile-libfuzzer-introspector-x86_64": 2025-08-10 10:13:40.300 INFO fuzzer_profile - _load_coverage: Loading coverage of type c-cpp
Step #6 - "compile-libfuzzer-introspector-x86_64": 2025-08-10 10:13:40.300 INFO code_coverage - load_llvm_coverage: Loading LLVM coverage for target /src/libucl/tests/fuzzers/ucl_add_string_fuzzer.c
Step #6 - "compile-libfuzzer-introspector-x86_64": 2025-08-10 10:13:40.300 INFO fuzzer_profile - accummulate_profile: /src/libucl/tests/fuzzers/ucl_msgpack_fuzzer.c: setting reached funcs in runtime
Step #6 - "compile-libfuzzer-introspector-x86_64": 2025-08-10 10:13:40.300 INFO fuzzer_profile - accummulate_profile: /src/libucl/tests/fuzzers/ucl_msgpack_fuzzer.c: finished accummulating profile
Step #6 - "compile-libfuzzer-introspector-x86_64": 2025-08-10 10:13:40.301 INFO code_coverage - load_llvm_coverage: Found 0 coverage reports
Step #6 - "compile-libfuzzer-introspector-x86_64": 2025-08-10 10:13:40.301 INFO code_coverage - load_llvm_coverage: Using the following coverages []
Step #6 - "compile-libfuzzer-introspector-x86_64": 2025-08-10 10:13:40.301 INFO fuzzer_profile - accummulate_profile: /src/libucl/tests/fuzzers/ucl_add_string_fuzzer.c: setting file targets
Step #6 - "compile-libfuzzer-introspector-x86_64": 2025-08-10 10:13:40.303 INFO fuzzer_profile - accummulate_profile: /src/libucl/tests/fuzzers/ucl_add_string_fuzzer.c: setting total basic blocks
Step #6 - "compile-libfuzzer-introspector-x86_64": 2025-08-10 10:13:40.303 INFO fuzzer_profile - accummulate_profile: /src/libucl/tests/fuzzers/ucl_add_string_fuzzer.c: setting cyclomatic complexity
Step #6 - "compile-libfuzzer-introspector-x86_64": 2025-08-10 10:13:40.303 INFO fuzzer_profile - accummulate_profile: /src/libucl/tests/fuzzers/ucl_add_string_fuzzer.c: setting fd cache
Step #6 - "compile-libfuzzer-introspector-x86_64": 2025-08-10 10:13:40.304 INFO fuzzer_profile - accummulate_profile: /src/libucl/tests/fuzzers/ucl_add_string_fuzzer.c: setting reached funcs in runtime
Step #6 - "compile-libfuzzer-introspector-x86_64": 2025-08-10 10:13:40.304 INFO fuzzer_profile - accummulate_profile: /src/libucl/tests/fuzzers/ucl_add_string_fuzzer.c: finished accummulating profile
Step #6 - "compile-libfuzzer-introspector-x86_64": 2025-08-10 10:13:40.581 INFO analysis - load_data_files: [+] Creating project profile
Step #6 - "compile-libfuzzer-introspector-x86_64": 2025-08-10 10:13:40.582 INFO project_profile - __init__: Creating merged profile of 2 profiles
Step #6 - "compile-libfuzzer-introspector-x86_64": 2025-08-10 10:13:40.582 INFO project_profile - __init__: Populating functions reached
Step #6 - "compile-libfuzzer-introspector-x86_64": 2025-08-10 10:13:40.582 INFO project_profile - __init__: Populating functions unreached
Step #6 - "compile-libfuzzer-introspector-x86_64": 2025-08-10 10:13:40.582 INFO project_profile - __init__: Creating all_functions dictionary
Step #6 - "compile-libfuzzer-introspector-x86_64": 2025-08-10 10:13:40.603 INFO project_profile - __init__: Gathering complexity and incoming references of each function
Step #6 - "compile-libfuzzer-introspector-x86_64": 2025-08-10 10:13:40.613 INFO project_profile - __init__: Completed creationg of merged profile
Step #6 - "compile-libfuzzer-introspector-x86_64": 2025-08-10 10:13:40.613 INFO analysis - load_data_files: [+] Refining profiles
Step #6 - "compile-libfuzzer-introspector-x86_64": 2025-08-10 10:13:40.617 INFO utils - get_target_coverage_url: Extracting coverage for https://storage.googleapis.com/oss-fuzz-coverage/libucl/reports/20250810/linux -- tests/fuzzers/ucl_msgpack_fuzzer.c
Step #6 - "compile-libfuzzer-introspector-x86_64": 2025-08-10 10:13:40.617 INFO analysis - overlay_calltree_with_coverage: Using coverage url: https://storage.googleapis.com/oss-fuzz-coverage/libucl/reports-by-target/20250810/tests/fuzzers/ucl_msgpack_fuzzer.c/linux
Step #6 - "compile-libfuzzer-introspector-x86_64": 2025-08-10 10:13:40.618 INFO analysis - get_node_coverage_hitcount: There is no coverage data (not even all negative).
Step #6 - "compile-libfuzzer-introspector-x86_64": 2025-08-10 10:13:40.629 INFO analysis - overlay_calltree_with_coverage: Overlaying 2
Step #6 - "compile-libfuzzer-introspector-x86_64": 2025-08-10 10:13:40.630 INFO analysis - overlay_calltree_with_coverage: Overlaying 3
Step #6 - "compile-libfuzzer-introspector-x86_64": 2025-08-10 10:13:40.631 INFO analysis - overlay_calltree_with_coverage: Updating branch complexities
Step #6 - "compile-libfuzzer-introspector-x86_64": 2025-08-10 10:13:40.631 INFO analysis - overlay_calltree_with_coverage: [+] found 0 branch blockers.
Step #6 - "compile-libfuzzer-introspector-x86_64": 2025-08-10 10:13:40.632 INFO utils - get_target_coverage_url: Extracting coverage for https://storage.googleapis.com/oss-fuzz-coverage/libucl/reports/20250810/linux -- tests/fuzzers/ucl_add_string_fuzzer.c
Step #6 - "compile-libfuzzer-introspector-x86_64": 2025-08-10 10:13:40.632 INFO analysis - overlay_calltree_with_coverage: Using coverage url: https://storage.googleapis.com/oss-fuzz-coverage/libucl/reports-by-target/20250810/tests/fuzzers/ucl_add_string_fuzzer.c/linux
Step #6 - "compile-libfuzzer-introspector-x86_64": 2025-08-10 10:13:40.632 INFO analysis - get_node_coverage_hitcount: There is no coverage data (not even all negative).
Step #6 - "compile-libfuzzer-introspector-x86_64": 2025-08-10 10:13:40.643 INFO analysis - overlay_calltree_with_coverage: Overlaying 2
Step #6 - "compile-libfuzzer-introspector-x86_64": 2025-08-10 10:13:40.644 INFO analysis - overlay_calltree_with_coverage: Overlaying 3
Step #6 - "compile-libfuzzer-introspector-x86_64": 2025-08-10 10:13:40.645 INFO analysis - overlay_calltree_with_coverage: Updating branch complexities
Step #6 - "compile-libfuzzer-introspector-x86_64": 2025-08-10 10:13:40.645 INFO analysis - overlay_calltree_with_coverage: [+] found 0 branch blockers.
Step #6 - "compile-libfuzzer-introspector-x86_64": 2025-08-10 10:13:40.658 INFO commands - run_analysis_on_dir: Analyses to run: ['OptimalTargets', 'FuzzEngineInputAnalysis', 'RuntimeCoverageAnalysis', 'FuzzDriverSynthesizerAnalysis', 'BugDigestorAnalysis', 'FilePathAnalyser', 'ThirdPartyAPICoverageAnalyser', 'MetadataAnalysis', 'SinkCoverageAnalyser', 'AnnotatedCFG', 'SourceCodeLineAnalyser', 'FarReachLowCoverageAnalyser', 'PublicCandidateAnalyser', 'FrontendAnalyser']
Step #6 - "compile-libfuzzer-introspector-x86_64": 2025-08-10 10:13:40.658 INFO commands - run_analysis_on_dir: [+] Creating HTML report
Step #6 - "compile-libfuzzer-introspector-x86_64": 2025-08-10 10:13:40.659 INFO html_report - create_html_report: - Creating HTML report
Step #6 - "compile-libfuzzer-introspector-x86_64": 2025-08-10 10:13:40.659 INFO html_report - create_section_project_overview: - Creating reachability overview table
Step #6 - "compile-libfuzzer-introspector-x86_64": 2025-08-10 10:13:40.666 INFO html_report - create_section_fuzzers_overview: - Creating table with overview of all fuzzers
Step #6 - "compile-libfuzzer-introspector-x86_64": 2025-08-10 10:13:40.667 INFO html_report - create_section_all_functions: - Creating table with information about all functions in target
Step #6 - "compile-libfuzzer-introspector-x86_64": 2025-08-10 10:13:40.680 INFO html_report - create_all_function_table: Assembled a total of 702 entries
Step #6 - "compile-libfuzzer-introspector-x86_64": 2025-08-10 10:13:40.681 INFO html_report - create_section_fuzzer_detailed_section: - Creating section with details about each fuzzer
Step #6 - "compile-libfuzzer-introspector-x86_64": 2025-08-10 10:13:40.681 INFO calltree_analysis - __init__: Creating FuzzCalltreeAnalysis
Step #6 - "compile-libfuzzer-introspector-x86_64": 2025-08-10 10:13:40.681 INFO calltree_analysis - create_calltree: In calltree
Step #6 - "compile-libfuzzer-introspector-x86_64": 2025-08-10 10:13:40.685 INFO calltree_analysis - create_calltree: At end
Step #6 - "compile-libfuzzer-introspector-x86_64": 2025-08-10 10:13:40.686 INFO calltree_analysis - create_calltree: calltree_html_section_string: : 852 -- : 852
Step #6 - "compile-libfuzzer-introspector-x86_64": 2025-08-10 10:13:40.688 INFO calltree_analysis - create_calltree: Calltree created
Step #6 - "compile-libfuzzer-introspector-x86_64": 2025-08-10 10:13:40.688 INFO calltree_analysis - create_fuzz_blocker_table: Creating fuzz blocker table
Step #6 - "compile-libfuzzer-introspector-x86_64": 2025-08-10 10:13:41.562 INFO font_manager - _load_fontmanager: generated new fontManager
Step #6 - "compile-libfuzzer-introspector-x86_64": 2025-08-10 10:13:41.803 INFO html_helpers - create_horisontal_calltree_image: Creating image tests_fuzzers_ucl_msgpack_fuzzer.c_colormap.png
Step #6 - "compile-libfuzzer-introspector-x86_64": 2025-08-10 10:13:41.804 INFO html_helpers - create_horisontal_calltree_image: - extracted the callsites (755 nodes)
Step #6 - "compile-libfuzzer-introspector-x86_64": 2025-08-10 10:13:41.822 INFO html_helpers - create_horisontal_calltree_image: - iterated over color list
Step #6 - "compile-libfuzzer-introspector-x86_64": 2025-08-10 10:13:41.822 INFO html_helpers - create_horisontal_calltree_image: - saving image
Step #6 - "compile-libfuzzer-introspector-x86_64": 2025-08-10 10:13:41.910 INFO html_helpers - create_horisontal_calltree_image: - image saved
Step #6 - "compile-libfuzzer-introspector-x86_64": 2025-08-10 10:13:41.910 INFO calltree_analysis - __init__: Creating FuzzCalltreeAnalysis
Step #6 - "compile-libfuzzer-introspector-x86_64": 2025-08-10 10:13:41.910 INFO calltree_analysis - create_calltree: In calltree
Step #6 - "compile-libfuzzer-introspector-x86_64": 2025-08-10 10:13:41.914 INFO calltree_analysis - create_calltree: At end
Step #6 - "compile-libfuzzer-introspector-x86_64": 2025-08-10 10:13:41.915 INFO calltree_analysis - create_calltree: calltree_html_section_string: : 862 -- : 862
Step #6 - "compile-libfuzzer-introspector-x86_64": 2025-08-10 10:13:41.916 INFO calltree_analysis - create_calltree: Calltree created
Step #6 - "compile-libfuzzer-introspector-x86_64": 2025-08-10 10:13:41.917 INFO calltree_analysis - create_fuzz_blocker_table: Creating fuzz blocker table
Step #6 - "compile-libfuzzer-introspector-x86_64": 2025-08-10 10:13:42.390 INFO html_helpers - create_horisontal_calltree_image: Creating image tests_fuzzers_ucl_add_string_fuzzer.c_colormap.png
Step #6 - "compile-libfuzzer-introspector-x86_64": 2025-08-10 10:13:42.390 INFO html_helpers - create_horisontal_calltree_image: - extracted the callsites (761 nodes)
Step #6 - "compile-libfuzzer-introspector-x86_64": 2025-08-10 10:13:42.405 INFO html_helpers - create_horisontal_calltree_image: - iterated over color list
Step #6 - "compile-libfuzzer-introspector-x86_64": 2025-08-10 10:13:42.405 INFO html_helpers - create_horisontal_calltree_image: - saving image
Step #6 - "compile-libfuzzer-introspector-x86_64": 2025-08-10 10:13:42.484 INFO html_helpers - create_horisontal_calltree_image: - image saved
Step #6 - "compile-libfuzzer-introspector-x86_64": 2025-08-10 10:13:42.484 INFO html_report - create_section_optional_analyses: - Handling optional analyses
Step #6 - "compile-libfuzzer-introspector-x86_64": 2025-08-10 10:13:42.484 INFO optimal_targets - analysis_func: - Running analysis OptimalTargets
Step #6 - "compile-libfuzzer-introspector-x86_64": 2025-08-10 10:13:42.484 INFO optimal_targets - iteratively_get_optimal_targets: - in iteratively_get_optimal_targets
Step #6 - "compile-libfuzzer-introspector-x86_64": 2025-08-10 10:13:42.647 INFO optimal_targets - analysis_get_optimal_targets: - in analysis_get_optimal_targets
Step #6 - "compile-libfuzzer-introspector-x86_64": 2025-08-10 10:13:42.648 INFO optimal_targets - analysis_get_optimal_targets: Filtering optimal functions from 702 functions
Step #6 - "compile-libfuzzer-introspector-x86_64": 2025-08-10 10:13:42.648 INFO optimal_targets - analysis_get_optimal_targets: Found a total of 35 potential targets
Step #6 - "compile-libfuzzer-introspector-x86_64": 2025-08-10 10:13:42.648 INFO optimal_targets - iteratively_get_optimal_targets: Getting 10 optimal targets
Step #6 - "compile-libfuzzer-introspector-x86_64": 2025-08-10 10:13:42.648 INFO optimal_targets - iteratively_get_optimal_targets: - sorting by unreached complexity.
Step #6 - "compile-libfuzzer-introspector-x86_64": 2025-08-10 10:13:42.648 INFO optimal_targets - add_func_to_reached_and_clone: Creating a deepcopy
Step #6 - "compile-libfuzzer-introspector-x86_64": 2025-08-10 10:13:42.784 INFO optimal_targets - add_func_to_reached_and_clone: Updating hitcount
Step #6 - "compile-libfuzzer-introspector-x86_64": 2025-08-10 10:13:42.785 INFO optimal_targets - add_func_to_reached_and_clone: Updating hitcount-related data
Step #6 - "compile-libfuzzer-introspector-x86_64": 2025-08-10 10:13:42.793 INFO optimal_targets - analysis_get_optimal_targets: - in analysis_get_optimal_targets
Step #6 - "compile-libfuzzer-introspector-x86_64": 2025-08-10 10:13:42.793 INFO optimal_targets - analysis_get_optimal_targets: Filtering optimal functions from 702 functions
Step #6 - "compile-libfuzzer-introspector-x86_64": 2025-08-10 10:13:42.793 INFO optimal_targets - analysis_get_optimal_targets: Found a total of 10 potential targets
Step #6 - "compile-libfuzzer-introspector-x86_64": 2025-08-10 10:13:42.793 INFO optimal_targets - iteratively_get_optimal_targets: - sorting by unreached complexity.
Step #6 - "compile-libfuzzer-introspector-x86_64": 2025-08-10 10:13:42.793 INFO optimal_targets - add_func_to_reached_and_clone: Creating a deepcopy
Step #6 - "compile-libfuzzer-introspector-x86_64": 2025-08-10 10:13:43.039 INFO optimal_targets - add_func_to_reached_and_clone: Updating hitcount
Step #6 - "compile-libfuzzer-introspector-x86_64": 2025-08-10 10:13:43.040 INFO optimal_targets - add_func_to_reached_and_clone: Updating hitcount-related data
Step #6 - "compile-libfuzzer-introspector-x86_64": 2025-08-10 10:13:43.048 INFO optimal_targets - analysis_get_optimal_targets: - in analysis_get_optimal_targets
Step #6 - "compile-libfuzzer-introspector-x86_64": 2025-08-10 10:13:43.048 INFO optimal_targets - analysis_get_optimal_targets: Filtering optimal functions from 702 functions
Step #6 - "compile-libfuzzer-introspector-x86_64": 2025-08-10 10:13:43.049 INFO optimal_targets - analysis_get_optimal_targets: Found a total of 6 potential targets
Step #6 - "compile-libfuzzer-introspector-x86_64": 2025-08-10 10:13:43.049 INFO optimal_targets - iteratively_get_optimal_targets: - sorting by unreached complexity.
Step #6 - "compile-libfuzzer-introspector-x86_64": 2025-08-10 10:13:43.049 INFO optimal_targets - add_func_to_reached_and_clone: Creating a deepcopy
Step #6 - "compile-libfuzzer-introspector-x86_64": 2025-08-10 10:13:43.188 INFO optimal_targets - add_func_to_reached_and_clone: Updating hitcount
Step #6 - "compile-libfuzzer-introspector-x86_64": 2025-08-10 10:13:43.188 INFO optimal_targets - add_func_to_reached_and_clone: Updating hitcount-related data
Step #6 - "compile-libfuzzer-introspector-x86_64": 2025-08-10 10:13:43.197 INFO optimal_targets - analysis_get_optimal_targets: - in analysis_get_optimal_targets
Step #6 - "compile-libfuzzer-introspector-x86_64": 2025-08-10 10:13:43.197 INFO optimal_targets - analysis_get_optimal_targets: Filtering optimal functions from 702 functions
Step #6 - "compile-libfuzzer-introspector-x86_64": 2025-08-10 10:13:43.198 INFO optimal_targets - analysis_get_optimal_targets: Found a total of 3 potential targets
Step #6 - "compile-libfuzzer-introspector-x86_64": 2025-08-10 10:13:43.198 INFO optimal_targets - iteratively_get_optimal_targets: - sorting by unreached complexity.
Step #6 - "compile-libfuzzer-introspector-x86_64": 2025-08-10 10:13:43.198 INFO optimal_targets - add_func_to_reached_and_clone: Creating a deepcopy
Step #6 - "compile-libfuzzer-introspector-x86_64": 2025-08-10 10:13:43.339 INFO optimal_targets - add_func_to_reached_and_clone: Updating hitcount
Step #6 - "compile-libfuzzer-introspector-x86_64": 2025-08-10 10:13:43.339 INFO optimal_targets - add_func_to_reached_and_clone: Updating hitcount-related data
Step #6 - "compile-libfuzzer-introspector-x86_64": 2025-08-10 10:13:43.347 INFO optimal_targets - analysis_get_optimal_targets: - in analysis_get_optimal_targets
Step #6 - "compile-libfuzzer-introspector-x86_64": 2025-08-10 10:13:43.348 INFO optimal_targets - analysis_get_optimal_targets: Filtering optimal functions from 702 functions
Step #6 - "compile-libfuzzer-introspector-x86_64": 2025-08-10 10:13:43.348 INFO optimal_targets - analysis_get_optimal_targets: Found a total of 1 potential targets
Step #6 - "compile-libfuzzer-introspector-x86_64": 2025-08-10 10:13:43.348 INFO optimal_targets - iteratively_get_optimal_targets: - sorting by unreached complexity.
Step #6 - "compile-libfuzzer-introspector-x86_64": 2025-08-10 10:13:43.348 INFO optimal_targets - add_func_to_reached_and_clone: Creating a deepcopy
Step #6 - "compile-libfuzzer-introspector-x86_64": 2025-08-10 10:13:43.585 INFO optimal_targets - add_func_to_reached_and_clone: Updating hitcount
Step #6 - "compile-libfuzzer-introspector-x86_64": 2025-08-10 10:13:43.586 INFO optimal_targets - add_func_to_reached_and_clone: Updating hitcount-related data
Step #6 - "compile-libfuzzer-introspector-x86_64": 2025-08-10 10:13:43.595 INFO optimal_targets - analysis_get_optimal_targets: - in analysis_get_optimal_targets
Step #6 - "compile-libfuzzer-introspector-x86_64": 2025-08-10 10:13:43.595 INFO optimal_targets - analysis_get_optimal_targets: Filtering optimal functions from 702 functions
Step #6 - "compile-libfuzzer-introspector-x86_64": 2025-08-10 10:13:43.596 INFO optimal_targets - analysis_get_optimal_targets: Found a total of 0 potential targets
Step #6 - "compile-libfuzzer-introspector-x86_64": 2025-08-10 10:13:43.596 INFO optimal_targets - iteratively_get_optimal_targets: - sorting by unreached complexity.
Step #6 - "compile-libfuzzer-introspector-x86_64": 2025-08-10 10:13:43.596 INFO optimal_targets - iteratively_get_optimal_targets: Found the following optimal functions: { ['lua_ucl_parser_validate', 'ucl_include_common', 'ucl_emitter_common_elt', 'ucl_object_dtor_unref_single', 'ucl_object_merge'] }
Step #6 - "compile-libfuzzer-introspector-x86_64": 2025-08-10 10:13:43.613 INFO html_report - create_all_function_table: Assembled a total of 702 entries
Step #6 - "compile-libfuzzer-introspector-x86_64": 2025-08-10 10:13:43.628 INFO optimal_targets - analysis_func: - Completed analysis OptimalTargets
Step #6 - "compile-libfuzzer-introspector-x86_64": 2025-08-10 10:13:43.631 INFO engine_input - analysis_func: - Running analysis FuzzEngineInputAnalysis
Step #6 - "compile-libfuzzer-introspector-x86_64": 2025-08-10 10:13:43.631 INFO engine_input - analysis_func: Generating input for tests/fuzzers/ucl_msgpack_fuzzer.c
Step #6 - "compile-libfuzzer-introspector-x86_64": 2025-08-10 10:13:43.679 INFO calltree_analysis - __init__: Creating FuzzCalltreeAnalysis
Step #6 - "compile-libfuzzer-introspector-x86_64": 2025-08-10 10:13:43.680 INFO engine_input - analysis_func: Generating input for tests/fuzzers/ucl_add_string_fuzzer.c
Step #6 - "compile-libfuzzer-introspector-x86_64": 2025-08-10 10:13:43.680 INFO calltree_analysis - __init__: Creating FuzzCalltreeAnalysis
Step #6 - "compile-libfuzzer-introspector-x86_64": 2025-08-10 10:13:43.681 INFO engine_input - analysis_func: - Completed analysis FuzzEngineInputAnalysis
Step #6 - "compile-libfuzzer-introspector-x86_64": 2025-08-10 10:13:43.681 INFO runtime_coverage_analysis - analysis_func: - Running analysis RuntimeCoverageAnalysis
Step #6 - "compile-libfuzzer-introspector-x86_64": 2025-08-10 10:13:43.681 INFO runtime_coverage_analysis - analysis_func: - Completed analysis RuntimeCoverageAnalysis
Step #6 - "compile-libfuzzer-introspector-x86_64": 2025-08-10 10:13:43.681 INFO driver_synthesizer - analysis_func: - Running analysis FuzzDriverSynthesizerAnalysis
Step #6 - "compile-libfuzzer-introspector-x86_64": 2025-08-10 10:13:43.681 INFO optimal_targets - iteratively_get_optimal_targets: - in iteratively_get_optimal_targets
Step #6 - "compile-libfuzzer-introspector-x86_64": 2025-08-10 10:13:43.813 INFO optimal_targets - analysis_get_optimal_targets: - in analysis_get_optimal_targets
Step #6 - "compile-libfuzzer-introspector-x86_64": 2025-08-10 10:13:43.814 INFO optimal_targets - analysis_get_optimal_targets: Filtering optimal functions from 702 functions
Step #6 - "compile-libfuzzer-introspector-x86_64": 2025-08-10 10:13:43.814 INFO optimal_targets - analysis_get_optimal_targets: Found a total of 35 potential targets
Step #6 - "compile-libfuzzer-introspector-x86_64": 2025-08-10 10:13:43.814 INFO optimal_targets - iteratively_get_optimal_targets: Getting 10 optimal targets
Step #6 - "compile-libfuzzer-introspector-x86_64": 2025-08-10 10:13:43.814 INFO optimal_targets - iteratively_get_optimal_targets: - sorting by unreached complexity.
Step #6 - "compile-libfuzzer-introspector-x86_64": 2025-08-10 10:13:43.814 INFO optimal_targets - add_func_to_reached_and_clone: Creating a deepcopy
Step #6 - "compile-libfuzzer-introspector-x86_64": 2025-08-10 10:13:43.951 INFO optimal_targets - add_func_to_reached_and_clone: Updating hitcount
Step #6 - "compile-libfuzzer-introspector-x86_64": 2025-08-10 10:13:43.952 INFO optimal_targets - add_func_to_reached_and_clone: Updating hitcount-related data
Step #6 - "compile-libfuzzer-introspector-x86_64": 2025-08-10 10:13:43.960 INFO optimal_targets - analysis_get_optimal_targets: - in analysis_get_optimal_targets
Step #6 - "compile-libfuzzer-introspector-x86_64": 2025-08-10 10:13:43.960 INFO optimal_targets - analysis_get_optimal_targets: Filtering optimal functions from 702 functions
Step #6 - "compile-libfuzzer-introspector-x86_64": 2025-08-10 10:13:43.961 INFO optimal_targets - analysis_get_optimal_targets: Found a total of 10 potential targets
Step #6 - "compile-libfuzzer-introspector-x86_64": 2025-08-10 10:13:43.961 INFO optimal_targets - iteratively_get_optimal_targets: - sorting by unreached complexity.
Step #6 - "compile-libfuzzer-introspector-x86_64": 2025-08-10 10:13:43.961 INFO optimal_targets - add_func_to_reached_and_clone: Creating a deepcopy
Step #6 - "compile-libfuzzer-introspector-x86_64": 2025-08-10 10:13:44.190 INFO optimal_targets - add_func_to_reached_and_clone: Updating hitcount
Step #6 - "compile-libfuzzer-introspector-x86_64": 2025-08-10 10:13:44.190 INFO optimal_targets - add_func_to_reached_and_clone: Updating hitcount-related data
Step #6 - "compile-libfuzzer-introspector-x86_64": 2025-08-10 10:13:44.198 INFO optimal_targets - analysis_get_optimal_targets: - in analysis_get_optimal_targets
Step #6 - "compile-libfuzzer-introspector-x86_64": 2025-08-10 10:13:44.198 INFO optimal_targets - analysis_get_optimal_targets: Filtering optimal functions from 702 functions
Step #6 - "compile-libfuzzer-introspector-x86_64": 2025-08-10 10:13:44.199 INFO optimal_targets - analysis_get_optimal_targets: Found a total of 6 potential targets
Step #6 - "compile-libfuzzer-introspector-x86_64": 2025-08-10 10:13:44.199 INFO optimal_targets - iteratively_get_optimal_targets: - sorting by unreached complexity.
Step #6 - "compile-libfuzzer-introspector-x86_64": 2025-08-10 10:13:44.199 INFO optimal_targets - add_func_to_reached_and_clone: Creating a deepcopy
Step #6 - "compile-libfuzzer-introspector-x86_64": 2025-08-10 10:13:44.336 INFO optimal_targets - add_func_to_reached_and_clone: Updating hitcount
Step #6 - "compile-libfuzzer-introspector-x86_64": 2025-08-10 10:13:44.336 INFO optimal_targets - add_func_to_reached_and_clone: Updating hitcount-related data
Step #6 - "compile-libfuzzer-introspector-x86_64": 2025-08-10 10:13:44.344 INFO optimal_targets - analysis_get_optimal_targets: - in analysis_get_optimal_targets
Step #6 - "compile-libfuzzer-introspector-x86_64": 2025-08-10 10:13:44.345 INFO optimal_targets - analysis_get_optimal_targets: Filtering optimal functions from 702 functions
Step #6 - "compile-libfuzzer-introspector-x86_64": 2025-08-10 10:13:44.345 INFO optimal_targets - analysis_get_optimal_targets: Found a total of 3 potential targets
Step #6 - "compile-libfuzzer-introspector-x86_64": 2025-08-10 10:13:44.345 INFO optimal_targets - iteratively_get_optimal_targets: - sorting by unreached complexity.
Step #6 - "compile-libfuzzer-introspector-x86_64": 2025-08-10 10:13:44.345 INFO optimal_targets - add_func_to_reached_and_clone: Creating a deepcopy
Step #6 - "compile-libfuzzer-introspector-x86_64": 2025-08-10 10:13:44.482 INFO optimal_targets - add_func_to_reached_and_clone: Updating hitcount
Step #6 - "compile-libfuzzer-introspector-x86_64": 2025-08-10 10:13:44.482 INFO optimal_targets - add_func_to_reached_and_clone: Updating hitcount-related data
Step #6 - "compile-libfuzzer-introspector-x86_64": 2025-08-10 10:13:44.491 INFO optimal_targets - analysis_get_optimal_targets: - in analysis_get_optimal_targets
Step #6 - "compile-libfuzzer-introspector-x86_64": 2025-08-10 10:13:44.491 INFO optimal_targets - analysis_get_optimal_targets: Filtering optimal functions from 702 functions
Step #6 - "compile-libfuzzer-introspector-x86_64": 2025-08-10 10:13:44.492 INFO optimal_targets - analysis_get_optimal_targets: Found a total of 1 potential targets
Step #6 - "compile-libfuzzer-introspector-x86_64": 2025-08-10 10:13:44.492 INFO optimal_targets - iteratively_get_optimal_targets: - sorting by unreached complexity.
Step #6 - "compile-libfuzzer-introspector-x86_64": 2025-08-10 10:13:44.492 INFO optimal_targets - add_func_to_reached_and_clone: Creating a deepcopy
Step #6 - "compile-libfuzzer-introspector-x86_64": 2025-08-10 10:13:44.725 INFO optimal_targets - add_func_to_reached_and_clone: Updating hitcount
Step #6 - "compile-libfuzzer-introspector-x86_64": 2025-08-10 10:13:44.725 INFO optimal_targets - add_func_to_reached_and_clone: Updating hitcount-related data
Step #6 - "compile-libfuzzer-introspector-x86_64": 2025-08-10 10:13:44.734 INFO optimal_targets - analysis_get_optimal_targets: - in analysis_get_optimal_targets
Step #6 - "compile-libfuzzer-introspector-x86_64": 2025-08-10 10:13:44.734 INFO optimal_targets - analysis_get_optimal_targets: Filtering optimal functions from 702 functions
Step #6 - "compile-libfuzzer-introspector-x86_64": 2025-08-10 10:13:44.735 INFO optimal_targets - analysis_get_optimal_targets: Found a total of 0 potential targets
Step #6 - "compile-libfuzzer-introspector-x86_64": 2025-08-10 10:13:44.735 INFO optimal_targets - iteratively_get_optimal_targets: - sorting by unreached complexity.
Step #6 - "compile-libfuzzer-introspector-x86_64": 2025-08-10 10:13:44.735 INFO optimal_targets - iteratively_get_optimal_targets: Found the following optimal functions: { ['lua_ucl_parser_validate', 'ucl_include_common', 'ucl_emitter_common_elt', 'ucl_object_dtor_unref_single', 'ucl_object_merge'] }
Step #6 - "compile-libfuzzer-introspector-x86_64": 2025-08-10 10:13:44.735 INFO driver_synthesizer - analysis_func: . Done
Step #6 - "compile-libfuzzer-introspector-x86_64": 2025-08-10 10:13:44.735 INFO driver_synthesizer - analysis_func: . Done
Step #6 - "compile-libfuzzer-introspector-x86_64": 2025-08-10 10:13:44.735 INFO driver_synthesizer - analysis_func: . Done
Step #6 - "compile-libfuzzer-introspector-x86_64": 2025-08-10 10:13:44.735 INFO driver_synthesizer - analysis_func: . Done
Step #6 - "compile-libfuzzer-introspector-x86_64": 2025-08-10 10:13:44.735 INFO driver_synthesizer - analysis_func: . Done
Step #6 - "compile-libfuzzer-introspector-x86_64": 2025-08-10 10:13:44.735 INFO driver_synthesizer - analysis_func: Synthesizing drivers for the following optimal functions: { ['lua_ucl_parser_validate', 'ucl_include_common', 'ucl_emitter_common_elt', 'ucl_object_dtor_unref_single', 'ucl_object_merge'] }
Step #6 - "compile-libfuzzer-introspector-x86_64": 2025-08-10 10:13:44.735 INFO driver_synthesizer - analysis_func: - Completed analysis FuzzDriverSynthesizerAnalysis
Step #6 - "compile-libfuzzer-introspector-x86_64": 2025-08-10 10:13:44.738 INFO bug_digestor - analysis_func: - Running analysis BugDigestorAnalysis
Step #6 - "compile-libfuzzer-introspector-x86_64": 2025-08-10 10:13:44.738 INFO filepath_analyser - analysis_func: - Running analysis FilePathAnalyser
Step #6 - "compile-libfuzzer-introspector-x86_64": 2025-08-10 10:13:44.757 INFO function_call_analyser - analysis_func: - Running analysis ThirdPartyAPICoverageAnalyser
Step #6 - "compile-libfuzzer-introspector-x86_64": 2025-08-10 10:13:44.761 INFO metadata - analysis_func: - Running analysis MetadataAnalysis
Step #6 - "compile-libfuzzer-introspector-x86_64": 2025-08-10 10:13:44.762 INFO metadata - analysis_func: - Completed analysis MetadataAnalysis
Step #6 - "compile-libfuzzer-introspector-x86_64": 2025-08-10 10:13:44.762 INFO sinks_analyser - analysis_func: - Running analysis SinkCoverageAnalyser
Step #6 - "compile-libfuzzer-introspector-x86_64": 2025-08-10 10:13:44.773 INFO sinks_analyser - analysis_func: ['ucl_msgpack_fuzzer.c', 'ucl_add_string_fuzzer.c']
Step #6 - "compile-libfuzzer-introspector-x86_64": 2025-08-10 10:13:44.773 INFO sinks_analyser - analysis_func: - Running analysis SinkCoverageAnalyser for CWE78
Step #6 - "compile-libfuzzer-introspector-x86_64": 2025-08-10 10:13:44.774 INFO sinks_analyser - analysis_func: - Running analysis SinkCoverageAnalyser for CWE79
Step #6 - "compile-libfuzzer-introspector-x86_64": 2025-08-10 10:13:44.775 INFO sinks_analyser - analysis_func: - Running analysis SinkCoverageAnalyser for CWE787
Step #6 - "compile-libfuzzer-introspector-x86_64": 2025-08-10 10:13:44.777 INFO sinks_analyser - analysis_func: - Running analysis SinkCoverageAnalyser for CWE89
Step #6 - "compile-libfuzzer-introspector-x86_64": 2025-08-10 10:13:44.777 INFO sinks_analyser - analysis_func: - Running analysis SinkCoverageAnalyser for CWE416
Step #6 - "compile-libfuzzer-introspector-x86_64": 2025-08-10 10:13:44.778 INFO sinks_analyser - analysis_func: - Running analysis SinkCoverageAnalyser for CWE20
Step #6 - "compile-libfuzzer-introspector-x86_64": 2025-08-10 10:13:44.780 INFO sinks_analyser - analysis_func: - Running analysis SinkCoverageAnalyser for CWE22
Step #6 - "compile-libfuzzer-introspector-x86_64": 2025-08-10 10:13:44.781 INFO sinks_analyser - analysis_func: - Running analysis SinkCoverageAnalyser for CWE352
Step #6 - "compile-libfuzzer-introspector-x86_64": 2025-08-10 10:13:44.781 INFO sinks_analyser - analysis_func: - Running analysis SinkCoverageAnalyser for CWE434
Step #6 - "compile-libfuzzer-introspector-x86_64": 2025-08-10 10:13:44.782 INFO sinks_analyser - analysis_func: - Finish running analysis SinkCoverageAnalyser
Step #6 - "compile-libfuzzer-introspector-x86_64": 2025-08-10 10:13:44.783 INFO annotated_cfg - __init__: Creating annotated CFG
Step #6 - "compile-libfuzzer-introspector-x86_64": 2025-08-10 10:13:44.783 INFO annotated_cfg - analysis_func: Creating annotated CFGs
Step #6 - "compile-libfuzzer-introspector-x86_64": 2025-08-10 10:13:44.783 INFO annotated_cfg - analysis_func: Analysing: tests/fuzzers/ucl_msgpack_fuzzer.c
Step #6 - "compile-libfuzzer-introspector-x86_64": 2025-08-10 10:13:44.786 INFO annotated_cfg - analysis_func: Analysing: tests/fuzzers/ucl_add_string_fuzzer.c
Step #6 - "compile-libfuzzer-introspector-x86_64": 2025-08-10 10:13:44.790 INFO source_code_line_analyser - standalone_analysis: - Running analysis SourceCodeLineAnalyser
Step #6 - "compile-libfuzzer-introspector-x86_64": 2025-08-10 10:13:44.791 INFO far_reach_low_coverage_analyser - standalone_analysis: - Running analysis FarReachLowCoverageAnalyser
Step #6 - "compile-libfuzzer-introspector-x86_64": 2025-08-10 10:13:44.791 INFO far_reach_low_coverage_analyser - standalone_analysis: - Settings: exclude_static_functions: False, only_referenced_functions: False, only_header_functions: False, only_interesting_functions: False, only_easy_fuzz_params: False, min_complexity: 0, max_functions: 10
Step #6 - "compile-libfuzzer-introspector-x86_64": 2025-08-10 10:13:44.797 INFO far_reach_low_coverage_analyser - standalone_analysis: Found 10 function candidiates.
Step #6 - "compile-libfuzzer-introspector-x86_64": 2025-08-10 10:13:44.797 INFO far_reach_low_coverage_analyser - standalone_analysis: Dumping result to /src/inspector/result.json
Step #6 - "compile-libfuzzer-introspector-x86_64": 2025-08-10 10:13:44.798 INFO public_candidate_analyser - standalone_analysis: - Running analysis PublicCandidateAnalyser
Step #6 - "compile-libfuzzer-introspector-x86_64": 2025-08-10 10:13:44.806 INFO public_candidate_analyser - standalone_analysis: Found 651 function candidiates.
Step #6 - "compile-libfuzzer-introspector-x86_64": 2025-08-10 10:13:44.806 INFO public_candidate_analyser - standalone_analysis: Dumping result to /src/inspector/result.json
Step #6 - "compile-libfuzzer-introspector-x86_64": 2025-08-10 10:13:44.851 INFO oss_fuzz - analyse_folder: Found 36 files to include in analysis
Step #6 - "compile-libfuzzer-introspector-x86_64": 2025-08-10 10:13:44.851 INFO oss_fuzz - analyse_folder: Going C/C++ route
Step #6 - "compile-libfuzzer-introspector-x86_64": 2025-08-10 10:13:44.851 INFO oss_fuzz - analyse_folder: Loading tree-sitter trees
Step #6 - "compile-libfuzzer-introspector-x86_64": 2025-08-10 10:13:47.340 INFO frontend_c_cpp - load_treesitter_trees: harness: /src/libucl/tests/fuzzers/ucl_add_string_fuzzer.c
Step #6 - "compile-libfuzzer-introspector-x86_64": 2025-08-10 10:13:47.372 INFO frontend_c_cpp - load_treesitter_trees: harness: /src/libucl/tests/fuzzers/ucl_msgpack_fuzzer.c
Step #6 - "compile-libfuzzer-introspector-x86_64": 2025-08-10 10:14:03.213 INFO oss_fuzz - analyse_folder: Dump methods for ucl_add_string_fuzzer
Step #6 - "compile-libfuzzer-introspector-x86_64": 2025-08-10 10:14:03.213 INFO datatypes - dump_module_logic: Generating report
Step #6 - "compile-libfuzzer-introspector-x86_64": 2025-08-10 10:14:04.862 INFO datatypes - dump_module_logic: Report generated
Step #6 - "compile-libfuzzer-introspector-x86_64": 2025-08-10 10:14:04.900 INFO datatypes - dump_module_logic: Dumping project-wide logic.
Step #6 - "compile-libfuzzer-introspector-x86_64": 2025-08-10 10:14:04.900 INFO datatypes - dump_module_logic: Using safe yaml safe C dumper.
Step #6 - "compile-libfuzzer-introspector-x86_64": 2025-08-10 10:14:05.383 INFO datatypes - dump_module_logic: Dumped
Step #6 - "compile-libfuzzer-introspector-x86_64": 2025-08-10 10:14:05.385 INFO oss_fuzz - analyse_folder: Extracting calltree for ucl_add_string_fuzzer
Step #6 - "compile-libfuzzer-introspector-x86_64": 2025-08-10 10:14:05.489 INFO oss_fuzz - analyse_folder: Calltree extracted
Step #6 - "compile-libfuzzer-introspector-x86_64": 2025-08-10 10:14:05.490 INFO datatypes - dump_type_definition: Dumping custom type definitions.
Step #6 - "compile-libfuzzer-introspector-x86_64": 2025-08-10 10:14:05.491 INFO datatypes - dump_type_definition: Custom type definitions dumping completed.
Step #6 - "compile-libfuzzer-introspector-x86_64": 2025-08-10 10:14:05.491 INFO datatypes - dump_macro_block_info: Dumping macro blocks information.
Step #6 - "compile-libfuzzer-introspector-x86_64": 2025-08-10 10:14:05.493 INFO datatypes - dump_macro_block_info: Macro blocks information dumping completed.
Step #6 - "compile-libfuzzer-introspector-x86_64": 2025-08-10 10:14:05.493 INFO oss_fuzz - analyse_folder: Dump methods for ucl_msgpack_fuzzer
Step #6 - "compile-libfuzzer-introspector-x86_64": 2025-08-10 10:14:05.493 INFO datatypes - dump_module_logic: Generating report
Step #6 - "compile-libfuzzer-introspector-x86_64": 2025-08-10 10:14:05.527 INFO datatypes - dump_module_logic: Report generated
Step #6 - "compile-libfuzzer-introspector-x86_64": 2025-08-10 10:14:05.565 INFO datatypes - dump_module_logic: Dumping project-wide logic.
Step #6 - "compile-libfuzzer-introspector-x86_64": 2025-08-10 10:14:05.565 INFO datatypes - dump_module_logic: Using safe yaml safe C dumper.
Step #6 - "compile-libfuzzer-introspector-x86_64": 2025-08-10 10:14:06.055 INFO datatypes - dump_module_logic: Dumped
Step #6 - "compile-libfuzzer-introspector-x86_64": 2025-08-10 10:14:06.057 INFO oss_fuzz - analyse_folder: Extracting calltree for ucl_msgpack_fuzzer
Step #6 - "compile-libfuzzer-introspector-x86_64": 2025-08-10 10:14:06.162 INFO oss_fuzz - analyse_folder: Calltree extracted
Step #6 - "compile-libfuzzer-introspector-x86_64": 2025-08-10 10:14:06.162 INFO datatypes - dump_type_definition: Dumping custom type definitions.
Step #6 - "compile-libfuzzer-introspector-x86_64": 2025-08-10 10:14:06.164 INFO datatypes - dump_type_definition: Custom type definitions dumping completed.
Step #6 - "compile-libfuzzer-introspector-x86_64": 2025-08-10 10:14:06.164 INFO datatypes - dump_macro_block_info: Dumping macro blocks information.
Step #6 - "compile-libfuzzer-introspector-x86_64": 2025-08-10 10:14:06.166 INFO datatypes - dump_macro_block_info: Macro blocks information dumping completed.
Step #6 - "compile-libfuzzer-introspector-x86_64": 2025-08-10 10:14:06.169 INFO analysis - load_data_files: Loading profiles using files
Step #6 - "compile-libfuzzer-introspector-x86_64": 2025-08-10 10:14:06.169 INFO data_loader - load_all_profiles: Loading profiles from /src
Step #6 - "compile-libfuzzer-introspector-x86_64": 2025-08-10 10:14:06.201 INFO data_loader - load_all_profiles: []
Step #6 - "compile-libfuzzer-introspector-x86_64": 2025-08-10 10:14:06.201 INFO data_loader - load_all_profiles: - found 4 profiles to load
Step #6 - "compile-libfuzzer-introspector-x86_64": 2025-08-10 10:14:06.225 INFO data_loader - read_fuzzer_data_file_to_profile: - loading /src/inspector/fuzzerLogFile-ucl_add_string_fuzzer.data
Step #6 - "compile-libfuzzer-introspector-x86_64": 2025-08-10 10:14:06.226 INFO data_loader - read_fuzzer_data_file_to_profile: target data f: /src/inspector/fuzzerLogFile-ucl_add_string_fuzzer.data
Step #6 - "compile-libfuzzer-introspector-x86_64": 2025-08-10 10:14:06.226 INFO utils - data_file_read_yaml: Set base loader to use CSafeLoader
Step #6 - "compile-libfuzzer-introspector-x86_64": 2025-08-10 10:14:06.229 INFO data_loader - read_fuzzer_data_file_to_profile: - loading /src/inspector/fuzzerLogFile-ucl_msgpack_fuzzer.data
Step #6 - "compile-libfuzzer-introspector-x86_64": 2025-08-10 10:14:06.229 INFO data_loader - read_fuzzer_data_file_to_profile: target data f: /src/inspector/fuzzerLogFile-ucl_msgpack_fuzzer.data
Step #6 - "compile-libfuzzer-introspector-x86_64": 2025-08-10 10:14:06.229 INFO utils - data_file_read_yaml: Set base loader to use CSafeLoader
Step #6 - "compile-libfuzzer-introspector-x86_64": 2025-08-10 10:14:06.233 INFO data_loader - read_fuzzer_data_file_to_profile: - loading /src/inspector/second-frontend-run/fuzzerLogFile-ucl_add_string_fuzzer.data
Step #6 - "compile-libfuzzer-introspector-x86_64": 2025-08-10 10:14:06.233 INFO data_loader - read_fuzzer_data_file_to_profile: target data f: /src/inspector/second-frontend-run/fuzzerLogFile-ucl_add_string_fuzzer.data
Step #6 - "compile-libfuzzer-introspector-x86_64": 2025-08-10 10:14:06.233 INFO utils - data_file_read_yaml: Set base loader to use CSafeLoader
Step #6 - "compile-libfuzzer-introspector-x86_64": 2025-08-10 10:14:06.236 INFO data_loader - read_fuzzer_data_file_to_profile: - loading /src/inspector/second-frontend-run/fuzzerLogFile-ucl_msgpack_fuzzer.data
Step #6 - "compile-libfuzzer-introspector-x86_64": 2025-08-10 10:14:06.237 INFO data_loader - read_fuzzer_data_file_to_profile: target data f: /src/inspector/second-frontend-run/fuzzerLogFile-ucl_msgpack_fuzzer.data
Step #6 - "compile-libfuzzer-introspector-x86_64": 2025-08-10 10:14:06.237 INFO utils - data_file_read_yaml: Set base loader to use CSafeLoader
Step #6 - "compile-libfuzzer-introspector-x86_64": 2025-08-10 10:14:07.107 INFO utils - data_file_read_yaml: Loaded single yaml module
Step #6 - "compile-libfuzzer-introspector-x86_64": 2025-08-10 10:14:07.115 INFO utils - data_file_read_yaml: Loaded single yaml module
Step #6 - "compile-libfuzzer-introspector-x86_64": 2025-08-10 10:14:07.119 INFO utils - data_file_read_yaml: Loaded single yaml module
Step #6 - "compile-libfuzzer-introspector-x86_64": 2025-08-10 10:14:07.121 INFO utils - data_file_read_yaml: Loaded single yaml module
Step #6 - "compile-libfuzzer-introspector-x86_64": 2025-08-10 10:14:07.129 INFO data_loader - read_fuzzer_data_file_to_profile: Returning profile
Step #6 - "compile-libfuzzer-introspector-x86_64": 2025-08-10 10:14:07.138 INFO data_loader - read_fuzzer_data_file_to_profile: Returning profile
Step #6 - "compile-libfuzzer-introspector-x86_64": 2025-08-10 10:14:07.142 INFO data_loader - read_fuzzer_data_file_to_profile: Returning profile
Step #6 - "compile-libfuzzer-introspector-x86_64": 2025-08-10 10:14:07.143 INFO data_loader - read_fuzzer_data_file_to_profile: Returning profile
Step #6 - "compile-libfuzzer-introspector-x86_64": 2025-08-10 10:14:07.365 INFO analysis - load_data_files: Found 4 profiles
Step #6 - "compile-libfuzzer-introspector-x86_64": 2025-08-10 10:14:07.365 INFO analysis - load_data_files: [+] Accummulating profiles
Step #6 - "compile-libfuzzer-introspector-x86_64": 2025-08-10 10:14:07.365 INFO analysis - load_data_files: Accummulating using multiprocessing
Step #6 - "compile-libfuzzer-introspector-x86_64": 2025-08-10 10:14:07.386 INFO fuzzer_profile - accummulate_profile: /src/libucl/tests/fuzzers/ucl_msgpack_fuzzer.c: propagating functions reached
Step #6 - "compile-libfuzzer-introspector-x86_64": 2025-08-10 10:14:07.389 INFO fuzzer_profile - accummulate_profile: /src/libucl/tests/fuzzers/ucl_add_string_fuzzer.c: propagating functions reached
Step #6 - "compile-libfuzzer-introspector-x86_64": 2025-08-10 10:14:07.392 INFO fuzzer_profile - accummulate_profile: /src/libucl/tests/fuzzers/ucl_add_string_fuzzer.c: propagating functions reached
Step #6 - "compile-libfuzzer-introspector-x86_64": 2025-08-10 10:14:07.395 INFO fuzzer_profile - accummulate_profile: /src/libucl/tests/fuzzers/ucl_msgpack_fuzzer.c: propagating functions reached
Step #6 - "compile-libfuzzer-introspector-x86_64": 2025-08-10 10:14:07.403 INFO fuzzer_profile - accummulate_profile: /src/libucl/tests/fuzzers/ucl_msgpack_fuzzer.c: setting reached funcs
Step #6 - "compile-libfuzzer-introspector-x86_64": 2025-08-10 10:14:07.403 INFO fuzzer_profile - accummulate_profile: /src/libucl/tests/fuzzers/ucl_msgpack_fuzzer.c: setting unreached funcs
Step #6 - "compile-libfuzzer-introspector-x86_64": 2025-08-10 10:14:07.406 INFO fuzzer_profile - accummulate_profile: /src/libucl/tests/fuzzers/ucl_msgpack_fuzzer.c: loading coverage
Step #6 - "compile-libfuzzer-introspector-x86_64": 2025-08-10 10:14:07.406 INFO fuzzer_profile - _load_coverage: Loading coverage of type c-cpp
Step #6 - "compile-libfuzzer-introspector-x86_64": 2025-08-10 10:14:07.406 INFO code_coverage - load_llvm_coverage: Loading LLVM coverage for target /src/libucl/tests/fuzzers/ucl_msgpack_fuzzer.c
Step #6 - "compile-libfuzzer-introspector-x86_64": 2025-08-10 10:14:07.407 INFO fuzzer_profile - accummulate_profile: /src/libucl/tests/fuzzers/ucl_add_string_fuzzer.c: setting reached funcs
Step #6 - "compile-libfuzzer-introspector-x86_64": 2025-08-10 10:14:07.407 INFO fuzzer_profile - accummulate_profile: /src/libucl/tests/fuzzers/ucl_add_string_fuzzer.c: setting unreached funcs
Step #6 - "compile-libfuzzer-introspector-x86_64": 2025-08-10 10:14:07.409 INFO fuzzer_profile - accummulate_profile: /src/libucl/tests/fuzzers/ucl_add_string_fuzzer.c: loading coverage
Step #6 - "compile-libfuzzer-introspector-x86_64": 2025-08-10 10:14:07.409 INFO fuzzer_profile - _load_coverage: Loading coverage of type c-cpp
Step #6 - "compile-libfuzzer-introspector-x86_64": 2025-08-10 10:14:07.409 INFO code_coverage - load_llvm_coverage: Loading LLVM coverage for target /src/libucl/tests/fuzzers/ucl_add_string_fuzzer.c
Step #6 - "compile-libfuzzer-introspector-x86_64": 2025-08-10 10:14:07.411 INFO fuzzer_profile - accummulate_profile: /src/libucl/tests/fuzzers/ucl_add_string_fuzzer.c: setting reached funcs
Step #6 - "compile-libfuzzer-introspector-x86_64": 2025-08-10 10:14:07.411 INFO fuzzer_profile - accummulate_profile: /src/libucl/tests/fuzzers/ucl_add_string_fuzzer.c: setting unreached funcs
Step #6 - "compile-libfuzzer-introspector-x86_64": 2025-08-10 10:14:07.413 INFO fuzzer_profile - accummulate_profile: /src/libucl/tests/fuzzers/ucl_msgpack_fuzzer.c: setting reached funcs
Step #6 - "compile-libfuzzer-introspector-x86_64": 2025-08-10 10:14:07.413 INFO fuzzer_profile - accummulate_profile: /src/libucl/tests/fuzzers/ucl_add_string_fuzzer.c: loading coverage
Step #6 - "compile-libfuzzer-introspector-x86_64": 2025-08-10 10:14:07.413 INFO fuzzer_profile - _load_coverage: Loading coverage of type c-cpp
Step #6 - "compile-libfuzzer-introspector-x86_64": 2025-08-10 10:14:07.413 INFO fuzzer_profile - accummulate_profile: /src/libucl/tests/fuzzers/ucl_msgpack_fuzzer.c: setting unreached funcs
Step #6 - "compile-libfuzzer-introspector-x86_64": 2025-08-10 10:14:07.413 INFO code_coverage - load_llvm_coverage: Loading LLVM coverage for target /src/libucl/tests/fuzzers/ucl_add_string_fuzzer.c
Step #6 - "compile-libfuzzer-introspector-x86_64": 2025-08-10 10:14:07.416 INFO fuzzer_profile - accummulate_profile: /src/libucl/tests/fuzzers/ucl_msgpack_fuzzer.c: loading coverage
Step #6 - "compile-libfuzzer-introspector-x86_64": 2025-08-10 10:14:07.416 INFO fuzzer_profile - _load_coverage: Loading coverage of type c-cpp
Step #6 - "compile-libfuzzer-introspector-x86_64": 2025-08-10 10:14:07.416 INFO code_coverage - load_llvm_coverage: Loading LLVM coverage for target /src/libucl/tests/fuzzers/ucl_msgpack_fuzzer.c
Step #6 - "compile-libfuzzer-introspector-x86_64": 2025-08-10 10:14:07.416 INFO code_coverage - load_llvm_coverage: Found 0 coverage reports
Step #6 - "compile-libfuzzer-introspector-x86_64": 2025-08-10 10:14:07.417 INFO code_coverage - load_llvm_coverage: Using the following coverages []
Step #6 - "compile-libfuzzer-introspector-x86_64": 2025-08-10 10:14:07.417 INFO fuzzer_profile - accummulate_profile: /src/libucl/tests/fuzzers/ucl_msgpack_fuzzer.c: setting file targets
Step #6 - "compile-libfuzzer-introspector-x86_64": 2025-08-10 10:14:07.418 INFO fuzzer_profile - accummulate_profile: /src/libucl/tests/fuzzers/ucl_msgpack_fuzzer.c: setting total basic blocks
Step #6 - "compile-libfuzzer-introspector-x86_64": 2025-08-10 10:14:07.418 INFO fuzzer_profile - accummulate_profile: /src/libucl/tests/fuzzers/ucl_msgpack_fuzzer.c: setting cyclomatic complexity
Step #6 - "compile-libfuzzer-introspector-x86_64": 2025-08-10 10:14:07.418 INFO fuzzer_profile - accummulate_profile: /src/libucl/tests/fuzzers/ucl_msgpack_fuzzer.c: setting fd cache
Step #6 - "compile-libfuzzer-introspector-x86_64": 2025-08-10 10:14:07.419 INFO code_coverage - load_llvm_coverage: Found 0 coverage reports
Step #6 - "compile-libfuzzer-introspector-x86_64": 2025-08-10 10:14:07.420 INFO code_coverage - load_llvm_coverage: Using the following coverages []
Step #6 - "compile-libfuzzer-introspector-x86_64": 2025-08-10 10:14:07.420 INFO fuzzer_profile - accummulate_profile: /src/libucl/tests/fuzzers/ucl_msgpack_fuzzer.c: setting reached funcs in runtime
Step #6 - "compile-libfuzzer-introspector-x86_64": 2025-08-10 10:14:07.420 INFO fuzzer_profile - accummulate_profile: /src/libucl/tests/fuzzers/ucl_add_string_fuzzer.c: setting file targets
Step #6 - "compile-libfuzzer-introspector-x86_64": 2025-08-10 10:14:07.420 INFO fuzzer_profile - accummulate_profile: /src/libucl/tests/fuzzers/ucl_msgpack_fuzzer.c: finished accummulating profile
Step #6 - "compile-libfuzzer-introspector-x86_64": 2025-08-10 10:14:07.421 INFO fuzzer_profile - accummulate_profile: /src/libucl/tests/fuzzers/ucl_add_string_fuzzer.c: setting total basic blocks
Step #6 - "compile-libfuzzer-introspector-x86_64": 2025-08-10 10:14:07.421 INFO fuzzer_profile - accummulate_profile: /src/libucl/tests/fuzzers/ucl_add_string_fuzzer.c: setting cyclomatic complexity
Step #6 - "compile-libfuzzer-introspector-x86_64": 2025-08-10 10:14:07.421 INFO fuzzer_profile - accummulate_profile: /src/libucl/tests/fuzzers/ucl_add_string_fuzzer.c: setting fd cache
Step #6 - "compile-libfuzzer-introspector-x86_64": 2025-08-10 10:14:07.422 INFO fuzzer_profile - accummulate_profile: /src/libucl/tests/fuzzers/ucl_add_string_fuzzer.c: setting reached funcs in runtime
Step #6 - "compile-libfuzzer-introspector-x86_64": 2025-08-10 10:14:07.422 INFO fuzzer_profile - accummulate_profile: /src/libucl/tests/fuzzers/ucl_add_string_fuzzer.c: finished accummulating profile
Step #6 - "compile-libfuzzer-introspector-x86_64": 2025-08-10 10:14:07.423 INFO code_coverage - load_llvm_coverage: Found 0 coverage reports
Step #6 - "compile-libfuzzer-introspector-x86_64": 2025-08-10 10:14:07.424 INFO code_coverage - load_llvm_coverage: Using the following coverages []
Step #6 - "compile-libfuzzer-introspector-x86_64": 2025-08-10 10:14:07.424 INFO fuzzer_profile - accummulate_profile: /src/libucl/tests/fuzzers/ucl_add_string_fuzzer.c: setting file targets
Step #6 - "compile-libfuzzer-introspector-x86_64": 2025-08-10 10:14:07.425 INFO fuzzer_profile - accummulate_profile: /src/libucl/tests/fuzzers/ucl_add_string_fuzzer.c: setting total basic blocks
Step #6 - "compile-libfuzzer-introspector-x86_64": 2025-08-10 10:14:07.425 INFO fuzzer_profile - accummulate_profile: /src/libucl/tests/fuzzers/ucl_add_string_fuzzer.c: setting cyclomatic complexity
Step #6 - "compile-libfuzzer-introspector-x86_64": 2025-08-10 10:14:07.425 INFO fuzzer_profile - accummulate_profile: /src/libucl/tests/fuzzers/ucl_add_string_fuzzer.c: setting fd cache
Step #6 - "compile-libfuzzer-introspector-x86_64": 2025-08-10 10:14:07.425 INFO code_coverage - load_llvm_coverage: Found 0 coverage reports
Step #6 - "compile-libfuzzer-introspector-x86_64": 2025-08-10 10:14:07.426 INFO code_coverage - load_llvm_coverage: Using the following coverages []
Step #6 - "compile-libfuzzer-introspector-x86_64": 2025-08-10 10:14:07.426 INFO fuzzer_profile - accummulate_profile: /src/libucl/tests/fuzzers/ucl_msgpack_fuzzer.c: setting file targets
Step #6 - "compile-libfuzzer-introspector-x86_64": 2025-08-10 10:14:07.426 INFO fuzzer_profile - accummulate_profile: /src/libucl/tests/fuzzers/ucl_add_string_fuzzer.c: setting reached funcs in runtime
Step #6 - "compile-libfuzzer-introspector-x86_64": 2025-08-10 10:14:07.427 INFO fuzzer_profile - accummulate_profile: /src/libucl/tests/fuzzers/ucl_add_string_fuzzer.c: finished accummulating profile
Step #6 - "compile-libfuzzer-introspector-x86_64": 2025-08-10 10:14:07.427 INFO fuzzer_profile - accummulate_profile: /src/libucl/tests/fuzzers/ucl_msgpack_fuzzer.c: setting total basic blocks
Step #6 - "compile-libfuzzer-introspector-x86_64": 2025-08-10 10:14:07.427 INFO fuzzer_profile - accummulate_profile: /src/libucl/tests/fuzzers/ucl_msgpack_fuzzer.c: setting cyclomatic complexity
Step #6 - "compile-libfuzzer-introspector-x86_64": 2025-08-10 10:14:07.427 INFO fuzzer_profile - accummulate_profile: /src/libucl/tests/fuzzers/ucl_msgpack_fuzzer.c: setting fd cache
Step #6 - "compile-libfuzzer-introspector-x86_64": 2025-08-10 10:14:07.428 INFO fuzzer_profile - accummulate_profile: /src/libucl/tests/fuzzers/ucl_msgpack_fuzzer.c: setting reached funcs in runtime
Step #6 - "compile-libfuzzer-introspector-x86_64": 2025-08-10 10:14:07.428 INFO fuzzer_profile - accummulate_profile: /src/libucl/tests/fuzzers/ucl_msgpack_fuzzer.c: finished accummulating profile
Step #6 - "compile-libfuzzer-introspector-x86_64": 2025-08-10 10:14:07.666 INFO analysis - load_data_files: [+] Creating project profile
Step #6 - "compile-libfuzzer-introspector-x86_64": 2025-08-10 10:14:07.666 INFO project_profile - __init__: Creating merged profile of 4 profiles
Step #6 - "compile-libfuzzer-introspector-x86_64": 2025-08-10 10:14:07.666 INFO project_profile - __init__: Populating functions reached
Step #6 - "compile-libfuzzer-introspector-x86_64": 2025-08-10 10:14:07.666 INFO project_profile - __init__: Populating functions unreached
Step #6 - "compile-libfuzzer-introspector-x86_64": 2025-08-10 10:14:07.667 INFO project_profile - __init__: Creating all_functions dictionary
Step #6 - "compile-libfuzzer-introspector-x86_64": 2025-08-10 10:14:07.741 INFO project_profile - __init__: Gathering complexity and incoming references of each function
Step #6 - "compile-libfuzzer-introspector-x86_64": 2025-08-10 10:14:07.753 INFO project_profile - __init__: Completed creationg of merged profile
Step #6 - "compile-libfuzzer-introspector-x86_64": 2025-08-10 10:14:07.753 INFO analysis - load_data_files: [+] Refining profiles
Step #6 - "compile-libfuzzer-introspector-x86_64": 2025-08-10 10:14:07.757 INFO utils - get_target_coverage_url: Extracting coverage for /src/inspector/second-frontend-run -- tests/fuzzers/ucl_add_string_fuzzer.c
Step #6 - "compile-libfuzzer-introspector-x86_64": 2025-08-10 10:14:07.757 INFO analysis - overlay_calltree_with_coverage: Using coverage url: /src/inspector/second-frontend-run
Step #6 - "compile-libfuzzer-introspector-x86_64": 2025-08-10 10:14:07.758 INFO analysis - get_node_coverage_hitcount: There is no coverage data (not even all negative).
Step #6 - "compile-libfuzzer-introspector-x86_64": 2025-08-10 10:14:07.770 INFO analysis - overlay_calltree_with_coverage: Overlaying 2
Step #6 - "compile-libfuzzer-introspector-x86_64": 2025-08-10 10:14:07.770 INFO analysis - overlay_calltree_with_coverage: Overlaying 3
Step #6 - "compile-libfuzzer-introspector-x86_64": 2025-08-10 10:14:07.771 INFO analysis - overlay_calltree_with_coverage: Updating branch complexities
Step #6 - "compile-libfuzzer-introspector-x86_64": 2025-08-10 10:14:07.771 INFO analysis - overlay_calltree_with_coverage: [+] found 0 branch blockers.
Step #6 - "compile-libfuzzer-introspector-x86_64": 2025-08-10 10:14:07.772 INFO utils - get_target_coverage_url: Extracting coverage for /src/inspector/second-frontend-run -- tests/fuzzers/ucl_msgpack_fuzzer.c
Step #6 - "compile-libfuzzer-introspector-x86_64": 2025-08-10 10:14:07.772 INFO analysis - overlay_calltree_with_coverage: Using coverage url: /src/inspector/second-frontend-run
Step #6 - "compile-libfuzzer-introspector-x86_64": 2025-08-10 10:14:07.772 INFO analysis - get_node_coverage_hitcount: There is no coverage data (not even all negative).
Step #6 - "compile-libfuzzer-introspector-x86_64": 2025-08-10 10:14:07.784 INFO analysis - overlay_calltree_with_coverage: Overlaying 2
Step #6 - "compile-libfuzzer-introspector-x86_64": 2025-08-10 10:14:07.784 INFO analysis - overlay_calltree_with_coverage: Overlaying 3
Step #6 - "compile-libfuzzer-introspector-x86_64": 2025-08-10 10:14:07.785 INFO analysis - overlay_calltree_with_coverage: Updating branch complexities
Step #6 - "compile-libfuzzer-introspector-x86_64": 2025-08-10 10:14:07.786 INFO analysis - overlay_calltree_with_coverage: [+] found 0 branch blockers.
Step #6 - "compile-libfuzzer-introspector-x86_64": 2025-08-10 10:14:07.786 INFO utils - get_target_coverage_url: Extracting coverage for /src/inspector/second-frontend-run -- tests/fuzzers/ucl_msgpack_fuzzer.c
Step #6 - "compile-libfuzzer-introspector-x86_64": 2025-08-10 10:14:07.786 INFO analysis - overlay_calltree_with_coverage: Using coverage url: /src/inspector/second-frontend-run
Step #6 - "compile-libfuzzer-introspector-x86_64": 2025-08-10 10:14:07.786 INFO analysis - get_node_coverage_hitcount: There is no coverage data (not even all negative).
Step #6 - "compile-libfuzzer-introspector-x86_64": 2025-08-10 10:14:07.798 INFO analysis - overlay_calltree_with_coverage: Overlaying 2
Step #6 - "compile-libfuzzer-introspector-x86_64": 2025-08-10 10:14:07.798 INFO analysis - overlay_calltree_with_coverage: Overlaying 3
Step #6 - "compile-libfuzzer-introspector-x86_64": 2025-08-10 10:14:07.799 INFO analysis - overlay_calltree_with_coverage: Updating branch complexities
Step #6 - "compile-libfuzzer-introspector-x86_64": 2025-08-10 10:14:07.799 INFO analysis - overlay_calltree_with_coverage: [+] found 0 branch blockers.
Step #6 - "compile-libfuzzer-introspector-x86_64": 2025-08-10 10:14:07.800 INFO utils - get_target_coverage_url: Extracting coverage for /src/inspector/second-frontend-run -- tests/fuzzers/ucl_add_string_fuzzer.c
Step #6 - "compile-libfuzzer-introspector-x86_64": 2025-08-10 10:14:07.800 INFO analysis - overlay_calltree_with_coverage: Using coverage url: /src/inspector/second-frontend-run
Step #6 - "compile-libfuzzer-introspector-x86_64": 2025-08-10 10:14:07.800 INFO analysis - get_node_coverage_hitcount: There is no coverage data (not even all negative).
Step #6 - "compile-libfuzzer-introspector-x86_64": 2025-08-10 10:14:07.812 INFO analysis - overlay_calltree_with_coverage: Overlaying 2
Step #6 - "compile-libfuzzer-introspector-x86_64": 2025-08-10 10:14:07.812 INFO analysis - overlay_calltree_with_coverage: Overlaying 3
Step #6 - "compile-libfuzzer-introspector-x86_64": 2025-08-10 10:14:07.813 INFO analysis - overlay_calltree_with_coverage: Updating branch complexities
Step #6 - "compile-libfuzzer-introspector-x86_64": 2025-08-10 10:14:07.813 INFO analysis - overlay_calltree_with_coverage: [+] found 0 branch blockers.
Step #6 - "compile-libfuzzer-introspector-x86_64": 2025-08-10 10:14:07.949 INFO analysis - extract_tests_from_directories: All test files
Step #6 - "compile-libfuzzer-introspector-x86_64": 2025-08-10 10:14:07.950 INFO analysis - extract_tests_from_directories: /src/libucl/tests/test_schema.c
Step #6 - "compile-libfuzzer-introspector-x86_64": 2025-08-10 10:14:07.950 INFO analysis - extract_tests_from_directories: /src/libucl/examples/ucl_cpp.cc
Step #6 - "compile-libfuzzer-introspector-x86_64": 2025-08-10 10:14:07.950 INFO analysis - extract_tests_from_directories: /src/libucl/tests/test_speed.c
Step #6 - "compile-libfuzzer-introspector-x86_64": 2025-08-10 10:14:07.950 INFO analysis - extract_tests_from_directories: /src/libucl/tests/test_basic.c
Step #6 - "compile-libfuzzer-introspector-x86_64": 2025-08-10 10:14:07.950 INFO analysis - extract_tests_from_directories: /src/libucl/tests/test_streamline.c
Step #6 - "compile-libfuzzer-introspector-x86_64": 2025-08-10 10:14:07.950 INFO analysis - extract_tests_from_directories: /src/libucl/tests/test_generate.c
Step #6 - "compile-libfuzzer-introspector-x86_64": 2025-08-10 10:14:07.950 INFO analysis - extract_tests_from_directories: /src/libucl/tests/test_msgpack.c
Step #6 - "compile-libfuzzer-introspector-x86_64": 2025-08-10 10:14:07.961 INFO utils - get_target_coverage_url: Extracting coverage for https://storage.googleapis.com/oss-fuzz-coverage/libucl/reports/20250810/linux -- tests/fuzzers/ucl_msgpack_fuzzer.c
Step #6 - "compile-libfuzzer-introspector-x86_64": 2025-08-10 10:14:07.961 INFO utils - get_target_coverage_url: Extracting coverage for https://storage.googleapis.com/oss-fuzz-coverage/libucl/reports/20250810/linux -- tests/fuzzers/ucl_add_string_fuzzer.c
Step #6 - "compile-libfuzzer-introspector-x86_64": 2025-08-10 10:14:07.962 INFO debug_info - load_debug_all_yaml_files: Set base loader to use CSafeLoader
Step #6 - "compile-libfuzzer-introspector-x86_64": 2025-08-10 10:14:07.962 INFO debug_info - load_debug_all_yaml_files: Set base loader to use CSafeLoader
Step #6 - "compile-libfuzzer-introspector-x86_64": 2025-08-10 10:14:07.962 INFO debug_info - correlate_debugged_function_to_debug_types: Creating dictionary
Step #6 - "compile-libfuzzer-introspector-x86_64": 2025-08-10 10:14:07.962 INFO debug_info - create_friendly_debug_types: Have to create for 0 addresses
Step #6 - "compile-libfuzzer-introspector-x86_64": 2025-08-10 10:14:07.962 INFO debug_info - correlate_debugged_function_to_debug_types: Finished creating dictionary
Step #6 - "compile-libfuzzer-introspector-x86_64": 2025-08-10 10:14:07.964 INFO analysis - extract_tests_from_directories: All test files
Step #6 - "compile-libfuzzer-introspector-x86_64": 2025-08-10 10:14:08.026 INFO html_report - write_content_to_html_files: Dumping report
Step #6 - "compile-libfuzzer-introspector-x86_64": 2025-08-10 10:14:08.092 INFO cli - main: Ending fuzz introspector post-processing
Step #6 - "compile-libfuzzer-introspector-x86_64": sending incremental file list
Step #6 - "compile-libfuzzer-introspector-x86_64": created directory /workspace/out/libfuzzer-introspector-x86_64/inspector
Step #6 - "compile-libfuzzer-introspector-x86_64": ./
Step #6 - "compile-libfuzzer-introspector-x86_64": all-files.json
Step #6 - "compile-libfuzzer-introspector-x86_64": all-friendly-debug-types.json
Step #6 - "compile-libfuzzer-introspector-x86_64": all-fuzz-introspector-functions.json
Step #6 - "compile-libfuzzer-introspector-x86_64": all_debug_info.json
Step #6 - "compile-libfuzzer-introspector-x86_64": all_functions.js
Step #6 - "compile-libfuzzer-introspector-x86_64": all_tests.json
Step #6 - "compile-libfuzzer-introspector-x86_64": all_tests_with_xreference.json
Step #6 - "compile-libfuzzer-introspector-x86_64": analysis_1.js
Step #6 - "compile-libfuzzer-introspector-x86_64": branch-blockers.json
Step #6 - "compile-libfuzzer-introspector-x86_64": calltree.js
Step #6 - "compile-libfuzzer-introspector-x86_64": calltree_view_0.html
Step #6 - "compile-libfuzzer-introspector-x86_64": calltree_view_1.html
Step #6 - "compile-libfuzzer-introspector-x86_64": clike.js
Step #6 - "compile-libfuzzer-introspector-x86_64": custom.js
Step #6 - "compile-libfuzzer-introspector-x86_64": full_type_defs.json
Step #6 - "compile-libfuzzer-introspector-x86_64": fuzz_report.html
Step #6 - "compile-libfuzzer-introspector-x86_64": fuzzerLogFile-ucl_add_string_fuzzer.data
Step #6 - "compile-libfuzzer-introspector-x86_64": fuzzerLogFile-ucl_add_string_fuzzer.data.yaml
Step #6 - "compile-libfuzzer-introspector-x86_64": fuzzerLogFile-ucl_msgpack_fuzzer.data
Step #6 - "compile-libfuzzer-introspector-x86_64": fuzzerLogFile-ucl_msgpack_fuzzer.data.yaml
Step #6 - "compile-libfuzzer-introspector-x86_64": fuzzer_table_data.js
Step #6 - "compile-libfuzzer-introspector-x86_64": macro_block_info.json
Step #6 - "compile-libfuzzer-introspector-x86_64": prism.css
Step #6 - "compile-libfuzzer-introspector-x86_64": prism.js
Step #6 - "compile-libfuzzer-introspector-x86_64": result.json
Step #6 - "compile-libfuzzer-introspector-x86_64": styles.css
Step #6 - "compile-libfuzzer-introspector-x86_64": summary.json
Step #6 - "compile-libfuzzer-introspector-x86_64": test-files.json
Step #6 - "compile-libfuzzer-introspector-x86_64": tests_fuzzers_ucl_add_string_fuzzer.c_colormap.png
Step #6 - "compile-libfuzzer-introspector-x86_64": tests_fuzzers_ucl_msgpack_fuzzer.c_colormap.png
Step #6 - "compile-libfuzzer-introspector-x86_64": light/
Step #6 - "compile-libfuzzer-introspector-x86_64": light/all_files.json
Step #6 - "compile-libfuzzer-introspector-x86_64": light/all_pairs.json
Step #6 - "compile-libfuzzer-introspector-x86_64": light/all_tests.json
Step #6 - "compile-libfuzzer-introspector-x86_64": light/source_files/
Step #6 - "compile-libfuzzer-introspector-x86_64": light/source_files/src/
Step #6 - "compile-libfuzzer-introspector-x86_64": light/source_files/src/libucl/
Step #6 - "compile-libfuzzer-introspector-x86_64": light/source_files/src/libucl/examples/
Step #6 - "compile-libfuzzer-introspector-x86_64": light/source_files/src/libucl/examples/ucl_cpp.cc
Step #6 - "compile-libfuzzer-introspector-x86_64": light/source_files/src/libucl/include/
Step #6 - "compile-libfuzzer-introspector-x86_64": light/source_files/src/libucl/include/lua_ucl.h
Step #6 - "compile-libfuzzer-introspector-x86_64": light/source_files/src/libucl/include/ucl++.h
Step #6 - "compile-libfuzzer-introspector-x86_64": light/source_files/src/libucl/include/ucl.h
Step #6 - "compile-libfuzzer-introspector-x86_64": light/source_files/src/libucl/klib/
Step #6 - "compile-libfuzzer-introspector-x86_64": light/source_files/src/libucl/klib/khash.h
Step #6 - "compile-libfuzzer-introspector-x86_64": light/source_files/src/libucl/klib/kvec.h
Step #6 - "compile-libfuzzer-introspector-x86_64": light/source_files/src/libucl/lua/
Step #6 - "compile-libfuzzer-introspector-x86_64": light/source_files/src/libucl/lua/lua_ucl.c
Step #6 - "compile-libfuzzer-introspector-x86_64": light/source_files/src/libucl/python/
Step #6 - "compile-libfuzzer-introspector-x86_64": light/source_files/src/libucl/python/src/
Step #6 - "compile-libfuzzer-introspector-x86_64": light/source_files/src/libucl/python/src/uclmodule.c
Step #6 - "compile-libfuzzer-introspector-x86_64": light/source_files/src/libucl/src/
Step #6 - "compile-libfuzzer-introspector-x86_64": light/source_files/src/libucl/src/mum.h
Step #6 - "compile-libfuzzer-introspector-x86_64": light/source_files/src/libucl/src/tree.h
Step #6 - "compile-libfuzzer-introspector-x86_64": light/source_files/src/libucl/src/ucl_chartable.h
Step #6 - "compile-libfuzzer-introspector-x86_64": light/source_files/src/libucl/src/ucl_emitter.c
Step #6 - "compile-libfuzzer-introspector-x86_64": light/source_files/src/libucl/src/ucl_emitter_streamline.c
Step #6 - "compile-libfuzzer-introspector-x86_64": light/source_files/src/libucl/src/ucl_emitter_utils.c
Step #6 - "compile-libfuzzer-introspector-x86_64": light/source_files/src/libucl/src/ucl_hash.c
Step #6 - "compile-libfuzzer-introspector-x86_64": light/source_files/src/libucl/src/ucl_hash.h
Step #6 - "compile-libfuzzer-introspector-x86_64": light/source_files/src/libucl/src/ucl_internal.h
Step #6 - "compile-libfuzzer-introspector-x86_64": light/source_files/src/libucl/src/ucl_msgpack.c
Step #6 - "compile-libfuzzer-introspector-x86_64": light/source_files/src/libucl/src/ucl_parser.c
Step #6 - "compile-libfuzzer-introspector-x86_64": light/source_files/src/libucl/src/ucl_schema.c
Step #6 - "compile-libfuzzer-introspector-x86_64": light/source_files/src/libucl/src/ucl_sexp.c
Step #6 - "compile-libfuzzer-introspector-x86_64": light/source_files/src/libucl/src/ucl_util.c
Step #6 - "compile-libfuzzer-introspector-x86_64": light/source_files/src/libucl/tests/
Step #6 - "compile-libfuzzer-introspector-x86_64": light/source_files/src/libucl/tests/test_basic.c
Step #6 - "compile-libfuzzer-introspector-x86_64": light/source_files/src/libucl/tests/test_generate.c
Step #6 - "compile-libfuzzer-introspector-x86_64": light/source_files/src/libucl/tests/test_msgpack.c
Step #6 - "compile-libfuzzer-introspector-x86_64": light/source_files/src/libucl/tests/test_schema.c
Step #6 - "compile-libfuzzer-introspector-x86_64": light/source_files/src/libucl/tests/test_speed.c
Step #6 - "compile-libfuzzer-introspector-x86_64": light/source_files/src/libucl/tests/test_streamline.c
Step #6 - "compile-libfuzzer-introspector-x86_64": light/source_files/src/libucl/tests/fuzzers/
Step #6 - "compile-libfuzzer-introspector-x86_64": light/source_files/src/libucl/tests/fuzzers/ucl_add_string_fuzzer.c
Step #6 - "compile-libfuzzer-introspector-x86_64": light/source_files/src/libucl/tests/fuzzers/ucl_msgpack_fuzzer.c
Step #6 - "compile-libfuzzer-introspector-x86_64": light/source_files/src/libucl/uthash/
Step #6 - "compile-libfuzzer-introspector-x86_64": light/source_files/src/libucl/uthash/uthash.h
Step #6 - "compile-libfuzzer-introspector-x86_64": light/source_files/src/libucl/uthash/utlist.h
Step #6 - "compile-libfuzzer-introspector-x86_64": light/source_files/src/libucl/uthash/utstring.h
Step #6 - "compile-libfuzzer-introspector-x86_64": light/source_files/src/libucl/utils/
Step #6 - "compile-libfuzzer-introspector-x86_64": light/source_files/src/libucl/utils/chargen.c
Step #6 - "compile-libfuzzer-introspector-x86_64": light/source_files/src/libucl/utils/objdump.c
Step #6 - "compile-libfuzzer-introspector-x86_64": light/source_files/src/libucl/utils/ucl-tool.c
Step #6 - "compile-libfuzzer-introspector-x86_64": second-frontend-run/
Step #6 - "compile-libfuzzer-introspector-x86_64": second-frontend-run/full_type_defs.json
Step #6 - "compile-libfuzzer-introspector-x86_64": second-frontend-run/fuzzerLogFile-ucl_add_string_fuzzer.data
Step #6 - "compile-libfuzzer-introspector-x86_64": second-frontend-run/fuzzerLogFile-ucl_add_string_fuzzer.data.yaml
Step #6 - "compile-libfuzzer-introspector-x86_64": second-frontend-run/fuzzerLogFile-ucl_msgpack_fuzzer.data
Step #6 - "compile-libfuzzer-introspector-x86_64": second-frontend-run/fuzzerLogFile-ucl_msgpack_fuzzer.data.yaml
Step #6 - "compile-libfuzzer-introspector-x86_64": second-frontend-run/macro_block_info.json
Step #6 - "compile-libfuzzer-introspector-x86_64": source-code/
Step #6 - "compile-libfuzzer-introspector-x86_64": source-code/src/
Step #6 - "compile-libfuzzer-introspector-x86_64": source-code/src/libucl/
Step #6 - "compile-libfuzzer-introspector-x86_64": source-code/src/libucl/examples/
Step #6 - "compile-libfuzzer-introspector-x86_64": source-code/src/libucl/examples/ucl_cpp.cc
Step #6 - "compile-libfuzzer-introspector-x86_64": source-code/src/libucl/include/
Step #6 - "compile-libfuzzer-introspector-x86_64": source-code/src/libucl/include/lua_ucl.h
Step #6 - "compile-libfuzzer-introspector-x86_64": source-code/src/libucl/include/ucl++.h
Step #6 - "compile-libfuzzer-introspector-x86_64": source-code/src/libucl/include/ucl.h
Step #6 - "compile-libfuzzer-introspector-x86_64": source-code/src/libucl/klib/
Step #6 - "compile-libfuzzer-introspector-x86_64": source-code/src/libucl/klib/khash.h
Step #6 - "compile-libfuzzer-introspector-x86_64": source-code/src/libucl/klib/kvec.h
Step #6 - "compile-libfuzzer-introspector-x86_64": source-code/src/libucl/lua/
Step #6 - "compile-libfuzzer-introspector-x86_64": source-code/src/libucl/lua/lua_ucl.c
Step #6 - "compile-libfuzzer-introspector-x86_64": source-code/src/libucl/python/
Step #6 - "compile-libfuzzer-introspector-x86_64": source-code/src/libucl/python/src/
Step #6 - "compile-libfuzzer-introspector-x86_64": source-code/src/libucl/python/src/uclmodule.c
Step #6 - "compile-libfuzzer-introspector-x86_64": source-code/src/libucl/src/
Step #6 - "compile-libfuzzer-introspector-x86_64": source-code/src/libucl/src/mum.h
Step #6 - "compile-libfuzzer-introspector-x86_64": source-code/src/libucl/src/tree.h
Step #6 - "compile-libfuzzer-introspector-x86_64": source-code/src/libucl/src/ucl_chartable.h
Step #6 - "compile-libfuzzer-introspector-x86_64": source-code/src/libucl/src/ucl_emitter.c
Step #6 - "compile-libfuzzer-introspector-x86_64": source-code/src/libucl/src/ucl_emitter_streamline.c
Step #6 - "compile-libfuzzer-introspector-x86_64": source-code/src/libucl/src/ucl_emitter_utils.c
Step #6 - "compile-libfuzzer-introspector-x86_64": source-code/src/libucl/src/ucl_hash.c
Step #6 - "compile-libfuzzer-introspector-x86_64": source-code/src/libucl/src/ucl_hash.h
Step #6 - "compile-libfuzzer-introspector-x86_64": source-code/src/libucl/src/ucl_internal.h
Step #6 - "compile-libfuzzer-introspector-x86_64": source-code/src/libucl/src/ucl_msgpack.c
Step #6 - "compile-libfuzzer-introspector-x86_64": source-code/src/libucl/src/ucl_parser.c
Step #6 - "compile-libfuzzer-introspector-x86_64": source-code/src/libucl/src/ucl_schema.c
Step #6 - "compile-libfuzzer-introspector-x86_64": source-code/src/libucl/src/ucl_sexp.c
Step #6 - "compile-libfuzzer-introspector-x86_64": source-code/src/libucl/src/ucl_util.c
Step #6 - "compile-libfuzzer-introspector-x86_64": source-code/src/libucl/tests/
Step #6 - "compile-libfuzzer-introspector-x86_64": source-code/src/libucl/tests/test_basic.c
Step #6 - "compile-libfuzzer-introspector-x86_64": source-code/src/libucl/tests/test_generate.c
Step #6 - "compile-libfuzzer-introspector-x86_64": source-code/src/libucl/tests/test_msgpack.c
Step #6 - "compile-libfuzzer-introspector-x86_64": source-code/src/libucl/tests/test_schema.c
Step #6 - "compile-libfuzzer-introspector-x86_64": source-code/src/libucl/tests/test_speed.c
Step #6 - "compile-libfuzzer-introspector-x86_64": source-code/src/libucl/tests/test_streamline.c
Step #6 - "compile-libfuzzer-introspector-x86_64": source-code/src/libucl/tests/fuzzers/
Step #6 - "compile-libfuzzer-introspector-x86_64": source-code/src/libucl/tests/fuzzers/ucl_add_string_fuzzer.c
Step #6 - "compile-libfuzzer-introspector-x86_64": source-code/src/libucl/tests/fuzzers/ucl_msgpack_fuzzer.c
Step #6 - "compile-libfuzzer-introspector-x86_64": source-code/src/libucl/uthash/
Step #6 - "compile-libfuzzer-introspector-x86_64": source-code/src/libucl/uthash/uthash.h
Step #6 - "compile-libfuzzer-introspector-x86_64": source-code/src/libucl/uthash/utlist.h
Step #6 - "compile-libfuzzer-introspector-x86_64": source-code/src/libucl/uthash/utstring.h
Step #6 - "compile-libfuzzer-introspector-x86_64": source-code/src/libucl/utils/
Step #6 - "compile-libfuzzer-introspector-x86_64": source-code/src/libucl/utils/chargen.c
Step #6 - "compile-libfuzzer-introspector-x86_64": source-code/src/libucl/utils/objdump.c
Step #6 - "compile-libfuzzer-introspector-x86_64": source-code/src/libucl/utils/ucl-tool.c
Step #6 - "compile-libfuzzer-introspector-x86_64":
Step #6 - "compile-libfuzzer-introspector-x86_64": sent 11,871,957 bytes received 2,389 bytes 23,748,692.00 bytes/sec
Step #6 - "compile-libfuzzer-introspector-x86_64": total size is 11,860,645 speedup is 1.00
Step #6 - "compile-libfuzzer-introspector-x86_64": ---------------------------------------------------------------
Step #6 - "compile-libfuzzer-introspector-x86_64": CC=clang
Step #6 - "compile-libfuzzer-introspector-x86_64": CXX=clang++
Step #6 - "compile-libfuzzer-introspector-x86_64": CFLAGS=-O1 -fno-omit-frame-pointer -gline-tables-only -Wno-error=enum-constexpr-conversion -Wno-error=incompatible-function-pointer-types -Wno-error=int-conversion -Wno-error=deprecated-declarations -Wno-error=implicit-function-declaration -Wno-error=implicit-int -Wno-error=vla-cxx-extension -DFUZZING_BUILD_MODE_UNSAFE_FOR_PRODUCTION -O0 -flto -fno-inline-functions -fuse-ld=gold -Wno-unused-command-line-argument -fsanitize=fuzzer-no-link -g
Step #6 - "compile-libfuzzer-introspector-x86_64": CXXFLAGS=-O1 -fno-omit-frame-pointer -gline-tables-only -Wno-error=enum-constexpr-conversion -Wno-error=incompatible-function-pointer-types -Wno-error=int-conversion -Wno-error=deprecated-declarations -Wno-error=implicit-function-declaration -Wno-error=implicit-int -Wno-error=vla-cxx-extension -DFUZZING_BUILD_MODE_UNSAFE_FOR_PRODUCTION -O0 -flto -fno-inline-functions -fuse-ld=gold -Wno-unused-command-line-argument -fsanitize=fuzzer-no-link -stdlib=libc++ -g
Step #6 - "compile-libfuzzer-introspector-x86_64": RUSTFLAGS=-Cdebuginfo=2 -Cforce-frame-pointers
Step #6 - "compile-libfuzzer-introspector-x86_64": ---------------------------------------------------------------
Step #6 - "compile-libfuzzer-introspector-x86_64": + cp /src/ucl_add_string_fuzzer.options /workspace/out/libfuzzer-introspector-x86_64/
Step #6 - "compile-libfuzzer-introspector-x86_64": + cd libucl
Step #6 - "compile-libfuzzer-introspector-x86_64": + ./autogen.sh
Step #6 - "compile-libfuzzer-introspector-x86_64": configure.ac:7: error: Autoconf version 2.70 or higher is required
Step #6 - "compile-libfuzzer-introspector-x86_64": configure.ac:7: the top level
Step #6 - "compile-libfuzzer-introspector-x86_64": autom4te: /usr/bin/m4 failed with exit status: 63
Step #6 - "compile-libfuzzer-introspector-x86_64": aclocal: error: echo failed with exit status: 63
Step #6 - "compile-libfuzzer-introspector-x86_64": autoreconf: aclocal failed with exit status: 63
Step #6 - "compile-libfuzzer-introspector-x86_64": + make
Step #6 - "compile-libfuzzer-introspector-x86_64": make: *** No targets specified and no makefile found. Stop.
Step #6 - "compile-libfuzzer-introspector-x86_64": ********************************************************************************
Step #6 - "compile-libfuzzer-introspector-x86_64": Failed to build.
Step #6 - "compile-libfuzzer-introspector-x86_64": To reproduce, run:
Step #6 - "compile-libfuzzer-introspector-x86_64": python infra/helper.py build_image libucl
Step #6 - "compile-libfuzzer-introspector-x86_64": python infra/helper.py build_fuzzers --sanitizer introspector --engine libfuzzer --architecture x86_64 libucl
Step #6 - "compile-libfuzzer-introspector-x86_64": ********************************************************************************
Finished Step #6 - "compile-libfuzzer-introspector-x86_64"
ERROR: step exited with non-zero status: 1
Starting Step #7
Step #7: Already have image (with digest): gcr.io/cloud-builders/gsutil
Step #7: CommandException: 1 files/objects could not be removed.
Finished Step #7
Starting Step #8
Step #8: Already have image (with digest): gcr.io/cloud-builders/gsutil
Step #8: Copying file:///workspace/out/libfuzzer-introspector-x86_64/inspector/summary.json [Content-Type=application/json]...
Step #8: / [0/111 files][ 0.0 B/ 11.3 MiB] 0% Done
Copying file:///workspace/out/libfuzzer-introspector-x86_64/inspector/prism.js [Content-Type=text/javascript]...
Step #8: / [0/111 files][ 0.0 B/ 11.3 MiB] 0% Done
Copying file:///workspace/out/libfuzzer-introspector-x86_64/inspector/tests_fuzzers_ucl_msgpack_fuzzer.c_colormap.png [Content-Type=image/png]...
Step #8: / [0/111 files][ 0.0 B/ 11.3 MiB] 0% Done
Copying file:///workspace/out/libfuzzer-introspector-x86_64/inspector/all_tests.json [Content-Type=application/json]...
Step #8: / [0/111 files][ 0.0 B/ 11.3 MiB] 0% Done
Copying file:///workspace/out/libfuzzer-introspector-x86_64/inspector/custom.js [Content-Type=text/javascript]...
Step #8: / [0/111 files][ 0.0 B/ 11.3 MiB] 0% Done
Copying file:///workspace/out/libfuzzer-introspector-x86_64/inspector/fuzzerLogFile-ucl_add_string_fuzzer.data.yaml [Content-Type=application/octet-stream]...
Step #8: / [0/111 files][ 4.8 KiB/ 11.3 MiB] 0% Done
Copying file:///workspace/out/libfuzzer-introspector-x86_64/inspector/fuzzerLogFile-ucl_add_string_fuzzer.data [Content-Type=application/octet-stream]...
Step #8: / [0/111 files][ 4.8 KiB/ 11.3 MiB] 0% Done
Copying file:///workspace/out/libfuzzer-introspector-x86_64/inspector/result.json [Content-Type=application/json]...
Step #8: / [0/111 files][ 4.8 KiB/ 11.3 MiB] 0% Done
Copying file:///workspace/out/libfuzzer-introspector-x86_64/inspector/fuzz_report.html [Content-Type=text/html]...
Step #8: / [0/111 files][ 57.6 KiB/ 11.3 MiB] 0% Done
Copying file:///workspace/out/libfuzzer-introspector-x86_64/inspector/all-files.json [Content-Type=application/json]...
Step #8: / [0/111 files][ 77.4 KiB/ 11.3 MiB] 0% Done
/ [1/111 files][ 77.4 KiB/ 11.3 MiB] 0% Done
/ [2/111 files][ 77.4 KiB/ 11.3 MiB] 0% Done
/ [3/111 files][ 77.4 KiB/ 11.3 MiB] 0% Done
/ [4/111 files][ 77.4 KiB/ 11.3 MiB] 0% Done
/ [5/111 files][869.4 KiB/ 11.3 MiB] 7% Done
Copying file:///workspace/out/libfuzzer-introspector-x86_64/inspector/all_functions.js [Content-Type=text/javascript]...
Step #8: / [5/111 files][ 1.6 MiB/ 11.3 MiB] 14% Done
Copying file:///workspace/out/libfuzzer-introspector-x86_64/inspector/calltree_view_1.html [Content-Type=text/html]...
Step #8: / [5/111 files][ 1.6 MiB/ 11.3 MiB] 14% Done
/ [6/111 files][ 1.6 MiB/ 11.3 MiB] 14% Done
Copying file:///workspace/out/libfuzzer-introspector-x86_64/inspector/branch-blockers.json [Content-Type=application/json]...
Step #8: / [6/111 files][ 1.6 MiB/ 11.3 MiB] 14% Done
/ [7/111 files][ 1.6 MiB/ 11.3 MiB] 14% Done
Copying file:///workspace/out/libfuzzer-introspector-x86_64/inspector/calltree.js [Content-Type=text/javascript]...
Step #8: / [7/111 files][ 1.6 MiB/ 11.3 MiB] 14% Done
Copying file:///workspace/out/libfuzzer-introspector-x86_64/inspector/fuzzer_table_data.js [Content-Type=text/javascript]...
Step #8: Copying file:///workspace/out/libfuzzer-introspector-x86_64/inspector/tests_fuzzers_ucl_add_string_fuzzer.c_colormap.png [Content-Type=image/png]...
Step #8: / [7/111 files][ 1.6 MiB/ 11.3 MiB] 14% Done
/ [7/111 files][ 1.6 MiB/ 11.3 MiB] 14% Done
/ [8/111 files][ 1.6 MiB/ 11.3 MiB] 14% Done
/ [9/111 files][ 1.9 MiB/ 11.3 MiB] 16% Done
/ [10/111 files][ 1.9 MiB/ 11.3 MiB] 16% Done
Copying file:///workspace/out/libfuzzer-introspector-x86_64/inspector/all_tests_with_xreference.json [Content-Type=application/json]...
Step #8: / [10/111 files][ 2.7 MiB/ 11.3 MiB] 24% Done
Copying file:///workspace/out/libfuzzer-introspector-x86_64/inspector/macro_block_info.json [Content-Type=application/json]...
Step #8: / [10/111 files][ 2.7 MiB/ 11.3 MiB] 24% Done
Copying file:///workspace/out/libfuzzer-introspector-x86_64/inspector/full_type_defs.json [Content-Type=application/json]...
Step #8: / [10/111 files][ 2.7 MiB/ 11.3 MiB] 24% Done
Copying file:///workspace/out/libfuzzer-introspector-x86_64/inspector/prism.css [Content-Type=text/css]...
Step #8: / [10/111 files][ 2.7 MiB/ 11.3 MiB] 24% Done
Copying file:///workspace/out/libfuzzer-introspector-x86_64/inspector/clike.js [Content-Type=text/javascript]...
Step #8: / [10/111 files][ 2.7 MiB/ 11.3 MiB] 24% Done
Copying file:///workspace/out/libfuzzer-introspector-x86_64/inspector/all-friendly-debug-types.json [Content-Type=application/json]...
Step #8: / [10/111 files][ 2.7 MiB/ 11.3 MiB] 24% Done
Copying file:///workspace/out/libfuzzer-introspector-x86_64/inspector/fuzzerLogFile-ucl_msgpack_fuzzer.data.yaml [Content-Type=application/octet-stream]...
Step #8: / [10/111 files][ 2.7 MiB/ 11.3 MiB] 24% Done
Copying file:///workspace/out/libfuzzer-introspector-x86_64/inspector/calltree_view_0.html [Content-Type=text/html]...
Step #8: / [10/111 files][ 2.7 MiB/ 11.3 MiB] 24% Done
Copying file:///workspace/out/libfuzzer-introspector-x86_64/inspector/all-fuzz-introspector-functions.json [Content-Type=application/json]...
Step #8: / [10/111 files][ 2.7 MiB/ 11.3 MiB] 24% Done
Copying file:///workspace/out/libfuzzer-introspector-x86_64/inspector/all_debug_info.json [Content-Type=application/json]...
Step #8: / [10/111 files][ 2.7 MiB/ 11.3 MiB] 24% Done
Copying file:///workspace/out/libfuzzer-introspector-x86_64/inspector/test-files.json [Content-Type=application/json]...
Step #8: / [10/111 files][ 2.7 MiB/ 11.3 MiB] 24% Done
/ [11/111 files][ 3.5 MiB/ 11.3 MiB] 30% Done
Copying file:///workspace/out/libfuzzer-introspector-x86_64/inspector/fuzzerLogFile-ucl_msgpack_fuzzer.data [Content-Type=application/octet-stream]...
Step #8: / [11/111 files][ 3.8 MiB/ 11.3 MiB] 34% Done
Copying file:///workspace/out/libfuzzer-introspector-x86_64/inspector/styles.css [Content-Type=text/css]...
Step #8: / [11/111 files][ 3.9 MiB/ 11.3 MiB] 34% Done
Copying file:///workspace/out/libfuzzer-introspector-x86_64/inspector/source-code/src/libucl/lua/lua_ucl.c [Content-Type=text/x-csrc]...
Step #8: / [11/111 files][ 3.9 MiB/ 11.3 MiB] 34% Done
-
Copying file:///workspace/out/libfuzzer-introspector-x86_64/inspector/source-code/src/libucl/uthash/utstring.h [Content-Type=text/x-chdr]...
Step #8: - [11/111 files][ 4.0 MiB/ 11.3 MiB] 35% Done
Copying file:///workspace/out/libfuzzer-introspector-x86_64/inspector/analysis_1.js [Content-Type=text/javascript]...
Step #8: - [11/111 files][ 4.0 MiB/ 11.3 MiB] 35% Done
Copying file:///workspace/out/libfuzzer-introspector-x86_64/inspector/source-code/src/libucl/uthash/uthash.h [Content-Type=text/x-chdr]...
Step #8: - [11/111 files][ 4.0 MiB/ 11.3 MiB] 35% Done
Copying file:///workspace/out/libfuzzer-introspector-x86_64/inspector/source-code/src/libucl/tests/test_basic.c [Content-Type=text/x-csrc]...
Step #8: - [11/111 files][ 4.0 MiB/ 11.3 MiB] 35% Done
Copying file:///workspace/out/libfuzzer-introspector-x86_64/inspector/source-code/src/libucl/uthash/utlist.h [Content-Type=text/x-chdr]...
Step #8: - [11/111 files][ 4.0 MiB/ 11.3 MiB] 35% Done
- [12/111 files][ 4.0 MiB/ 11.3 MiB] 35% Done
Copying file:///workspace/out/libfuzzer-introspector-x86_64/inspector/source-code/src/libucl/tests/test_speed.c [Content-Type=text/x-csrc]...
Step #8: - [12/111 files][ 4.0 MiB/ 11.3 MiB] 35% Done
Copying file:///workspace/out/libfuzzer-introspector-x86_64/inspector/source-code/src/libucl/tests/test_msgpack.c [Content-Type=text/x-csrc]...
Step #8: Copying file:///workspace/out/libfuzzer-introspector-x86_64/inspector/source-code/src/libucl/tests/test_streamline.c [Content-Type=text/x-csrc]...
Step #8: - [12/111 files][ 4.0 MiB/ 11.3 MiB] 35% Done
- [12/111 files][ 4.0 MiB/ 11.3 MiB] 35% Done
Copying file:///workspace/out/libfuzzer-introspector-x86_64/inspector/source-code/src/libucl/tests/test_schema.c [Content-Type=text/x-csrc]...
Step #8: - [12/111 files][ 4.0 MiB/ 11.3 MiB] 35% Done
Copying file:///workspace/out/libfuzzer-introspector-x86_64/inspector/source-code/src/libucl/tests/fuzzers/ucl_add_string_fuzzer.c [Content-Type=text/x-csrc]...
Step #8: - [12/111 files][ 4.0 MiB/ 11.3 MiB] 35% Done
Copying file:///workspace/out/libfuzzer-introspector-x86_64/inspector/source-code/src/libucl/tests/test_generate.c [Content-Type=text/x-csrc]...
Step #8: - [12/111 files][ 4.0 MiB/ 11.3 MiB] 35% Done
Copying file:///workspace/out/libfuzzer-introspector-x86_64/inspector/source-code/src/libucl/tests/fuzzers/ucl_msgpack_fuzzer.c [Content-Type=text/x-csrc]...
Step #8: - [12/111 files][ 4.0 MiB/ 11.3 MiB] 35% Done
Copying file:///workspace/out/libfuzzer-introspector-x86_64/inspector/source-code/src/libucl/src/ucl_util.c [Content-Type=text/x-csrc]...
Step #8: - [12/111 files][ 4.0 MiB/ 11.3 MiB] 35% Done
Copying file:///workspace/out/libfuzzer-introspector-x86_64/inspector/source-code/src/libucl/src/ucl_parser.c [Content-Type=text/x-csrc]...
Step #8: - [12/111 files][ 4.0 MiB/ 11.3 MiB] 35% Done
Copying file:///workspace/out/libfuzzer-introspector-x86_64/inspector/source-code/src/libucl/src/ucl_schema.c [Content-Type=text/x-csrc]...
Step #8: - [12/111 files][ 4.0 MiB/ 11.3 MiB] 35% Done
- [13/111 files][ 4.0 MiB/ 11.3 MiB] 35% Done
Copying file:///workspace/out/libfuzzer-introspector-x86_64/inspector/source-code/src/libucl/src/ucl_emitter.c [Content-Type=text/x-csrc]...
Step #8: - [13/111 files][ 4.0 MiB/ 11.3 MiB] 35% Done
Copying file:///workspace/out/libfuzzer-introspector-x86_64/inspector/source-code/src/libucl/src/ucl_msgpack.c [Content-Type=text/x-csrc]...
Step #8: - [13/111 files][ 4.0 MiB/ 11.3 MiB] 35% Done
Copying file:///workspace/out/libfuzzer-introspector-x86_64/inspector/source-code/src/libucl/src/ucl_hash.h [Content-Type=text/x-chdr]...
Step #8: - [13/111 files][ 4.0 MiB/ 11.3 MiB] 35% Done
- [14/111 files][ 4.0 MiB/ 11.3 MiB] 35% Done
- [15/111 files][ 4.0 MiB/ 11.3 MiB] 35% Done
- [16/111 files][ 5.0 MiB/ 11.3 MiB] 43% Done
- [17/111 files][ 5.5 MiB/ 11.3 MiB] 48% Done
- [18/111 files][ 6.7 MiB/ 11.3 MiB] 59% Done
- [19/111 files][ 6.7 MiB/ 11.3 MiB] 59% Done
Copying file:///workspace/out/libfuzzer-introspector-x86_64/inspector/source-code/src/libucl/src/ucl_emitter_utils.c [Content-Type=text/x-csrc]...
Step #8: - [19/111 files][ 6.7 MiB/ 11.3 MiB] 59% Done
Copying file:///workspace/out/libfuzzer-introspector-x86_64/inspector/source-code/src/libucl/src/ucl_emitter_streamline.c [Content-Type=text/x-csrc]...
Step #8: - [19/111 files][ 6.7 MiB/ 11.3 MiB] 59% Done
Copying file:///workspace/out/libfuzzer-introspector-x86_64/inspector/source-code/src/libucl/src/mum.h [Content-Type=text/x-chdr]...
Step #8: - [19/111 files][ 6.7 MiB/ 11.3 MiB] 59% Done
- [20/111 files][ 6.7 MiB/ 11.3 MiB] 59% Done
- [21/111 files][ 6.7 MiB/ 11.3 MiB] 59% Done
Copying file:///workspace/out/libfuzzer-introspector-x86_64/inspector/source-code/src/libucl/src/ucl_hash.c [Content-Type=text/x-csrc]...
Step #8: Copying file:///workspace/out/libfuzzer-introspector-x86_64/inspector/source-code/src/libucl/src/ucl_internal.h [Content-Type=text/x-chdr]...
Step #8: - [21/111 files][ 6.7 MiB/ 11.3 MiB] 59% Done
- [21/111 files][ 6.7 MiB/ 11.3 MiB] 59% Done
Copying file:///workspace/out/libfuzzer-introspector-x86_64/inspector/source-code/src/libucl/src/tree.h [Content-Type=text/x-chdr]...
Step #8: - [21/111 files][ 6.7 MiB/ 11.3 MiB] 59% Done
Copying file:///workspace/out/libfuzzer-introspector-x86_64/inspector/source-code/src/libucl/src/ucl_chartable.h [Content-Type=text/x-chdr]...
Step #8: - [21/111 files][ 6.7 MiB/ 11.3 MiB] 59% Done
- [22/111 files][ 6.7 MiB/ 11.3 MiB] 59% Done
Copying file:///workspace/out/libfuzzer-introspector-x86_64/inspector/source-code/src/libucl/src/ucl_sexp.c [Content-Type=text/x-csrc]...
Step #8: - [22/111 files][ 6.7 MiB/ 11.3 MiB] 59% Done
Copying file:///workspace/out/libfuzzer-introspector-x86_64/inspector/source-code/src/libucl/include/ucl.h [Content-Type=text/x-chdr]...
Step #8: Copying file:///workspace/out/libfuzzer-introspector-x86_64/inspector/source-code/src/libucl/python/src/uclmodule.c [Content-Type=text/x-csrc]...
Step #8: - [22/111 files][ 6.7 MiB/ 11.3 MiB] 59% Done
- [22/111 files][ 6.7 MiB/ 11.3 MiB] 59% Done
- [23/111 files][ 6.7 MiB/ 11.3 MiB] 59% Done
Copying file:///workspace/out/libfuzzer-introspector-x86_64/inspector/source-code/src/libucl/include/lua_ucl.h [Content-Type=text/x-chdr]...
Step #8: - [23/111 files][ 6.7 MiB/ 11.3 MiB] 59% Done
Copying file:///workspace/out/libfuzzer-introspector-x86_64/inspector/source-code/src/libucl/include/ucl++.h [Content-Type=text/x-chdr]...
Step #8: - [23/111 files][ 6.7 MiB/ 11.3 MiB] 59% Done
Copying file:///workspace/out/libfuzzer-introspector-x86_64/inspector/source-code/src/libucl/klib/khash.h [Content-Type=text/x-chdr]...
Step #8: - [23/111 files][ 6.7 MiB/ 11.3 MiB] 59% Done
- [24/111 files][ 6.7 MiB/ 11.3 MiB] 59% Done
Copying file:///workspace/out/libfuzzer-introspector-x86_64/inspector/source-code/src/libucl/klib/kvec.h [Content-Type=text/x-chdr]...
Step #8: - [24/111 files][ 6.7 MiB/ 11.3 MiB] 59% Done
- [25/111 files][ 6.7 MiB/ 11.3 MiB] 59% Done
Copying file:///workspace/out/libfuzzer-introspector-x86_64/inspector/source-code/src/libucl/examples/ucl_cpp.cc [Content-Type=text/x-c++src]...
Step #8: Copying file:///workspace/out/libfuzzer-introspector-x86_64/inspector/source-code/src/libucl/utils/objdump.c [Content-Type=text/x-csrc]...
Step #8: - [25/111 files][ 6.7 MiB/ 11.3 MiB] 59% Done
- [25/111 files][ 6.7 MiB/ 11.3 MiB] 59% Done
Copying file:///workspace/out/libfuzzer-introspector-x86_64/inspector/source-code/src/libucl/utils/chargen.c [Content-Type=text/x-csrc]...
Step #8: - [25/111 files][ 6.7 MiB/ 11.3 MiB] 59% Done
- [26/111 files][ 6.7 MiB/ 11.3 MiB] 59% Done
Copying file:///workspace/out/libfuzzer-introspector-x86_64/inspector/light/source_files/src/libucl/uthash/utstring.h [Content-Type=text/x-chdr]...
Step #8: - [26/111 files][ 6.7 MiB/ 11.3 MiB] 59% Done
Copying file:///workspace/out/libfuzzer-introspector-x86_64/inspector/light/all_tests.json [Content-Type=application/json]...
Step #8: - [26/111 files][ 6.7 MiB/ 11.3 MiB] 59% Done
Copying file:///workspace/out/libfuzzer-introspector-x86_64/inspector/source-code/src/libucl/utils/ucl-tool.c [Content-Type=text/x-csrc]...
Step #8: - [26/111 files][ 6.7 MiB/ 11.3 MiB] 59% Done
Copying file:///workspace/out/libfuzzer-introspector-x86_64/inspector/light/source_files/src/libucl/uthash/uthash.h [Content-Type=text/x-chdr]...
Step #8: - [26/111 files][ 6.7 MiB/ 11.3 MiB] 59% Done
Copying file:///workspace/out/libfuzzer-introspector-x86_64/inspector/light/all_files.json [Content-Type=application/json]...
Step #8: Copying file:///workspace/out/libfuzzer-introspector-x86_64/inspector/light/source_files/src/libucl/uthash/utlist.h [Content-Type=text/x-chdr]...
Step #8: - [26/111 files][ 6.7 MiB/ 11.3 MiB] 59% Done
- [26/111 files][ 6.7 MiB/ 11.3 MiB] 59% Done
Copying file:///workspace/out/libfuzzer-introspector-x86_64/inspector/light/all_pairs.json [Content-Type=application/json]...
Step #8: - [26/111 files][ 6.7 MiB/ 11.3 MiB] 59% Done
Copying file:///workspace/out/libfuzzer-introspector-x86_64/inspector/light/source_files/src/libucl/tests/test_streamline.c [Content-Type=text/x-csrc]...
Step #8: - [26/111 files][ 6.7 MiB/ 11.3 MiB] 59% Done
Copying file:///workspace/out/libfuzzer-introspector-x86_64/inspector/light/source_files/src/libucl/tests/test_basic.c [Content-Type=text/x-csrc]...
Step #8: - [26/111 files][ 6.7 MiB/ 11.3 MiB] 59% Done
Copying file:///workspace/out/libfuzzer-introspector-x86_64/inspector/light/source_files/src/libucl/tests/test_speed.c [Content-Type=text/x-csrc]...
Step #8: - [26/111 files][ 6.7 MiB/ 11.3 MiB] 59% Done
Copying file:///workspace/out/libfuzzer-introspector-x86_64/inspector/light/source_files/src/libucl/tests/test_msgpack.c [Content-Type=text/x-csrc]...
Step #8: - [26/111 files][ 6.8 MiB/ 11.3 MiB] 59% Done
Copying file:///workspace/out/libfuzzer-introspector-x86_64/inspector/light/source_files/src/libucl/tests/test_generate.c [Content-Type=text/x-csrc]...
Step #8: Copying file:///workspace/out/libfuzzer-introspector-x86_64/inspector/light/source_files/src/libucl/tests/test_schema.c [Content-Type=text/x-csrc]...
Step #8: - [26/111 files][ 6.8 MiB/ 11.3 MiB] 59% Done
- [26/111 files][ 6.8 MiB/ 11.3 MiB] 59% Done
Copying file:///workspace/out/libfuzzer-introspector-x86_64/inspector/light/source_files/src/libucl/tests/fuzzers/ucl_add_string_fuzzer.c [Content-Type=text/x-csrc]...
Step #8: Copying file:///workspace/out/libfuzzer-introspector-x86_64/inspector/light/source_files/src/libucl/tests/fuzzers/ucl_msgpack_fuzzer.c [Content-Type=text/x-csrc]...
Step #8: - [26/111 files][ 6.8 MiB/ 11.3 MiB] 59% Done
- [26/111 files][ 6.8 MiB/ 11.3 MiB] 59% Done
Copying file:///workspace/out/libfuzzer-introspector-x86_64/inspector/light/source_files/src/libucl/src/ucl_util.c [Content-Type=text/x-csrc]...
Step #8: - [26/111 files][ 6.8 MiB/ 11.3 MiB] 59% Done
Copying file:///workspace/out/libfuzzer-introspector-x86_64/inspector/light/source_files/src/libucl/src/ucl_msgpack.c [Content-Type=text/x-csrc]...
Step #8: - [26/111 files][ 6.8 MiB/ 11.3 MiB] 59% Done
Copying file:///workspace/out/libfuzzer-introspector-x86_64/inspector/light/source_files/src/libucl/src/ucl_parser.c [Content-Type=text/x-csrc]...
Step #8: - [26/111 files][ 6.8 MiB/ 11.3 MiB] 59% Done
Copying file:///workspace/out/libfuzzer-introspector-x86_64/inspector/light/source_files/src/libucl/src/ucl_schema.c [Content-Type=text/x-csrc]...
Step #8: - [26/111 files][ 6.8 MiB/ 11.3 MiB] 59% Done
Copying file:///workspace/out/libfuzzer-introspector-x86_64/inspector/light/source_files/src/libucl/src/ucl_emitter.c [Content-Type=text/x-csrc]...
Step #8: Copying file:///workspace/out/libfuzzer-introspector-x86_64/inspector/light/source_files/src/libucl/src/ucl_hash.h [Content-Type=text/x-chdr]...
Step #8: - [26/111 files][ 6.8 MiB/ 11.3 MiB] 59% Done
- [26/111 files][ 6.8 MiB/ 11.3 MiB] 59% Done
Copying file:///workspace/out/libfuzzer-introspector-x86_64/inspector/light/source_files/src/libucl/src/ucl_emitter_utils.c [Content-Type=text/x-csrc]...
Step #8: - [26/111 files][ 6.8 MiB/ 11.3 MiB] 59% Done
Copying file:///workspace/out/libfuzzer-introspector-x86_64/inspector/light/source_files/src/libucl/src/ucl_emitter_streamline.c [Content-Type=text/x-csrc]...
Step #8: - [26/111 files][ 6.8 MiB/ 11.3 MiB] 59% Done
Copying file:///workspace/out/libfuzzer-introspector-x86_64/inspector/light/source_files/src/libucl/src/mum.h [Content-Type=text/x-chdr]...
Step #8: - [26/111 files][ 6.8 MiB/ 11.3 MiB] 59% Done
Copying file:///workspace/out/libfuzzer-introspector-x86_64/inspector/light/source_files/src/libucl/src/ucl_hash.c [Content-Type=text/x-csrc]...
Step #8: - [26/111 files][ 6.8 MiB/ 11.3 MiB] 59% Done
- [27/111 files][ 6.8 MiB/ 11.3 MiB] 60% Done
Copying file:///workspace/out/libfuzzer-introspector-x86_64/inspector/light/source_files/src/libucl/src/ucl_internal.h [Content-Type=text/x-chdr]...
Step #8: - [27/111 files][ 6.8 MiB/ 11.3 MiB] 60% Done
Copying file:///workspace/out/libfuzzer-introspector-x86_64/inspector/light/source_files/src/libucl/src/tree.h [Content-Type=text/x-chdr]...
Step #8: - [27/111 files][ 6.8 MiB/ 11.3 MiB] 60% Done
Copying file:///workspace/out/libfuzzer-introspector-x86_64/inspector/light/source_files/src/libucl/python/src/uclmodule.c [Content-Type=text/x-csrc]...
Step #8: - [27/111 files][ 6.8 MiB/ 11.3 MiB] 60% Done
Copying file:///workspace/out/libfuzzer-introspector-x86_64/inspector/light/source_files/src/libucl/include/ucl++.h [Content-Type=text/x-chdr]...
Step #8: Copying file:///workspace/out/libfuzzer-introspector-x86_64/inspector/light/source_files/src/libucl/include/ucl.h [Content-Type=text/x-chdr]...
Step #8: - [27/111 files][ 6.8 MiB/ 11.3 MiB] 60% Done
- [27/111 files][ 6.8 MiB/ 11.3 MiB] 60% Done
Copying file:///workspace/out/libfuzzer-introspector-x86_64/inspector/light/source_files/src/libucl/include/lua_ucl.h [Content-Type=text/x-chdr]...
Step #8: - [27/111 files][ 6.8 MiB/ 11.3 MiB] 60% Done
Copying file:///workspace/out/libfuzzer-introspector-x86_64/inspector/second-frontend-run/fuzzerLogFile-ucl_add_string_fuzzer.data.yaml [Content-Type=application/octet-stream]...
Step #8: - [27/111 files][ 6.8 MiB/ 11.3 MiB] 60% Done
Copying file:///workspace/out/libfuzzer-introspector-x86_64/inspector/second-frontend-run/fuzzerLogFile-ucl_add_string_fuzzer.data [Content-Type=application/octet-stream]...
Step #8: - [27/111 files][ 6.8 MiB/ 11.3 MiB] 60% Done
Copying file:///workspace/out/libfuzzer-introspector-x86_64/inspector/second-frontend-run/fuzzerLogFile-ucl_msgpack_fuzzer.data.yaml [Content-Type=application/octet-stream]...
Step #8: Copying file:///workspace/out/libfuzzer-introspector-x86_64/inspector/second-frontend-run/fuzzerLogFile-ucl_msgpack_fuzzer.data [Content-Type=application/octet-stream]...
Step #8: Copying file:///workspace/out/libfuzzer-introspector-x86_64/inspector/light/source_files/src/libucl/src/ucl_chartable.h [Content-Type=text/x-chdr]...
Step #8: - [27/111 files][ 6.8 MiB/ 11.3 MiB] 60% Done
- [27/111 files][ 6.8 MiB/ 11.3 MiB] 60% Done
Copying file:///workspace/out/libfuzzer-introspector-x86_64/inspector/light/source_files/src/libucl/src/ucl_sexp.c [Content-Type=text/x-csrc]...
Step #8: Copying file:///workspace/out/libfuzzer-introspector-x86_64/inspector/light/source_files/src/libucl/lua/lua_ucl.c [Content-Type=text/x-csrc]...
Step #8: - [27/111 files][ 6.8 MiB/ 11.3 MiB] 60% Done
Copying file:///workspace/out/libfuzzer-introspector-x86_64/inspector/second-frontend-run/full_type_defs.json [Content-Type=application/json]...
Step #8: Copying file:///workspace/out/libfuzzer-introspector-x86_64/inspector/second-frontend-run/macro_block_info.json [Content-Type=application/json]...
Step #8: - [27/111 files][ 6.8 MiB/ 11.3 MiB] 60% Done
- [27/111 files][ 6.8 MiB/ 11.3 MiB] 60% Done
- [27/111 files][ 6.8 MiB/ 11.3 MiB] 60% Done
- [27/111 files][ 6.8 MiB/ 11.3 MiB] 60% Done
Copying file:///workspace/out/libfuzzer-introspector-x86_64/inspector/light/source_files/src/libucl/klib/khash.h [Content-Type=text/x-chdr]...
Step #8: - [27/111 files][ 6.8 MiB/ 11.3 MiB] 60% Done
Copying file:///workspace/out/libfuzzer-introspector-x86_64/inspector/light/source_files/src/libucl/klib/kvec.h [Content-Type=text/x-chdr]...
Step #8: - [28/111 files][ 6.8 MiB/ 11.3 MiB] 60% Done
- [28/111 files][ 6.8 MiB/ 11.3 MiB] 60% Done
- [29/111 files][ 6.8 MiB/ 11.3 MiB] 60% Done
- [30/111 files][ 6.8 MiB/ 11.3 MiB] 60% Done
Copying file:///workspace/out/libfuzzer-introspector-x86_64/inspector/light/source_files/src/libucl/utils/ucl-tool.c [Content-Type=text/x-csrc]...
Step #8: Copying file:///workspace/out/libfuzzer-introspector-x86_64/inspector/light/source_files/src/libucl/utils/objdump.c [Content-Type=text/x-csrc]...
Step #8: Copying file:///workspace/out/libfuzzer-introspector-x86_64/inspector/light/source_files/src/libucl/examples/ucl_cpp.cc [Content-Type=text/x-c++src]...
Step #8: - [30/111 files][ 6.8 MiB/ 11.3 MiB] 60% Done
- [31/111 files][ 6.8 MiB/ 11.3 MiB] 60% Done
- [31/111 files][ 6.8 MiB/ 11.3 MiB] 60% Done
- [31/111 files][ 6.8 MiB/ 11.3 MiB] 60% Done
Copying file:///workspace/out/libfuzzer-introspector-x86_64/inspector/light/source_files/src/libucl/utils/chargen.c [Content-Type=text/x-csrc]...
Step #8: - [32/111 files][ 6.8 MiB/ 11.3 MiB] 60% Done
- [32/111 files][ 6.8 MiB/ 11.3 MiB] 60% Done
- [33/111 files][ 6.9 MiB/ 11.3 MiB] 60% Done
- [34/111 files][ 6.9 MiB/ 11.3 MiB] 61% Done
- [35/111 files][ 6.9 MiB/ 11.3 MiB] 61% Done
- [36/111 files][ 6.9 MiB/ 11.3 MiB] 61% Done
- [37/111 files][ 6.9 MiB/ 11.3 MiB] 61% Done
- [38/111 files][ 7.1 MiB/ 11.3 MiB] 62% Done
- [39/111 files][ 7.1 MiB/ 11.3 MiB] 62% Done
- [40/111 files][ 7.1 MiB/ 11.3 MiB] 63% Done
- [41/111 files][ 7.1 MiB/ 11.3 MiB] 63% Done
- [42/111 files][ 7.1 MiB/ 11.3 MiB] 63% Done
- [43/111 files][ 7.2 MiB/ 11.3 MiB] 63% Done
- [44/111 files][ 7.2 MiB/ 11.3 MiB] 63% Done
- [45/111 files][ 7.2 MiB/ 11.3 MiB] 63% Done
- [46/111 files][ 7.2 MiB/ 11.3 MiB] 63% Done
- [47/111 files][ 7.2 MiB/ 11.3 MiB] 63% Done
- [48/111 files][ 7.2 MiB/ 11.3 MiB] 63% Done
- [49/111 files][ 7.2 MiB/ 11.3 MiB] 63% Done
- [50/111 files][ 7.2 MiB/ 11.3 MiB] 63% Done
- [51/111 files][ 8.4 MiB/ 11.3 MiB] 73% Done
- [52/111 files][ 8.4 MiB/ 11.3 MiB] 73% Done
- [53/111 files][ 8.4 MiB/ 11.3 MiB] 74% Done
- [54/111 files][ 8.4 MiB/ 11.3 MiB] 74% Done
\
\ [55/111 files][ 8.4 MiB/ 11.3 MiB] 74% Done
\ [56/111 files][ 8.4 MiB/ 11.3 MiB] 74% Done
\ [57/111 files][ 8.4 MiB/ 11.3 MiB] 74% Done
\ [58/111 files][ 8.4 MiB/ 11.3 MiB] 74% Done
\ [59/111 files][ 8.4 MiB/ 11.3 MiB] 74% Done
\ [60/111 files][ 8.4 MiB/ 11.3 MiB] 74% Done
\ [61/111 files][ 8.4 MiB/ 11.3 MiB] 74% Done
\ [62/111 files][ 8.4 MiB/ 11.3 MiB] 74% Done
\ [63/111 files][ 8.5 MiB/ 11.3 MiB] 75% Done
\ [64/111 files][ 8.5 MiB/ 11.3 MiB] 75% Done
\ [65/111 files][ 8.5 MiB/ 11.3 MiB] 75% Done
\ [66/111 files][ 8.5 MiB/ 11.3 MiB] 75% Done
\ [67/111 files][ 8.5 MiB/ 11.3 MiB] 75% Done
\ [68/111 files][ 8.5 MiB/ 11.3 MiB] 75% Done
\ [69/111 files][ 8.5 MiB/ 11.3 MiB] 75% Done
\ [70/111 files][ 8.5 MiB/ 11.3 MiB] 75% Done
\ [71/111 files][ 8.5 MiB/ 11.3 MiB] 75% Done
\ [72/111 files][ 8.5 MiB/ 11.3 MiB] 75% Done
\ [73/111 files][ 8.5 MiB/ 11.3 MiB] 75% Done
\ [74/111 files][ 8.5 MiB/ 11.3 MiB] 75% Done
\ [75/111 files][ 9.5 MiB/ 11.3 MiB] 83% Done
\ [76/111 files][ 10.6 MiB/ 11.3 MiB] 93% Done
\ [77/111 files][ 10.6 MiB/ 11.3 MiB] 93% Done
\ [78/111 files][ 10.6 MiB/ 11.3 MiB] 93% Done
\ [79/111 files][ 10.6 MiB/ 11.3 MiB] 93% Done
\ [80/111 files][ 10.6 MiB/ 11.3 MiB] 93% Done
\ [81/111 files][ 10.7 MiB/ 11.3 MiB] 94% Done
\ [82/111 files][ 10.7 MiB/ 11.3 MiB] 94% Done
\ [83/111 files][ 10.8 MiB/ 11.3 MiB] 95% Done
\ [84/111 files][ 10.8 MiB/ 11.3 MiB] 95% Done
\ [85/111 files][ 10.8 MiB/ 11.3 MiB] 95% Done
\ [86/111 files][ 10.8 MiB/ 11.3 MiB] 95% Done
\ [87/111 files][ 10.9 MiB/ 11.3 MiB] 96% Done
\ [88/111 files][ 10.9 MiB/ 11.3 MiB] 96% Done
\ [89/111 files][ 10.9 MiB/ 11.3 MiB] 96% Done
\ [90/111 files][ 10.9 MiB/ 11.3 MiB] 96% Done
\ [91/111 files][ 10.9 MiB/ 11.3 MiB] 96% Done
\ [92/111 files][ 11.1 MiB/ 11.3 MiB] 97% Done
\ [93/111 files][ 11.2 MiB/ 11.3 MiB] 99% Done
\ [94/111 files][ 11.2 MiB/ 11.3 MiB] 99% Done
\ [95/111 files][ 11.2 MiB/ 11.3 MiB] 99% Done
\ [96/111 files][ 11.3 MiB/ 11.3 MiB] 99% Done
|
| [97/111 files][ 11.3 MiB/ 11.3 MiB] 99% Done
| [98/111 files][ 11.3 MiB/ 11.3 MiB] 99% Done
| [99/111 files][ 11.3 MiB/ 11.3 MiB] 99% Done
| [100/111 files][ 11.3 MiB/ 11.3 MiB] 99% Done
| [101/111 files][ 11.3 MiB/ 11.3 MiB] 99% Done
| [102/111 files][ 11.3 MiB/ 11.3 MiB] 99% Done
| [103/111 files][ 11.3 MiB/ 11.3 MiB] 99% Done
| [104/111 files][ 11.3 MiB/ 11.3 MiB] 99% Done
| [105/111 files][ 11.3 MiB/ 11.3 MiB] 99% Done
| [106/111 files][ 11.3 MiB/ 11.3 MiB] 99% Done
| [107/111 files][ 11.3 MiB/ 11.3 MiB] 99% Done
| [108/111 files][ 11.3 MiB/ 11.3 MiB] 99% Done
| [109/111 files][ 11.3 MiB/ 11.3 MiB] 99% Done
| [110/111 files][ 11.3 MiB/ 11.3 MiB] 99% Done
| [111/111 files][ 11.3 MiB/ 11.3 MiB] 100% Done
Step #8: Operation completed over 111 objects/11.3 MiB.
Finished Step #8
PUSH
DONE