starting build "7fdabebb-0a99-4bc5-8f0c-d108fdef4051"
FETCHSOURCE
BUILD
Starting Step #0
Step #0: Pulling image: gcr.io/oss-fuzz-base/base-runner
Step #0: Using default tag: latest
Step #0: latest: Pulling from oss-fuzz-base/base-runner
Step #0: b549f31133a9: Pulling fs layer
Step #0: 8e4f56ad9174: Pulling fs layer
Step #0: f9cdc5190608: Pulling fs layer
Step #0: 2fceddf9cfd4: Pulling fs layer
Step #0: 1dcdb89bc75d: Pulling fs layer
Step #0: 55821d3c0663: Pulling fs layer
Step #0: 6ca3d148749f: Pulling fs layer
Step #0: 19dcd3e6dd94: Pulling fs layer
Step #0: f2f03964d8f6: Pulling fs layer
Step #0: 16f444d0f5cc: Pulling fs layer
Step #0: c52e19fcbdf5: Pulling fs layer
Step #0: f72caa1ba154: Pulling fs layer
Step #0: 372725c70cc1: Pulling fs layer
Step #0: 5e1b73eb2c11: Pulling fs layer
Step #0: a00fea6fdbb3: Pulling fs layer
Step #0: 7bb60eccae26: Pulling fs layer
Step #0: 542c318fcf89: Pulling fs layer
Step #0: 5aaacb96d69f: Pulling fs layer
Step #0: 67a650178d0f: Pulling fs layer
Step #0: 4ba4a53a3955: Pulling fs layer
Step #0: 8ee5bd49e652: Pulling fs layer
Step #0: f9d7bedba746: Pulling fs layer
Step #0: e525ad135758: Pulling fs layer
Step #0: eee0cffd0a64: Pulling fs layer
Step #0: 10897ebdedb2: Pulling fs layer
Step #0: 720b5c28af27: Pulling fs layer
Step #0: d78aca990b11: Pulling fs layer
Step #0: f2f03964d8f6: Waiting
Step #0: 930e9f2a5b61: Pulling fs layer
Step #0: 5e1b73eb2c11: Waiting
Step #0: a00fea6fdbb3: Waiting
Step #0: 7bb60eccae26: Waiting
Step #0: 542c318fcf89: Waiting
Step #0: 16f444d0f5cc: Waiting
Step #0: 5aaacb96d69f: Waiting
Step #0: 67a650178d0f: Waiting
Step #0: c52e19fcbdf5: Waiting
Step #0: 4ba4a53a3955: Waiting
Step #0: 8ee5bd49e652: Waiting
Step #0: f72caa1ba154: Waiting
Step #0: 372725c70cc1: Waiting
Step #0: 720b5c28af27: Waiting
Step #0: d78aca990b11: Waiting
Step #0: f9d7bedba746: Waiting
Step #0: e525ad135758: Waiting
Step #0: 10897ebdedb2: Waiting
Step #0: 930e9f2a5b61: Waiting
Step #0: 6ca3d148749f: Waiting
Step #0: eee0cffd0a64: Waiting
Step #0: 19dcd3e6dd94: Waiting
Step #0: 55821d3c0663: Download complete
Step #0: f9cdc5190608: Verifying Checksum
Step #0: f9cdc5190608: Download complete
Step #0: 2fceddf9cfd4: Verifying Checksum
Step #0: 2fceddf9cfd4: Download complete
Step #0: 1dcdb89bc75d: Verifying Checksum
Step #0: 1dcdb89bc75d: Download complete
Step #0: 19dcd3e6dd94: Verifying Checksum
Step #0: 19dcd3e6dd94: Download complete
Step #0: b549f31133a9: Verifying Checksum
Step #0: b549f31133a9: Download complete
Step #0: 6ca3d148749f: Verifying Checksum
Step #0: 6ca3d148749f: Download complete
Step #0: 16f444d0f5cc: Download complete
Step #0: c52e19fcbdf5: Verifying Checksum
Step #0: c52e19fcbdf5: Download complete
Step #0: f72caa1ba154: Verifying Checksum
Step #0: f72caa1ba154: Download complete
Step #0: 5e1b73eb2c11: Verifying Checksum
Step #0: 5e1b73eb2c11: Download complete
Step #0: a00fea6fdbb3: Verifying Checksum
Step #0: a00fea6fdbb3: Download complete
Step #0: 7bb60eccae26: Verifying Checksum
Step #0: 7bb60eccae26: Download complete
Step #0: 5aaacb96d69f: Download complete
Step #0: f2f03964d8f6: Verifying Checksum
Step #0: f2f03964d8f6: Download complete
Step #0: 8e4f56ad9174: Verifying Checksum
Step #0: 8e4f56ad9174: Download complete
Step #0: 4ba4a53a3955: Verifying Checksum
Step #0: 4ba4a53a3955: Download complete
Step #0: 8ee5bd49e652: Download complete
Step #0: 372725c70cc1: Verifying Checksum
Step #0: 372725c70cc1: Download complete
Step #0: eee0cffd0a64: Verifying Checksum
Step #0: eee0cffd0a64: Download complete
Step #0: e525ad135758: Verifying Checksum
Step #0: e525ad135758: Download complete
Step #0: 10897ebdedb2: Verifying Checksum
Step #0: 10897ebdedb2: Download complete
Step #0: 720b5c28af27: Verifying Checksum
Step #0: 720b5c28af27: Download complete
Step #0: b549f31133a9: Pull complete
Step #0: 930e9f2a5b61: Verifying Checksum
Step #0: 930e9f2a5b61: Download complete
Step #0: 542c318fcf89: Verifying Checksum
Step #0: 542c318fcf89: Download complete
Step #0: d78aca990b11: Verifying Checksum
Step #0: d78aca990b11: Download complete
Step #0: f9d7bedba746: Verifying Checksum
Step #0: f9d7bedba746: Download complete
Step #0: 67a650178d0f: Verifying Checksum
Step #0: 67a650178d0f: Download complete
Step #0: 8e4f56ad9174: Pull complete
Step #0: f9cdc5190608: Pull complete
Step #0: 2fceddf9cfd4: Pull complete
Step #0: 1dcdb89bc75d: Pull complete
Step #0: 55821d3c0663: Pull complete
Step #0: 6ca3d148749f: Pull complete
Step #0: 19dcd3e6dd94: Pull complete
Step #0: f2f03964d8f6: Pull complete
Step #0: 16f444d0f5cc: Pull complete
Step #0: c52e19fcbdf5: Pull complete
Step #0: f72caa1ba154: Pull complete
Step #0: 372725c70cc1: Pull complete
Step #0: 5e1b73eb2c11: Pull complete
Step #0: a00fea6fdbb3: Pull complete
Step #0: 7bb60eccae26: Pull complete
Step #0: 542c318fcf89: Pull complete
Step #0: 5aaacb96d69f: Pull complete
Step #0: 67a650178d0f: Pull complete
Step #0: 4ba4a53a3955: Pull complete
Step #0: 8ee5bd49e652: Pull complete
Step #0: f9d7bedba746: Pull complete
Step #0: e525ad135758: Pull complete
Step #0: eee0cffd0a64: Pull complete
Step #0: 10897ebdedb2: Pull complete
Step #0: 720b5c28af27: Pull complete
Step #0: d78aca990b11: Pull complete
Step #0: 930e9f2a5b61: Pull complete
Step #0: Digest: sha256:c279e16a167d20fcac6d2309cb8661bfbd504cd56e6d59928f7499695187e5cb
Step #0: Status: Downloaded newer image for gcr.io/oss-fuzz-base/base-runner:latest
Step #0: gcr.io/oss-fuzz-base/base-runner:latest
Finished Step #0
Starting Step #1
Step #1: Pulling image: gcr.io/cloud-builders/gsutil
Step #1: Using default tag: latest
Step #1: latest: Pulling from cloud-builders/gsutil
Step #1: 97e1ee089ace: Already exists
Step #1: b8613ef18de2: Already exists
Step #1: 370a343ae1d7: Already exists
Step #1: 1434b9de6cf8: Already exists
Step #1: 27737137e53a: Already exists
Step #1: 3506d965e444: Already exists
Step #1: ffc63f734b4c: Pulling fs layer
Step #1: dbd1d9fea16e: Pulling fs layer
Step #1: dbd1d9fea16e: Download complete
Step #1: ffc63f734b4c: Verifying Checksum
Step #1: ffc63f734b4c: Download complete
Step #1: ffc63f734b4c: Pull complete
Step #1: dbd1d9fea16e: Pull complete
Step #1: Digest: sha256:1baf1c64142e584b6b6b1e67596d02547a5e1ba74947d9f2e23ecda81ce22bc9
Step #1: Status: Downloaded newer image for gcr.io/cloud-builders/gsutil:latest
Step #1: gcr.io/cloud-builders/gsutil:latest
Step #1: CommandException: No URLs matched: gs://oss-fuzz-coverage/snappy/textcov_reports/20260705/*
Step #1: CommandException: 1 file/object could not be transferred.
Finished Step #1
ERROR: step exited with non-zero status: 1
Starting Step #2
Step #2: Already have image (with digest): gcr.io/oss-fuzz-base/base-runner
Step #2: total 0
Finished Step #2
Starting Step #3
Step #3: Already have image (with digest): gcr.io/cloud-builders/git
Step #3: Cloning into 'oss-fuzz'...
Finished Step #3
Starting Step #4 - "build-3cfb5997-4c45-4540-8c44-714e584f5cff"
Step #4 - "build-3cfb5997-4c45-4540-8c44-714e584f5cff": Already have image (with digest): gcr.io/cloud-builders/docker
Step #4 - "build-3cfb5997-4c45-4540-8c44-714e584f5cff": Sending build context to Docker daemon 7.168kB
Step #4 - "build-3cfb5997-4c45-4540-8c44-714e584f5cff": Step 1/6 : FROM gcr.io/oss-fuzz-base/base-builder
Step #4 - "build-3cfb5997-4c45-4540-8c44-714e584f5cff": latest: Pulling from oss-fuzz-base/base-builder
Step #4 - "build-3cfb5997-4c45-4540-8c44-714e584f5cff": b549f31133a9: Already exists
Step #4 - "build-3cfb5997-4c45-4540-8c44-714e584f5cff": 8e4f56ad9174: Already exists
Step #4 - "build-3cfb5997-4c45-4540-8c44-714e584f5cff": f9cdc5190608: Already exists
Step #4 - "build-3cfb5997-4c45-4540-8c44-714e584f5cff": f2207db74b28: Pulling fs layer
Step #4 - "build-3cfb5997-4c45-4540-8c44-714e584f5cff": b65d9913daec: Pulling fs layer
Step #4 - "build-3cfb5997-4c45-4540-8c44-714e584f5cff": 0cef7815d3a4: Pulling fs layer
Step #4 - "build-3cfb5997-4c45-4540-8c44-714e584f5cff": 011e0b977b5a: Pulling fs layer
Step #4 - "build-3cfb5997-4c45-4540-8c44-714e584f5cff": a82df7073ed6: Pulling fs layer
Step #4 - "build-3cfb5997-4c45-4540-8c44-714e584f5cff": 853cb046333e: Pulling fs layer
Step #4 - "build-3cfb5997-4c45-4540-8c44-714e584f5cff": 8fa9ec6dff64: Pulling fs layer
Step #4 - "build-3cfb5997-4c45-4540-8c44-714e584f5cff": 034c24237b63: Pulling fs layer
Step #4 - "build-3cfb5997-4c45-4540-8c44-714e584f5cff": 2cd55043f631: Pulling fs layer
Step #4 - "build-3cfb5997-4c45-4540-8c44-714e584f5cff": b53893e76fa8: Pulling fs layer
Step #4 - "build-3cfb5997-4c45-4540-8c44-714e584f5cff": 42753a408f16: Pulling fs layer
Step #4 - "build-3cfb5997-4c45-4540-8c44-714e584f5cff": 9966a8e430ab: Pulling fs layer
Step #4 - "build-3cfb5997-4c45-4540-8c44-714e584f5cff": d918e7183237: Pulling fs layer
Step #4 - "build-3cfb5997-4c45-4540-8c44-714e584f5cff": 5ba4d68d2685: Pulling fs layer
Step #4 - "build-3cfb5997-4c45-4540-8c44-714e584f5cff": 84fe4353f0ee: Pulling fs layer
Step #4 - "build-3cfb5997-4c45-4540-8c44-714e584f5cff": 236cde5149e4: Pulling fs layer
Step #4 - "build-3cfb5997-4c45-4540-8c44-714e584f5cff": 7c638feb2297: Pulling fs layer
Step #4 - "build-3cfb5997-4c45-4540-8c44-714e584f5cff": 08e5a461591d: Pulling fs layer
Step #4 - "build-3cfb5997-4c45-4540-8c44-714e584f5cff": 4e2f9fe20088: Pulling fs layer
Step #4 - "build-3cfb5997-4c45-4540-8c44-714e584f5cff": 943d94782c71: Pulling fs layer
Step #4 - "build-3cfb5997-4c45-4540-8c44-714e584f5cff": 8d8d9af13c18: Pulling fs layer
Step #4 - "build-3cfb5997-4c45-4540-8c44-714e584f5cff": 19891f4bd05e: Pulling fs layer
Step #4 - "build-3cfb5997-4c45-4540-8c44-714e584f5cff": 32cf2b27eed5: Pulling fs layer
Step #4 - "build-3cfb5997-4c45-4540-8c44-714e584f5cff": e08405c74b26: Pulling fs layer
Step #4 - "build-3cfb5997-4c45-4540-8c44-714e584f5cff": 60b387e23174: Pulling fs layer
Step #4 - "build-3cfb5997-4c45-4540-8c44-714e584f5cff": 08ae372c830e: Pulling fs layer
Step #4 - "build-3cfb5997-4c45-4540-8c44-714e584f5cff": 6e33b56de424: Pulling fs layer
Step #4 - "build-3cfb5997-4c45-4540-8c44-714e584f5cff": b5495aef6353: Pulling fs layer
Step #4 - "build-3cfb5997-4c45-4540-8c44-714e584f5cff": a946925e8898: Pulling fs layer
Step #4 - "build-3cfb5997-4c45-4540-8c44-714e584f5cff": 1d5d8a326c1c: Pulling fs layer
Step #4 - "build-3cfb5997-4c45-4540-8c44-714e584f5cff": 5609b76651f3: Pulling fs layer
Step #4 - "build-3cfb5997-4c45-4540-8c44-714e584f5cff": 61c29bc1ea23: Pulling fs layer
Step #4 - "build-3cfb5997-4c45-4540-8c44-714e584f5cff": d0f56b33b58c: Pulling fs layer
Step #4 - "build-3cfb5997-4c45-4540-8c44-714e584f5cff": 1e9effd53658: Pulling fs layer
Step #4 - "build-3cfb5997-4c45-4540-8c44-714e584f5cff": 034c24237b63: Waiting
Step #4 - "build-3cfb5997-4c45-4540-8c44-714e584f5cff": a8fe6d25332b: Pulling fs layer
Step #4 - "build-3cfb5997-4c45-4540-8c44-714e584f5cff": 2cd55043f631: Waiting
Step #4 - "build-3cfb5997-4c45-4540-8c44-714e584f5cff": 943d94782c71: Waiting
Step #4 - "build-3cfb5997-4c45-4540-8c44-714e584f5cff": 6e33b56de424: Waiting
Step #4 - "build-3cfb5997-4c45-4540-8c44-714e584f5cff": b53893e76fa8: Waiting
Step #4 - "build-3cfb5997-4c45-4540-8c44-714e584f5cff": 8d8d9af13c18: Waiting
Step #4 - "build-3cfb5997-4c45-4540-8c44-714e584f5cff": b5495aef6353: Waiting
Step #4 - "build-3cfb5997-4c45-4540-8c44-714e584f5cff": 42753a408f16: Waiting
Step #4 - "build-3cfb5997-4c45-4540-8c44-714e584f5cff": a946925e8898: Waiting
Step #4 - "build-3cfb5997-4c45-4540-8c44-714e584f5cff": 19891f4bd05e: Waiting
Step #4 - "build-3cfb5997-4c45-4540-8c44-714e584f5cff": 1d5d8a326c1c: Waiting
Step #4 - "build-3cfb5997-4c45-4540-8c44-714e584f5cff": 9966a8e430ab: Waiting
Step #4 - "build-3cfb5997-4c45-4540-8c44-714e584f5cff": 5609b76651f3: Waiting
Step #4 - "build-3cfb5997-4c45-4540-8c44-714e584f5cff": 32cf2b27eed5: Waiting
Step #4 - "build-3cfb5997-4c45-4540-8c44-714e584f5cff": d918e7183237: Waiting
Step #4 - "build-3cfb5997-4c45-4540-8c44-714e584f5cff": 61c29bc1ea23: Waiting
Step #4 - "build-3cfb5997-4c45-4540-8c44-714e584f5cff": e08405c74b26: Waiting
Step #4 - "build-3cfb5997-4c45-4540-8c44-714e584f5cff": d0f56b33b58c: Waiting
Step #4 - "build-3cfb5997-4c45-4540-8c44-714e584f5cff": 5ba4d68d2685: Waiting
Step #4 - "build-3cfb5997-4c45-4540-8c44-714e584f5cff": 1e9effd53658: Waiting
Step #4 - "build-3cfb5997-4c45-4540-8c44-714e584f5cff": 60b387e23174: Waiting
Step #4 - "build-3cfb5997-4c45-4540-8c44-714e584f5cff": a8fe6d25332b: Waiting
Step #4 - "build-3cfb5997-4c45-4540-8c44-714e584f5cff": 84fe4353f0ee: Waiting
Step #4 - "build-3cfb5997-4c45-4540-8c44-714e584f5cff": 08ae372c830e: Waiting
Step #4 - "build-3cfb5997-4c45-4540-8c44-714e584f5cff": 4e2f9fe20088: Waiting
Step #4 - "build-3cfb5997-4c45-4540-8c44-714e584f5cff": 8fa9ec6dff64: Waiting
Step #4 - "build-3cfb5997-4c45-4540-8c44-714e584f5cff": 236cde5149e4: Waiting
Step #4 - "build-3cfb5997-4c45-4540-8c44-714e584f5cff": 08e5a461591d: Waiting
Step #4 - "build-3cfb5997-4c45-4540-8c44-714e584f5cff": 7c638feb2297: Waiting
Step #4 - "build-3cfb5997-4c45-4540-8c44-714e584f5cff": a82df7073ed6: Verifying Checksum
Step #4 - "build-3cfb5997-4c45-4540-8c44-714e584f5cff": a82df7073ed6: Download complete
Step #4 - "build-3cfb5997-4c45-4540-8c44-714e584f5cff": 011e0b977b5a: Verifying Checksum
Step #4 - "build-3cfb5997-4c45-4540-8c44-714e584f5cff": 011e0b977b5a: Download complete
Step #4 - "build-3cfb5997-4c45-4540-8c44-714e584f5cff": b65d9913daec: Verifying Checksum
Step #4 - "build-3cfb5997-4c45-4540-8c44-714e584f5cff": b65d9913daec: Download complete
Step #4 - "build-3cfb5997-4c45-4540-8c44-714e584f5cff": 2cd55043f631: Verifying Checksum
Step #4 - "build-3cfb5997-4c45-4540-8c44-714e584f5cff": 2cd55043f631: Download complete
Step #4 - "build-3cfb5997-4c45-4540-8c44-714e584f5cff": 034c24237b63: Verifying Checksum
Step #4 - "build-3cfb5997-4c45-4540-8c44-714e584f5cff": 034c24237b63: Download complete
Step #4 - "build-3cfb5997-4c45-4540-8c44-714e584f5cff": f2207db74b28: Verifying Checksum
Step #4 - "build-3cfb5997-4c45-4540-8c44-714e584f5cff": f2207db74b28: Download complete
Step #4 - "build-3cfb5997-4c45-4540-8c44-714e584f5cff": 42753a408f16: Download complete
Step #4 - "build-3cfb5997-4c45-4540-8c44-714e584f5cff": b53893e76fa8: Verifying Checksum
Step #4 - "build-3cfb5997-4c45-4540-8c44-714e584f5cff": b53893e76fa8: Download complete
Step #4 - "build-3cfb5997-4c45-4540-8c44-714e584f5cff": d918e7183237: Download complete
Step #4 - "build-3cfb5997-4c45-4540-8c44-714e584f5cff": 9966a8e430ab: Verifying Checksum
Step #4 - "build-3cfb5997-4c45-4540-8c44-714e584f5cff": 9966a8e430ab: Download complete
Step #4 - "build-3cfb5997-4c45-4540-8c44-714e584f5cff": 5ba4d68d2685: Verifying Checksum
Step #4 - "build-3cfb5997-4c45-4540-8c44-714e584f5cff": 5ba4d68d2685: Download complete
Step #4 - "build-3cfb5997-4c45-4540-8c44-714e584f5cff": 8fa9ec6dff64: Verifying Checksum
Step #4 - "build-3cfb5997-4c45-4540-8c44-714e584f5cff": 8fa9ec6dff64: Download complete
Step #4 - "build-3cfb5997-4c45-4540-8c44-714e584f5cff": 236cde5149e4: Verifying Checksum
Step #4 - "build-3cfb5997-4c45-4540-8c44-714e584f5cff": 236cde5149e4: Download complete
Step #4 - "build-3cfb5997-4c45-4540-8c44-714e584f5cff": 84fe4353f0ee: Verifying Checksum
Step #4 - "build-3cfb5997-4c45-4540-8c44-714e584f5cff": 84fe4353f0ee: Download complete
Step #4 - "build-3cfb5997-4c45-4540-8c44-714e584f5cff": 7c638feb2297: Verifying Checksum
Step #4 - "build-3cfb5997-4c45-4540-8c44-714e584f5cff": 7c638feb2297: Download complete
Step #4 - "build-3cfb5997-4c45-4540-8c44-714e584f5cff": 08e5a461591d: Verifying Checksum
Step #4 - "build-3cfb5997-4c45-4540-8c44-714e584f5cff": 08e5a461591d: Download complete
Step #4 - "build-3cfb5997-4c45-4540-8c44-714e584f5cff": 4e2f9fe20088: Download complete
Step #4 - "build-3cfb5997-4c45-4540-8c44-714e584f5cff": 943d94782c71: Verifying Checksum
Step #4 - "build-3cfb5997-4c45-4540-8c44-714e584f5cff": 943d94782c71: Download complete
Step #4 - "build-3cfb5997-4c45-4540-8c44-714e584f5cff": 8d8d9af13c18: Download complete
Step #4 - "build-3cfb5997-4c45-4540-8c44-714e584f5cff": 19891f4bd05e: Verifying Checksum
Step #4 - "build-3cfb5997-4c45-4540-8c44-714e584f5cff": 19891f4bd05e: Download complete
Step #4 - "build-3cfb5997-4c45-4540-8c44-714e584f5cff": 32cf2b27eed5: Download complete
Step #4 - "build-3cfb5997-4c45-4540-8c44-714e584f5cff": e08405c74b26: Download complete
Step #4 - "build-3cfb5997-4c45-4540-8c44-714e584f5cff": 08ae372c830e: Verifying Checksum
Step #4 - "build-3cfb5997-4c45-4540-8c44-714e584f5cff": 08ae372c830e: Download complete
Step #4 - "build-3cfb5997-4c45-4540-8c44-714e584f5cff": 60b387e23174: Verifying Checksum
Step #4 - "build-3cfb5997-4c45-4540-8c44-714e584f5cff": 60b387e23174: Download complete
Step #4 - "build-3cfb5997-4c45-4540-8c44-714e584f5cff": b5495aef6353: Verifying Checksum
Step #4 - "build-3cfb5997-4c45-4540-8c44-714e584f5cff": b5495aef6353: Download complete
Step #4 - "build-3cfb5997-4c45-4540-8c44-714e584f5cff": a946925e8898: Verifying Checksum
Step #4 - "build-3cfb5997-4c45-4540-8c44-714e584f5cff": a946925e8898: Download complete
Step #4 - "build-3cfb5997-4c45-4540-8c44-714e584f5cff": 1d5d8a326c1c: Download complete
Step #4 - "build-3cfb5997-4c45-4540-8c44-714e584f5cff": 6e33b56de424: Verifying Checksum
Step #4 - "build-3cfb5997-4c45-4540-8c44-714e584f5cff": 6e33b56de424: Download complete
Step #4 - "build-3cfb5997-4c45-4540-8c44-714e584f5cff": 853cb046333e: Verifying Checksum
Step #4 - "build-3cfb5997-4c45-4540-8c44-714e584f5cff": 853cb046333e: Download complete
Step #4 - "build-3cfb5997-4c45-4540-8c44-714e584f5cff": 5609b76651f3: Verifying Checksum
Step #4 - "build-3cfb5997-4c45-4540-8c44-714e584f5cff": 5609b76651f3: Download complete
Step #4 - "build-3cfb5997-4c45-4540-8c44-714e584f5cff": 61c29bc1ea23: Download complete
Step #4 - "build-3cfb5997-4c45-4540-8c44-714e584f5cff": d0f56b33b58c: Verifying Checksum
Step #4 - "build-3cfb5997-4c45-4540-8c44-714e584f5cff": d0f56b33b58c: Download complete
Step #4 - "build-3cfb5997-4c45-4540-8c44-714e584f5cff": f2207db74b28: Pull complete
Step #4 - "build-3cfb5997-4c45-4540-8c44-714e584f5cff": b65d9913daec: Pull complete
Step #4 - "build-3cfb5997-4c45-4540-8c44-714e584f5cff": a8fe6d25332b: Verifying Checksum
Step #4 - "build-3cfb5997-4c45-4540-8c44-714e584f5cff": a8fe6d25332b: Download complete
Step #4 - "build-3cfb5997-4c45-4540-8c44-714e584f5cff": 1e9effd53658: Verifying Checksum
Step #4 - "build-3cfb5997-4c45-4540-8c44-714e584f5cff": 1e9effd53658: Download complete
Step #4 - "build-3cfb5997-4c45-4540-8c44-714e584f5cff": 0cef7815d3a4: Verifying Checksum
Step #4 - "build-3cfb5997-4c45-4540-8c44-714e584f5cff": 0cef7815d3a4: Download complete
Step #4 - "build-3cfb5997-4c45-4540-8c44-714e584f5cff": 0cef7815d3a4: Pull complete
Step #4 - "build-3cfb5997-4c45-4540-8c44-714e584f5cff": 011e0b977b5a: Pull complete
Step #4 - "build-3cfb5997-4c45-4540-8c44-714e584f5cff": a82df7073ed6: Pull complete
Step #4 - "build-3cfb5997-4c45-4540-8c44-714e584f5cff": 853cb046333e: Pull complete
Step #4 - "build-3cfb5997-4c45-4540-8c44-714e584f5cff": 8fa9ec6dff64: Pull complete
Step #4 - "build-3cfb5997-4c45-4540-8c44-714e584f5cff": 034c24237b63: Pull complete
Step #4 - "build-3cfb5997-4c45-4540-8c44-714e584f5cff": 2cd55043f631: Pull complete
Step #4 - "build-3cfb5997-4c45-4540-8c44-714e584f5cff": b53893e76fa8: Pull complete
Step #4 - "build-3cfb5997-4c45-4540-8c44-714e584f5cff": 42753a408f16: Pull complete
Step #4 - "build-3cfb5997-4c45-4540-8c44-714e584f5cff": 9966a8e430ab: Pull complete
Step #4 - "build-3cfb5997-4c45-4540-8c44-714e584f5cff": d918e7183237: Pull complete
Step #4 - "build-3cfb5997-4c45-4540-8c44-714e584f5cff": 5ba4d68d2685: Pull complete
Step #4 - "build-3cfb5997-4c45-4540-8c44-714e584f5cff": 84fe4353f0ee: Pull complete
Step #4 - "build-3cfb5997-4c45-4540-8c44-714e584f5cff": 236cde5149e4: Pull complete
Step #4 - "build-3cfb5997-4c45-4540-8c44-714e584f5cff": 7c638feb2297: Pull complete
Step #4 - "build-3cfb5997-4c45-4540-8c44-714e584f5cff": 08e5a461591d: Pull complete
Step #4 - "build-3cfb5997-4c45-4540-8c44-714e584f5cff": 4e2f9fe20088: Pull complete
Step #4 - "build-3cfb5997-4c45-4540-8c44-714e584f5cff": 943d94782c71: Pull complete
Step #4 - "build-3cfb5997-4c45-4540-8c44-714e584f5cff": 8d8d9af13c18: Pull complete
Step #4 - "build-3cfb5997-4c45-4540-8c44-714e584f5cff": 19891f4bd05e: Pull complete
Step #4 - "build-3cfb5997-4c45-4540-8c44-714e584f5cff": 32cf2b27eed5: Pull complete
Step #4 - "build-3cfb5997-4c45-4540-8c44-714e584f5cff": e08405c74b26: Pull complete
Step #4 - "build-3cfb5997-4c45-4540-8c44-714e584f5cff": 60b387e23174: Pull complete
Step #4 - "build-3cfb5997-4c45-4540-8c44-714e584f5cff": 08ae372c830e: Pull complete
Step #4 - "build-3cfb5997-4c45-4540-8c44-714e584f5cff": 6e33b56de424: Pull complete
Step #4 - "build-3cfb5997-4c45-4540-8c44-714e584f5cff": b5495aef6353: Pull complete
Step #4 - "build-3cfb5997-4c45-4540-8c44-714e584f5cff": a946925e8898: Pull complete
Step #4 - "build-3cfb5997-4c45-4540-8c44-714e584f5cff": 1d5d8a326c1c: Pull complete
Step #4 - "build-3cfb5997-4c45-4540-8c44-714e584f5cff": 5609b76651f3: Pull complete
Step #4 - "build-3cfb5997-4c45-4540-8c44-714e584f5cff": 61c29bc1ea23: Pull complete
Step #4 - "build-3cfb5997-4c45-4540-8c44-714e584f5cff": d0f56b33b58c: Pull complete
Step #4 - "build-3cfb5997-4c45-4540-8c44-714e584f5cff": 1e9effd53658: Pull complete
Step #4 - "build-3cfb5997-4c45-4540-8c44-714e584f5cff": a8fe6d25332b: Pull complete
Step #4 - "build-3cfb5997-4c45-4540-8c44-714e584f5cff": Digest: sha256:40c880a5fb3602ddd109fd926ce2f545c48898ff6fa90bf209af3faf2537e6e2
Step #4 - "build-3cfb5997-4c45-4540-8c44-714e584f5cff": Status: Downloaded newer image for gcr.io/oss-fuzz-base/base-builder:latest
Step #4 - "build-3cfb5997-4c45-4540-8c44-714e584f5cff": ---> f8b8205c484c
Step #4 - "build-3cfb5997-4c45-4540-8c44-714e584f5cff": Step 2/6 : RUN apt-get update && apt-get install -y make autoconf automake libtool gettext pkg-config build-essential
Step #4 - "build-3cfb5997-4c45-4540-8c44-714e584f5cff": ---> Running in 0a83f7a9b667
Step #4 - "build-3cfb5997-4c45-4540-8c44-714e584f5cff": Hit:1 http://security.ubuntu.com/ubuntu focal-security InRelease
Step #4 - "build-3cfb5997-4c45-4540-8c44-714e584f5cff": Hit:2 http://archive.ubuntu.com/ubuntu focal InRelease
Step #4 - "build-3cfb5997-4c45-4540-8c44-714e584f5cff": Hit:3 http://archive.ubuntu.com/ubuntu focal-updates InRelease
Step #4 - "build-3cfb5997-4c45-4540-8c44-714e584f5cff": Hit:4 http://archive.ubuntu.com/ubuntu focal-backports InRelease
Step #4 - "build-3cfb5997-4c45-4540-8c44-714e584f5cff": Reading package lists...
Step #4 - "build-3cfb5997-4c45-4540-8c44-714e584f5cff": Reading package lists...
Step #4 - "build-3cfb5997-4c45-4540-8c44-714e584f5cff": Building dependency tree...
Step #4 - "build-3cfb5997-4c45-4540-8c44-714e584f5cff": Reading state information...
Step #4 - "build-3cfb5997-4c45-4540-8c44-714e584f5cff": make is already the newest version (4.2.1-1.2).
Step #4 - "build-3cfb5997-4c45-4540-8c44-714e584f5cff": make set to manually installed.
Step #4 - "build-3cfb5997-4c45-4540-8c44-714e584f5cff": build-essential is already the newest version (12.8ubuntu1.1).
Step #4 - "build-3cfb5997-4c45-4540-8c44-714e584f5cff": The following additional packages will be installed:
Step #4 - "build-3cfb5997-4c45-4540-8c44-714e584f5cff": file gettext-base libcroco3 libglib2.0-0 libglib2.0-data libicu66
Step #4 - "build-3cfb5997-4c45-4540-8c44-714e584f5cff": libltdl-dev libltdl7 libmagic-mgc libmagic1 libxml2 shared-mime-info
Step #4 - "build-3cfb5997-4c45-4540-8c44-714e584f5cff": xdg-user-dirs
Step #4 - "build-3cfb5997-4c45-4540-8c44-714e584f5cff": Suggested packages:
Step #4 - "build-3cfb5997-4c45-4540-8c44-714e584f5cff": autoconf-archive gnu-standards autoconf-doc gettext-doc autopoint
Step #4 - "build-3cfb5997-4c45-4540-8c44-714e584f5cff": libasprintf-dev libgettextpo-dev libtool-doc gfortran | fortran95-compiler
Step #4 - "build-3cfb5997-4c45-4540-8c44-714e584f5cff": gcj-jdk
Step #4 - "build-3cfb5997-4c45-4540-8c44-714e584f5cff": The following NEW packages will be installed:
Step #4 - "build-3cfb5997-4c45-4540-8c44-714e584f5cff": autoconf automake file gettext gettext-base libcroco3 libglib2.0-0
Step #4 - "build-3cfb5997-4c45-4540-8c44-714e584f5cff": libglib2.0-data libicu66 libltdl-dev libltdl7 libmagic-mgc libmagic1 libtool
Step #4 - "build-3cfb5997-4c45-4540-8c44-714e584f5cff": libxml2 pkg-config shared-mime-info xdg-user-dirs
Step #4 - "build-3cfb5997-4c45-4540-8c44-714e584f5cff": 0 upgraded, 18 newly installed, 0 to remove and 0 not upgraded.
Step #4 - "build-3cfb5997-4c45-4540-8c44-714e584f5cff": Need to get 13.5 MB of archives.
Step #4 - "build-3cfb5997-4c45-4540-8c44-714e584f5cff": After this operation, 60.0 MB of additional disk space will be used.
Step #4 - "build-3cfb5997-4c45-4540-8c44-714e584f5cff": Get:1 http://archive.ubuntu.com/ubuntu focal/main amd64 libmagic-mgc amd64 1:5.38-4 [218 kB]
Step #4 - "build-3cfb5997-4c45-4540-8c44-714e584f5cff": Get:2 http://archive.ubuntu.com/ubuntu focal/main amd64 libmagic1 amd64 1:5.38-4 [75.9 kB]
Step #4 - "build-3cfb5997-4c45-4540-8c44-714e584f5cff": Get:3 http://archive.ubuntu.com/ubuntu focal/main amd64 file amd64 1:5.38-4 [23.3 kB]
Step #4 - "build-3cfb5997-4c45-4540-8c44-714e584f5cff": Get:4 http://archive.ubuntu.com/ubuntu focal-updates/main amd64 libglib2.0-0 amd64 2.64.6-1~ubuntu20.04.9 [1290 kB]
Step #4 - "build-3cfb5997-4c45-4540-8c44-714e584f5cff": Get:5 http://archive.ubuntu.com/ubuntu focal-updates/main amd64 libglib2.0-data all 2.64.6-1~ubuntu20.04.9 [5836 B]
Step #4 - "build-3cfb5997-4c45-4540-8c44-714e584f5cff": Get:6 http://archive.ubuntu.com/ubuntu focal-updates/main amd64 libicu66 amd64 66.1-2ubuntu2.1 [8515 kB]
Step #4 - "build-3cfb5997-4c45-4540-8c44-714e584f5cff": Get:7 http://archive.ubuntu.com/ubuntu focal-updates/main amd64 libxml2 amd64 2.9.10+dfsg-5ubuntu0.20.04.10 [640 kB]
Step #4 - "build-3cfb5997-4c45-4540-8c44-714e584f5cff": Get:8 http://archive.ubuntu.com/ubuntu focal/main amd64 shared-mime-info amd64 1.15-1 [430 kB]
Step #4 - "build-3cfb5997-4c45-4540-8c44-714e584f5cff": Get:9 http://archive.ubuntu.com/ubuntu focal/main amd64 xdg-user-dirs amd64 0.17-2ubuntu1 [48.3 kB]
Step #4 - "build-3cfb5997-4c45-4540-8c44-714e584f5cff": Get:10 http://archive.ubuntu.com/ubuntu focal/main amd64 gettext-base amd64 0.19.8.1-10build1 [50.2 kB]
Step #4 - "build-3cfb5997-4c45-4540-8c44-714e584f5cff": Get:11 http://archive.ubuntu.com/ubuntu focal/main amd64 autoconf all 2.69-11.1 [321 kB]
Step #4 - "build-3cfb5997-4c45-4540-8c44-714e584f5cff": Get:12 http://archive.ubuntu.com/ubuntu focal/main amd64 automake all 1:1.16.1-4ubuntu6 [522 kB]
Step #4 - "build-3cfb5997-4c45-4540-8c44-714e584f5cff": Get:13 http://archive.ubuntu.com/ubuntu focal-updates/main amd64 libcroco3 amd64 0.6.13-1ubuntu0.1 [82.4 kB]
Step #4 - "build-3cfb5997-4c45-4540-8c44-714e584f5cff": Get:14 http://archive.ubuntu.com/ubuntu focal/main amd64 gettext amd64 0.19.8.1-10build1 [895 kB]
Step #4 - "build-3cfb5997-4c45-4540-8c44-714e584f5cff": Get:15 http://archive.ubuntu.com/ubuntu focal/main amd64 libltdl7 amd64 2.4.6-14 [38.5 kB]
Step #4 - "build-3cfb5997-4c45-4540-8c44-714e584f5cff": Get:16 http://archive.ubuntu.com/ubuntu focal/main amd64 libltdl-dev amd64 2.4.6-14 [162 kB]
Step #4 - "build-3cfb5997-4c45-4540-8c44-714e584f5cff": Get:17 http://archive.ubuntu.com/ubuntu focal/main amd64 libtool all 2.4.6-14 [161 kB]
Step #4 - "build-3cfb5997-4c45-4540-8c44-714e584f5cff": Get:18 http://archive.ubuntu.com/ubuntu focal/main amd64 pkg-config amd64 0.29.1-0ubuntu4 [45.5 kB]
Step #4 - "build-3cfb5997-4c45-4540-8c44-714e584f5cff": [91mdebconf: delaying package configuration, since apt-utils is not installed
Step #4 - "build-3cfb5997-4c45-4540-8c44-714e584f5cff": [0mFetched 13.5 MB in 0s (44.2 MB/s)
Step #4 - "build-3cfb5997-4c45-4540-8c44-714e584f5cff": Selecting previously unselected package libmagic-mgc.
Step #4 - "build-3cfb5997-4c45-4540-8c44-714e584f5cff": (Reading database ...
(Reading database ... 5%
(Reading database ... 10%
(Reading database ... 15%
(Reading database ... 20%
(Reading database ... 25%
(Reading database ... 30%
(Reading database ... 35%
(Reading database ... 40%
(Reading database ... 45%
(Reading database ... 50%
(Reading database ... 55%
(Reading database ... 60%
(Reading database ... 65%
(Reading database ... 70%
(Reading database ... 75%
(Reading database ... 80%
(Reading database ... 85%
(Reading database ... 90%
(Reading database ... 95%
(Reading database ... 100%
(Reading database ... 17483 files and directories currently installed.)
Step #4 - "build-3cfb5997-4c45-4540-8c44-714e584f5cff": Preparing to unpack .../00-libmagic-mgc_1%3a5.38-4_amd64.deb ...
Step #4 - "build-3cfb5997-4c45-4540-8c44-714e584f5cff": Unpacking libmagic-mgc (1:5.38-4) ...
Step #4 - "build-3cfb5997-4c45-4540-8c44-714e584f5cff": Selecting previously unselected package libmagic1:amd64.
Step #4 - "build-3cfb5997-4c45-4540-8c44-714e584f5cff": Preparing to unpack .../01-libmagic1_1%3a5.38-4_amd64.deb ...
Step #4 - "build-3cfb5997-4c45-4540-8c44-714e584f5cff": Unpacking libmagic1:amd64 (1:5.38-4) ...
Step #4 - "build-3cfb5997-4c45-4540-8c44-714e584f5cff": Selecting previously unselected package file.
Step #4 - "build-3cfb5997-4c45-4540-8c44-714e584f5cff": Preparing to unpack .../02-file_1%3a5.38-4_amd64.deb ...
Step #4 - "build-3cfb5997-4c45-4540-8c44-714e584f5cff": Unpacking file (1:5.38-4) ...
Step #4 - "build-3cfb5997-4c45-4540-8c44-714e584f5cff": Selecting previously unselected package libglib2.0-0:amd64.
Step #4 - "build-3cfb5997-4c45-4540-8c44-714e584f5cff": Preparing to unpack .../03-libglib2.0-0_2.64.6-1~ubuntu20.04.9_amd64.deb ...
Step #4 - "build-3cfb5997-4c45-4540-8c44-714e584f5cff": Unpacking libglib2.0-0:amd64 (2.64.6-1~ubuntu20.04.9) ...
Step #4 - "build-3cfb5997-4c45-4540-8c44-714e584f5cff": Selecting previously unselected package libglib2.0-data.
Step #4 - "build-3cfb5997-4c45-4540-8c44-714e584f5cff": Preparing to unpack .../04-libglib2.0-data_2.64.6-1~ubuntu20.04.9_all.deb ...
Step #4 - "build-3cfb5997-4c45-4540-8c44-714e584f5cff": Unpacking libglib2.0-data (2.64.6-1~ubuntu20.04.9) ...
Step #4 - "build-3cfb5997-4c45-4540-8c44-714e584f5cff": Selecting previously unselected package libicu66:amd64.
Step #4 - "build-3cfb5997-4c45-4540-8c44-714e584f5cff": Preparing to unpack .../05-libicu66_66.1-2ubuntu2.1_amd64.deb ...
Step #4 - "build-3cfb5997-4c45-4540-8c44-714e584f5cff": Unpacking libicu66:amd64 (66.1-2ubuntu2.1) ...
Step #4 - "build-3cfb5997-4c45-4540-8c44-714e584f5cff": Selecting previously unselected package libxml2:amd64.
Step #4 - "build-3cfb5997-4c45-4540-8c44-714e584f5cff": Preparing to unpack .../06-libxml2_2.9.10+dfsg-5ubuntu0.20.04.10_amd64.deb ...
Step #4 - "build-3cfb5997-4c45-4540-8c44-714e584f5cff": Unpacking libxml2:amd64 (2.9.10+dfsg-5ubuntu0.20.04.10) ...
Step #4 - "build-3cfb5997-4c45-4540-8c44-714e584f5cff": Selecting previously unselected package shared-mime-info.
Step #4 - "build-3cfb5997-4c45-4540-8c44-714e584f5cff": Preparing to unpack .../07-shared-mime-info_1.15-1_amd64.deb ...
Step #4 - "build-3cfb5997-4c45-4540-8c44-714e584f5cff": Unpacking shared-mime-info (1.15-1) ...
Step #4 - "build-3cfb5997-4c45-4540-8c44-714e584f5cff": Selecting previously unselected package xdg-user-dirs.
Step #4 - "build-3cfb5997-4c45-4540-8c44-714e584f5cff": Preparing to unpack .../08-xdg-user-dirs_0.17-2ubuntu1_amd64.deb ...
Step #4 - "build-3cfb5997-4c45-4540-8c44-714e584f5cff": Unpacking xdg-user-dirs (0.17-2ubuntu1) ...
Step #4 - "build-3cfb5997-4c45-4540-8c44-714e584f5cff": Selecting previously unselected package gettext-base.
Step #4 - "build-3cfb5997-4c45-4540-8c44-714e584f5cff": Preparing to unpack .../09-gettext-base_0.19.8.1-10build1_amd64.deb ...
Step #4 - "build-3cfb5997-4c45-4540-8c44-714e584f5cff": Unpacking gettext-base (0.19.8.1-10build1) ...
Step #4 - "build-3cfb5997-4c45-4540-8c44-714e584f5cff": Selecting previously unselected package autoconf.
Step #4 - "build-3cfb5997-4c45-4540-8c44-714e584f5cff": Preparing to unpack .../10-autoconf_2.69-11.1_all.deb ...
Step #4 - "build-3cfb5997-4c45-4540-8c44-714e584f5cff": Unpacking autoconf (2.69-11.1) ...
Step #4 - "build-3cfb5997-4c45-4540-8c44-714e584f5cff": Selecting previously unselected package automake.
Step #4 - "build-3cfb5997-4c45-4540-8c44-714e584f5cff": Preparing to unpack .../11-automake_1%3a1.16.1-4ubuntu6_all.deb ...
Step #4 - "build-3cfb5997-4c45-4540-8c44-714e584f5cff": Unpacking automake (1:1.16.1-4ubuntu6) ...
Step #4 - "build-3cfb5997-4c45-4540-8c44-714e584f5cff": Selecting previously unselected package libcroco3:amd64.
Step #4 - "build-3cfb5997-4c45-4540-8c44-714e584f5cff": Preparing to unpack .../12-libcroco3_0.6.13-1ubuntu0.1_amd64.deb ...
Step #4 - "build-3cfb5997-4c45-4540-8c44-714e584f5cff": Unpacking libcroco3:amd64 (0.6.13-1ubuntu0.1) ...
Step #4 - "build-3cfb5997-4c45-4540-8c44-714e584f5cff": Selecting previously unselected package gettext.
Step #4 - "build-3cfb5997-4c45-4540-8c44-714e584f5cff": Preparing to unpack .../13-gettext_0.19.8.1-10build1_amd64.deb ...
Step #4 - "build-3cfb5997-4c45-4540-8c44-714e584f5cff": Unpacking gettext (0.19.8.1-10build1) ...
Step #4 - "build-3cfb5997-4c45-4540-8c44-714e584f5cff": Selecting previously unselected package libltdl7:amd64.
Step #4 - "build-3cfb5997-4c45-4540-8c44-714e584f5cff": Preparing to unpack .../14-libltdl7_2.4.6-14_amd64.deb ...
Step #4 - "build-3cfb5997-4c45-4540-8c44-714e584f5cff": Unpacking libltdl7:amd64 (2.4.6-14) ...
Step #4 - "build-3cfb5997-4c45-4540-8c44-714e584f5cff": Selecting previously unselected package libltdl-dev:amd64.
Step #4 - "build-3cfb5997-4c45-4540-8c44-714e584f5cff": Preparing to unpack .../15-libltdl-dev_2.4.6-14_amd64.deb ...
Step #4 - "build-3cfb5997-4c45-4540-8c44-714e584f5cff": Unpacking libltdl-dev:amd64 (2.4.6-14) ...
Step #4 - "build-3cfb5997-4c45-4540-8c44-714e584f5cff": Selecting previously unselected package libtool.
Step #4 - "build-3cfb5997-4c45-4540-8c44-714e584f5cff": Preparing to unpack .../16-libtool_2.4.6-14_all.deb ...
Step #4 - "build-3cfb5997-4c45-4540-8c44-714e584f5cff": Unpacking libtool (2.4.6-14) ...
Step #4 - "build-3cfb5997-4c45-4540-8c44-714e584f5cff": Selecting previously unselected package pkg-config.
Step #4 - "build-3cfb5997-4c45-4540-8c44-714e584f5cff": Preparing to unpack .../17-pkg-config_0.29.1-0ubuntu4_amd64.deb ...
Step #4 - "build-3cfb5997-4c45-4540-8c44-714e584f5cff": Unpacking pkg-config (0.29.1-0ubuntu4) ...
Step #4 - "build-3cfb5997-4c45-4540-8c44-714e584f5cff": Setting up xdg-user-dirs (0.17-2ubuntu1) ...
Step #4 - "build-3cfb5997-4c45-4540-8c44-714e584f5cff": Setting up libmagic-mgc (1:5.38-4) ...
Step #4 - "build-3cfb5997-4c45-4540-8c44-714e584f5cff": Setting up libglib2.0-0:amd64 (2.64.6-1~ubuntu20.04.9) ...
Step #4 - "build-3cfb5997-4c45-4540-8c44-714e584f5cff": No schema files found: doing nothing.
Step #4 - "build-3cfb5997-4c45-4540-8c44-714e584f5cff": Setting up libicu66:amd64 (66.1-2ubuntu2.1) ...
Step #4 - "build-3cfb5997-4c45-4540-8c44-714e584f5cff": Setting up libmagic1:amd64 (1:5.38-4) ...
Step #4 - "build-3cfb5997-4c45-4540-8c44-714e584f5cff": Setting up gettext-base (0.19.8.1-10build1) ...
Step #4 - "build-3cfb5997-4c45-4540-8c44-714e584f5cff": Setting up file (1:5.38-4) ...
Step #4 - "build-3cfb5997-4c45-4540-8c44-714e584f5cff": Setting up libglib2.0-data (2.64.6-1~ubuntu20.04.9) ...
Step #4 - "build-3cfb5997-4c45-4540-8c44-714e584f5cff": Setting up pkg-config (0.29.1-0ubuntu4) ...
Step #4 - "build-3cfb5997-4c45-4540-8c44-714e584f5cff": Setting up libltdl7:amd64 (2.4.6-14) ...
Step #4 - "build-3cfb5997-4c45-4540-8c44-714e584f5cff": Setting up autoconf (2.69-11.1) ...
Step #4 - "build-3cfb5997-4c45-4540-8c44-714e584f5cff": Setting up libxml2:amd64 (2.9.10+dfsg-5ubuntu0.20.04.10) ...
Step #4 - "build-3cfb5997-4c45-4540-8c44-714e584f5cff": Setting up automake (1:1.16.1-4ubuntu6) ...
Step #4 - "build-3cfb5997-4c45-4540-8c44-714e584f5cff": update-alternatives: using /usr/bin/automake-1.16 to provide /usr/bin/automake (automake) in auto mode
Step #4 - "build-3cfb5997-4c45-4540-8c44-714e584f5cff": update-alternatives: warning: skip creation of /usr/share/man/man1/automake.1.gz because associated file /usr/share/man/man1/automake-1.16.1.gz (of link group automake) doesn't exist
Step #4 - "build-3cfb5997-4c45-4540-8c44-714e584f5cff": update-alternatives: warning: skip creation of /usr/share/man/man1/aclocal.1.gz because associated file /usr/share/man/man1/aclocal-1.16.1.gz (of link group automake) doesn't exist
Step #4 - "build-3cfb5997-4c45-4540-8c44-714e584f5cff": Setting up libtool (2.4.6-14) ...
Step #4 - "build-3cfb5997-4c45-4540-8c44-714e584f5cff": Setting up libltdl-dev:amd64 (2.4.6-14) ...
Step #4 - "build-3cfb5997-4c45-4540-8c44-714e584f5cff": Setting up shared-mime-info (1.15-1) ...
Step #4 - "build-3cfb5997-4c45-4540-8c44-714e584f5cff": Setting up libcroco3:amd64 (0.6.13-1ubuntu0.1) ...
Step #4 - "build-3cfb5997-4c45-4540-8c44-714e584f5cff": Setting up gettext (0.19.8.1-10build1) ...
Step #4 - "build-3cfb5997-4c45-4540-8c44-714e584f5cff": Processing triggers for libc-bin (2.31-0ubuntu9.18) ...
Step #4 - "build-3cfb5997-4c45-4540-8c44-714e584f5cff": Removing intermediate container 0a83f7a9b667
Step #4 - "build-3cfb5997-4c45-4540-8c44-714e584f5cff": ---> 2117a5540712
Step #4 - "build-3cfb5997-4c45-4540-8c44-714e584f5cff": Step 3/6 : RUN git clone --recurse-submodules https://github.com/google/snappy
Step #4 - "build-3cfb5997-4c45-4540-8c44-714e584f5cff": ---> Running in 2599a4449b2b
Step #4 - "build-3cfb5997-4c45-4540-8c44-714e584f5cff": [91mCloning into 'snappy'...
Step #4 - "build-3cfb5997-4c45-4540-8c44-714e584f5cff": [0m[91mSubmodule 'third_party/benchmark' (https://github.com/google/benchmark.git) registered for path 'third_party/benchmark'
Step #4 - "build-3cfb5997-4c45-4540-8c44-714e584f5cff": [0m[91mSubmodule 'third_party/googletest' (https://github.com/google/googletest.git) registered for path 'third_party/googletest'
Step #4 - "build-3cfb5997-4c45-4540-8c44-714e584f5cff": [0m[91mCloning into '/src/snappy/third_party/benchmark'...
Step #4 - "build-3cfb5997-4c45-4540-8c44-714e584f5cff": [0m[91mCloning into '/src/snappy/third_party/googletest'...
Step #4 - "build-3cfb5997-4c45-4540-8c44-714e584f5cff": [0mSubmodule path 'third_party/benchmark': checked out 'b20cea674170b2ba45da0dfaf03953cdea473d0d'
Step #4 - "build-3cfb5997-4c45-4540-8c44-714e584f5cff": Submodule path 'third_party/googletest': checked out 'b796f7d44681514f58a683a3a71ff17c94edb0c1'
Step #4 - "build-3cfb5997-4c45-4540-8c44-714e584f5cff": Removing intermediate container 2599a4449b2b
Step #4 - "build-3cfb5997-4c45-4540-8c44-714e584f5cff": ---> c1aacbf79f92
Step #4 - "build-3cfb5997-4c45-4540-8c44-714e584f5cff": Step 4/6 : RUN rm -rf $SRC/snappy/third_party/googletest && git clone --depth 1 https://github.com/google/googletest $SRC/snappy/third_party/googletest
Step #4 - "build-3cfb5997-4c45-4540-8c44-714e584f5cff": ---> Running in 85b3e6da1825
Step #4 - "build-3cfb5997-4c45-4540-8c44-714e584f5cff": [91mCloning into '/src/snappy/third_party/googletest'...
Step #4 - "build-3cfb5997-4c45-4540-8c44-714e584f5cff": [0mRemoving intermediate container 85b3e6da1825
Step #4 - "build-3cfb5997-4c45-4540-8c44-714e584f5cff": ---> 351dc160b161
Step #4 - "build-3cfb5997-4c45-4540-8c44-714e584f5cff": Step 5/6 : WORKDIR $SRC/
Step #4 - "build-3cfb5997-4c45-4540-8c44-714e584f5cff": ---> Running in dc170ddf1def
Step #4 - "build-3cfb5997-4c45-4540-8c44-714e584f5cff": Removing intermediate container dc170ddf1def
Step #4 - "build-3cfb5997-4c45-4540-8c44-714e584f5cff": ---> d6bff92b248d
Step #4 - "build-3cfb5997-4c45-4540-8c44-714e584f5cff": Step 6/6 : COPY run_tests.sh build.sh $SRC/
Step #4 - "build-3cfb5997-4c45-4540-8c44-714e584f5cff": ---> 39c98d1ffbd2
Step #4 - "build-3cfb5997-4c45-4540-8c44-714e584f5cff": Successfully built 39c98d1ffbd2
Step #4 - "build-3cfb5997-4c45-4540-8c44-714e584f5cff": Successfully tagged gcr.io/oss-fuzz/snappy:latest
Step #4 - "build-3cfb5997-4c45-4540-8c44-714e584f5cff": Successfully tagged us-central1-docker.pkg.dev/oss-fuzz/unsafe/snappy:latest
Finished Step #4 - "build-3cfb5997-4c45-4540-8c44-714e584f5cff"
Starting Step #5 - "srcmap"
Step #5 - "srcmap": Already have image: gcr.io/oss-fuzz/snappy
Step #5 - "srcmap": ++ tempfile
Step #5 - "srcmap": + SRCMAP=/tmp/filehW6XMP
Step #5 - "srcmap": + echo '{}'
Step #5 - "srcmap": + PATHS_TO_SCAN=/src
Step #5 - "srcmap": + [[ c++ == \g\o ]]
Step #5 - "srcmap": ++ find /src -name .git -type d
Step #5 - "srcmap": + for DOT_GIT_DIR in $(find $PATHS_TO_SCAN -name ".git" -type d)
Step #5 - "srcmap": ++ dirname /src/snappy/.git
Step #5 - "srcmap": + GIT_DIR=/src/snappy
Step #5 - "srcmap": + cd /src/snappy
Step #5 - "srcmap": ++ git config --get remote.origin.url
Step #5 - "srcmap": + GIT_URL=https://github.com/google/snappy
Step #5 - "srcmap": ++ git rev-parse HEAD
Step #5 - "srcmap": + GIT_REV=3ac3722e1bee4b99860a282fb779e8e72fa18163
Step #5 - "srcmap": + jq_inplace /tmp/filehW6XMP '."/src/snappy" = { type: "git", url: "https://github.com/google/snappy", rev: "3ac3722e1bee4b99860a282fb779e8e72fa18163" }'
Step #5 - "srcmap": ++ tempfile
Step #5 - "srcmap": + F=/tmp/fileI9KpOc
Step #5 - "srcmap": + cat /tmp/filehW6XMP
Step #5 - "srcmap": + jq '."/src/snappy" = { type: "git", url: "https://github.com/google/snappy", rev: "3ac3722e1bee4b99860a282fb779e8e72fa18163" }'
Step #5 - "srcmap": + mv /tmp/fileI9KpOc /tmp/filehW6XMP
Step #5 - "srcmap": + for DOT_GIT_DIR in $(find $PATHS_TO_SCAN -name ".git" -type d)
Step #5 - "srcmap": ++ dirname /src/snappy/third_party/googletest/.git
Step #5 - "srcmap": + GIT_DIR=/src/snappy/third_party/googletest
Step #5 - "srcmap": + cd /src/snappy/third_party/googletest
Step #5 - "srcmap": ++ git config --get remote.origin.url
Step #5 - "srcmap": + GIT_URL=https://github.com/google/googletest
Step #5 - "srcmap": ++ git rev-parse HEAD
Step #5 - "srcmap": + GIT_REV=973323ed64a05b128418e7eab67016db5ba049df
Step #5 - "srcmap": + jq_inplace /tmp/filehW6XMP '."/src/snappy/third_party/googletest" = { type: "git", url: "https://github.com/google/googletest", rev: "973323ed64a05b128418e7eab67016db5ba049df" }'
Step #5 - "srcmap": ++ tempfile
Step #5 - "srcmap": + F=/tmp/filecIPw9I
Step #5 - "srcmap": + cat /tmp/filehW6XMP
Step #5 - "srcmap": + jq '."/src/snappy/third_party/googletest" = { type: "git", url: "https://github.com/google/googletest", rev: "973323ed64a05b128418e7eab67016db5ba049df" }'
Step #5 - "srcmap": + mv /tmp/filecIPw9I /tmp/filehW6XMP
Step #5 - "srcmap": ++ find /src -name .svn -type d
Step #5 - "srcmap": ++ find /src -name .hg -type d
Step #5 - "srcmap": + '[' '' '!=' '' ']'
Step #5 - "srcmap": + cat /tmp/filehW6XMP
Step #5 - "srcmap": + rm /tmp/filehW6XMP
Step #5 - "srcmap": {
Step #5 - "srcmap": "/src/snappy": {
Step #5 - "srcmap": "type": "git",
Step #5 - "srcmap": "url": "https://github.com/google/snappy",
Step #5 - "srcmap": "rev": "3ac3722e1bee4b99860a282fb779e8e72fa18163"
Step #5 - "srcmap": },
Step #5 - "srcmap": "/src/snappy/third_party/googletest": {
Step #5 - "srcmap": "type": "git",
Step #5 - "srcmap": "url": "https://github.com/google/googletest",
Step #5 - "srcmap": "rev": "973323ed64a05b128418e7eab67016db5ba049df"
Step #5 - "srcmap": }
Step #5 - "srcmap": }
Finished Step #5 - "srcmap"
Starting Step #6 - "compile-libfuzzer-introspector-x86_64"
Step #6 - "compile-libfuzzer-introspector-x86_64": Already have image (with digest): gcr.io/cloud-builders/docker
Step #6 - "compile-libfuzzer-introspector-x86_64": ---------------------------------------------------------------
Step #6 - "compile-libfuzzer-introspector-x86_64": vm.mmap_rnd_bits = 28
Step #6 - "compile-libfuzzer-introspector-x86_64": Compiling libFuzzer to /usr/lib/libFuzzingEngine.a... done.
Step #6 - "compile-libfuzzer-introspector-x86_64":
Reading package lists... 0%
Reading package lists... 0%
Reading package lists... 0%
Reading package lists... 2%
Reading package lists... 2%
Reading package lists... 4%
Reading package lists... 4%
Reading package lists... 4%
Reading package lists... 4%
Reading package lists... 4%
Reading package lists... 4%
Reading package lists... 28%
Reading package lists... 28%
Reading package lists... 41%
Reading package lists... 41%
Reading package lists... 41%
Reading package lists... 41%
Reading package lists... 42%
Reading package lists... 42%
Reading package lists... 52%
Reading package lists... 52%
Reading package lists... 55%
Reading package lists... 55%
Reading package lists... 57%
Reading package lists... 66%
Reading package lists... 66%
Reading package lists... 66%
Reading package lists... 66%
Reading package lists... 69%
Reading package lists... 69%
Reading package lists... 72%
Reading package lists... 72%
Reading package lists... 72%
Reading package lists... 72%
Reading package lists... 72%
Reading package lists... 72%
Reading package lists... 72%
Reading package lists... 72%
Reading package lists... 72%
Reading package lists... 72%
Reading package lists... 72%
Reading package lists... 72%
Reading package lists... 72%
Reading package lists... 72%
Reading package lists... 82%
Reading package lists... 82%
Reading package lists... 84%
Reading package lists... 84%
Reading package lists... 94%
Reading package lists... 94%
Reading package lists... 94%
Reading package lists... 94%
Reading package lists... 97%
Reading package lists... 97%
Reading package lists... 99%
Reading package lists... 99%
Reading package lists... 99%
Reading package lists... 99%
Reading package lists... 99%
Reading package lists... 99%
Reading package lists... Done
Step #6 - "compile-libfuzzer-introspector-x86_64":
Building dependency tree... 0%
Building dependency tree... 0%
Building dependency tree... 50%
Building dependency tree... 50%
Building dependency tree
Step #6 - "compile-libfuzzer-introspector-x86_64":
Reading state information... 0%
Reading state information... 0%
Reading state information... Done
Step #6 - "compile-libfuzzer-introspector-x86_64": The following additional packages will be installed:
Step #6 - "compile-libfuzzer-introspector-x86_64": libjpeg-turbo8 libjpeg-turbo8-dev libjpeg8 libjpeg8-dev libyaml-0-2
Step #6 - "compile-libfuzzer-introspector-x86_64": Suggested packages:
Step #6 - "compile-libfuzzer-introspector-x86_64": libyaml-doc
Step #6 - "compile-libfuzzer-introspector-x86_64": The following NEW packages will be installed:
Step #6 - "compile-libfuzzer-introspector-x86_64": libjpeg-dev libjpeg-turbo8 libjpeg-turbo8-dev libjpeg8 libjpeg8-dev
Step #6 - "compile-libfuzzer-introspector-x86_64": libyaml-0-2 libyaml-dev zlib1g-dev
Step #6 - "compile-libfuzzer-introspector-x86_64": 0 upgraded, 8 newly installed, 0 to remove and 0 not upgraded.
Step #6 - "compile-libfuzzer-introspector-x86_64": Need to get 624 kB of archives.
Step #6 - "compile-libfuzzer-introspector-x86_64": After this operation, 2657 kB of additional disk space will be used.
Step #6 - "compile-libfuzzer-introspector-x86_64":
0% [Working]
Get:1 http://archive.ubuntu.com/ubuntu focal/main amd64 libyaml-0-2 amd64 0.2.2-1 [48.9 kB]
Step #6 - "compile-libfuzzer-introspector-x86_64":
6% [1 libyaml-0-2 42.9 kB/48.9 kB 88%]
9% [Working]
Get:2 http://archive.ubuntu.com/ubuntu focal-updates/main amd64 libjpeg-turbo8 amd64 2.0.3-0ubuntu1.20.04.3 [118 kB]
Step #6 - "compile-libfuzzer-introspector-x86_64":
11% [2 libjpeg-turbo8 16.4 kB/118 kB 14%]
26% [Waiting for headers]
Get:3 http://archive.ubuntu.com/ubuntu focal-updates/main amd64 libjpeg-turbo8-dev amd64 2.0.3-0ubuntu1.20.04.3 [238 kB]
Step #6 - "compile-libfuzzer-introspector-x86_64":
28% [3 libjpeg-turbo8-dev 14.2 kB/238 kB 6%]
59% [Waiting for headers]
Get:4 http://archive.ubuntu.com/ubuntu focal/main amd64 libjpeg8 amd64 8c-2ubuntu8 [2194 B]
Step #6 - "compile-libfuzzer-introspector-x86_64":
60% [4 libjpeg8 2194 B/2194 B 100%]
62% [Waiting for headers]
Get:5 http://archive.ubuntu.com/ubuntu focal/main amd64 libjpeg8-dev amd64 8c-2ubuntu8 [1552 B]
Step #6 - "compile-libfuzzer-introspector-x86_64":
62% [5 libjpeg8-dev 1552 B/1552 B 100%]
65% [Waiting for headers]
Get:6 http://archive.ubuntu.com/ubuntu focal/main amd64 libjpeg-dev amd64 8c-2ubuntu8 [1546 B]
Step #6 - "compile-libfuzzer-introspector-x86_64":
65% [6 libjpeg-dev 1546 B/1546 B 100%]
68% [Waiting for headers]
Get:7 http://archive.ubuntu.com/ubuntu focal-updates/main amd64 zlib1g-dev amd64 1:1.2.11.dfsg-2ubuntu1.5 [155 kB]
Step #6 - "compile-libfuzzer-introspector-x86_64":
71% [7 zlib1g-dev 24.6 kB/155 kB 16%]
90% [Waiting for headers]
Get:8 http://archive.ubuntu.com/ubuntu focal/main amd64 libyaml-dev amd64 0.2.2-1 [58.2 kB]
Step #6 - "compile-libfuzzer-introspector-x86_64":
90% [8 libyaml-dev 0 B/58.2 kB 0%]
100% [Working]
Fetched 624 kB in 0s (4796 kB/s)
Step #6 - "compile-libfuzzer-introspector-x86_64": debconf: delaying package configuration, since apt-utils is not installed
Step #6 - "compile-libfuzzer-introspector-x86_64": Selecting previously unselected package libyaml-0-2:amd64.
Step #6 - "compile-libfuzzer-introspector-x86_64": (Reading database ...
(Reading database ... 5%
(Reading database ... 10%
(Reading database ... 15%
(Reading database ... 20%
(Reading database ... 25%
(Reading database ... 30%
(Reading database ... 35%
(Reading database ... 40%
(Reading database ... 45%
(Reading database ... 50%
(Reading database ... 55%
(Reading database ... 60%
(Reading database ... 65%
(Reading database ... 70%
(Reading database ... 75%
(Reading database ... 80%
(Reading database ... 85%
(Reading database ... 90%
(Reading database ... 95%
(Reading database ... 100%
(Reading database ... 18398 files and directories currently installed.)
Step #6 - "compile-libfuzzer-introspector-x86_64": Preparing to unpack .../0-libyaml-0-2_0.2.2-1_amd64.deb ...
Step #6 - "compile-libfuzzer-introspector-x86_64": Unpacking libyaml-0-2:amd64 (0.2.2-1) ...
Step #6 - "compile-libfuzzer-introspector-x86_64": Selecting previously unselected package libjpeg-turbo8:amd64.
Step #6 - "compile-libfuzzer-introspector-x86_64": Preparing to unpack .../1-libjpeg-turbo8_2.0.3-0ubuntu1.20.04.3_amd64.deb ...
Step #6 - "compile-libfuzzer-introspector-x86_64": Unpacking libjpeg-turbo8:amd64 (2.0.3-0ubuntu1.20.04.3) ...
Step #6 - "compile-libfuzzer-introspector-x86_64": Selecting previously unselected package libjpeg-turbo8-dev:amd64.
Step #6 - "compile-libfuzzer-introspector-x86_64": Preparing to unpack .../2-libjpeg-turbo8-dev_2.0.3-0ubuntu1.20.04.3_amd64.deb ...
Step #6 - "compile-libfuzzer-introspector-x86_64": Unpacking libjpeg-turbo8-dev:amd64 (2.0.3-0ubuntu1.20.04.3) ...
Step #6 - "compile-libfuzzer-introspector-x86_64": Selecting previously unselected package libjpeg8:amd64.
Step #6 - "compile-libfuzzer-introspector-x86_64": Preparing to unpack .../3-libjpeg8_8c-2ubuntu8_amd64.deb ...
Step #6 - "compile-libfuzzer-introspector-x86_64": Unpacking libjpeg8:amd64 (8c-2ubuntu8) ...
Step #6 - "compile-libfuzzer-introspector-x86_64": Selecting previously unselected package libjpeg8-dev:amd64.
Step #6 - "compile-libfuzzer-introspector-x86_64": Preparing to unpack .../4-libjpeg8-dev_8c-2ubuntu8_amd64.deb ...
Step #6 - "compile-libfuzzer-introspector-x86_64": Unpacking libjpeg8-dev:amd64 (8c-2ubuntu8) ...
Step #6 - "compile-libfuzzer-introspector-x86_64": Selecting previously unselected package libjpeg-dev:amd64.
Step #6 - "compile-libfuzzer-introspector-x86_64": Preparing to unpack .../5-libjpeg-dev_8c-2ubuntu8_amd64.deb ...
Step #6 - "compile-libfuzzer-introspector-x86_64": Unpacking libjpeg-dev:amd64 (8c-2ubuntu8) ...
Step #6 - "compile-libfuzzer-introspector-x86_64": Selecting previously unselected package zlib1g-dev:amd64.
Step #6 - "compile-libfuzzer-introspector-x86_64": Preparing to unpack .../6-zlib1g-dev_1%3a1.2.11.dfsg-2ubuntu1.5_amd64.deb ...
Step #6 - "compile-libfuzzer-introspector-x86_64": Unpacking zlib1g-dev:amd64 (1:1.2.11.dfsg-2ubuntu1.5) ...
Step #6 - "compile-libfuzzer-introspector-x86_64": Selecting previously unselected package libyaml-dev:amd64.
Step #6 - "compile-libfuzzer-introspector-x86_64": Preparing to unpack .../7-libyaml-dev_0.2.2-1_amd64.deb ...
Step #6 - "compile-libfuzzer-introspector-x86_64": Unpacking libyaml-dev:amd64 (0.2.2-1) ...
Step #6 - "compile-libfuzzer-introspector-x86_64": Setting up libyaml-0-2:amd64 (0.2.2-1) ...
Step #6 - "compile-libfuzzer-introspector-x86_64": Setting up libjpeg-turbo8:amd64 (2.0.3-0ubuntu1.20.04.3) ...
Step #6 - "compile-libfuzzer-introspector-x86_64": Setting up zlib1g-dev:amd64 (1:1.2.11.dfsg-2ubuntu1.5) ...
Step #6 - "compile-libfuzzer-introspector-x86_64": Setting up libjpeg8:amd64 (8c-2ubuntu8) ...
Step #6 - "compile-libfuzzer-introspector-x86_64": Setting up libjpeg-turbo8-dev:amd64 (2.0.3-0ubuntu1.20.04.3) ...
Step #6 - "compile-libfuzzer-introspector-x86_64": Setting up libyaml-dev:amd64 (0.2.2-1) ...
Step #6 - "compile-libfuzzer-introspector-x86_64": Setting up libjpeg8-dev:amd64 (8c-2ubuntu8) ...
Step #6 - "compile-libfuzzer-introspector-x86_64": Setting up libjpeg-dev:amd64 (8c-2ubuntu8) ...
Step #6 - "compile-libfuzzer-introspector-x86_64": Processing triggers for libc-bin (2.31-0ubuntu9.18) ...
Step #6 - "compile-libfuzzer-introspector-x86_64": Requirement already satisfied: pip in /usr/local/lib/python3.11/site-packages (26.1.2)
Step #6 - "compile-libfuzzer-introspector-x86_64": Requirement already satisfied: setuptools in /usr/local/lib/python3.11/site-packages (65.5.0)
Step #6 - "compile-libfuzzer-introspector-x86_64": Collecting setuptools
Step #6 - "compile-libfuzzer-introspector-x86_64": Downloading setuptools-83.0.0-py3-none-any.whl.metadata (6.6 kB)
Step #6 - "compile-libfuzzer-introspector-x86_64": Downloading setuptools-83.0.0-py3-none-any.whl (1.0 MB)
Step #6 - "compile-libfuzzer-introspector-x86_64": [?25l [90m━━━━━━━━━━━━━━━━━━━━━━━━━━━━━━━━━━━━━━━━[0m [32m0.0/1.0 MB[0m [31m?[0m eta [36m-:--:--[0m
[2K [90m━━━━━━━━━━━━━━━━━━━━━━━━━━━━━━━━━━━━━━━━[0m [32m1.0/1.0 MB[0m [31m29.6 MB/s[0m [33m0:00:00[0m
Step #6 - "compile-libfuzzer-introspector-x86_64": [?25hInstalling collected packages: setuptools
Step #6 - "compile-libfuzzer-introspector-x86_64": Attempting uninstall: setuptools
Step #6 - "compile-libfuzzer-introspector-x86_64": Found existing installation: setuptools 65.5.0
Step #6 - "compile-libfuzzer-introspector-x86_64": Uninstalling setuptools-65.5.0:
Step #6 - "compile-libfuzzer-introspector-x86_64": Successfully uninstalled setuptools-65.5.0
Step #6 - "compile-libfuzzer-introspector-x86_64": Successfully installed setuptools-83.0.0
Step #6 - "compile-libfuzzer-introspector-x86_64": [33mWARNING: Running pip as the 'root' user can result in broken permissions and conflicting behaviour with the system package manager, possibly rendering your system unusable. It is recommended to use a virtual environment instead: https://pip.pypa.io/warnings/venv. Use the --root-user-action option if you know what you are doing and want to suppress this warning.[0m[33m
Step #6 - "compile-libfuzzer-introspector-x86_64": [0mCollecting cxxfilt
Step #6 - "compile-libfuzzer-introspector-x86_64": Downloading cxxfilt-0.3.0-py2.py3-none-any.whl.metadata (3.5 kB)
Step #6 - "compile-libfuzzer-introspector-x86_64": Collecting pyyaml
Step #6 - "compile-libfuzzer-introspector-x86_64": Downloading pyyaml-6.0.3-cp311-cp311-manylinux2014_x86_64.manylinux_2_17_x86_64.manylinux_2_28_x86_64.whl.metadata (2.4 kB)
Step #6 - "compile-libfuzzer-introspector-x86_64": Collecting beautifulsoup4
Step #6 - "compile-libfuzzer-introspector-x86_64": Downloading beautifulsoup4-4.15.0-py3-none-any.whl.metadata (3.8 kB)
Step #6 - "compile-libfuzzer-introspector-x86_64": Collecting lxml
Step #6 - "compile-libfuzzer-introspector-x86_64": Downloading lxml-6.1.1-cp311-cp311-manylinux_2_26_x86_64.manylinux_2_28_x86_64.whl.metadata (3.5 kB)
Step #6 - "compile-libfuzzer-introspector-x86_64": Collecting soupsieve
Step #6 - "compile-libfuzzer-introspector-x86_64": Downloading soupsieve-2.8.4-py3-none-any.whl.metadata (4.6 kB)
Step #6 - "compile-libfuzzer-introspector-x86_64": Collecting rust-demangler
Step #6 - "compile-libfuzzer-introspector-x86_64": Downloading rust_demangler-1.0-py3-none-any.whl.metadata (866 bytes)
Step #6 - "compile-libfuzzer-introspector-x86_64": Collecting typing-extensions>=4.0.0 (from beautifulsoup4)
Step #6 - "compile-libfuzzer-introspector-x86_64": Downloading typing_extensions-4.16.0-py3-none-any.whl.metadata (3.3 kB)
Step #6 - "compile-libfuzzer-introspector-x86_64": Downloading cxxfilt-0.3.0-py2.py3-none-any.whl (4.6 kB)
Step #6 - "compile-libfuzzer-introspector-x86_64": Downloading pyyaml-6.0.3-cp311-cp311-manylinux2014_x86_64.manylinux_2_17_x86_64.manylinux_2_28_x86_64.whl (806 kB)
Step #6 - "compile-libfuzzer-introspector-x86_64": [?25l [90m━━━━━━━━━━━━━━━━━━━━━━━━━━━━━━━━━━━━━━━━[0m [32m0.0/806.6 kB[0m [31m?[0m eta [36m-:--:--[0m
[2K [90m━━━━━━━━━━━━━━━━━━━━━━━━━━━━━━━━━━━━━━━━[0m [32m806.6/806.6 kB[0m [31m19.1 MB/s[0m [33m0:00:00[0m
Step #6 - "compile-libfuzzer-introspector-x86_64": [?25hDownloading beautifulsoup4-4.15.0-py3-none-any.whl (109 kB)
Step #6 - "compile-libfuzzer-introspector-x86_64": Downloading lxml-6.1.1-cp311-cp311-manylinux_2_26_x86_64.manylinux_2_28_x86_64.whl (5.2 MB)
Step #6 - "compile-libfuzzer-introspector-x86_64": [?25l [90m━━━━━━━━━━━━━━━━━━━━━━━━━━━━━━━━━━━━━━━━[0m [32m0.0/5.2 MB[0m [31m?[0m eta [36m-:--:--[0m
[2K [90m━━━━━━━━━━━━━━━━━━━━━━━━━━━━━━━━━━━━━━━━[0m [32m5.2/5.2 MB[0m [31m102.2 MB/s[0m [33m0:00:00[0m
Step #6 - "compile-libfuzzer-introspector-x86_64": [?25hDownloading soupsieve-2.8.4-py3-none-any.whl (37 kB)
Step #6 - "compile-libfuzzer-introspector-x86_64": Downloading rust_demangler-1.0-py3-none-any.whl (8.3 kB)
Step #6 - "compile-libfuzzer-introspector-x86_64": Downloading typing_extensions-4.16.0-py3-none-any.whl (45 kB)
Step #6 - "compile-libfuzzer-introspector-x86_64": Installing collected packages: rust-demangler, cxxfilt, typing-extensions, soupsieve, pyyaml, lxml, beautifulsoup4
Step #6 - "compile-libfuzzer-introspector-x86_64": [?25l
[2K [91m━━━━━━━━━━━━━━━━━━━━━━━━━━━━[0m[91m╸[0m[90m━━━━━━━━━━━[0m [32m5/7[0m [lxml]
[2K [91m━━━━━━━━━━━━━━━━━━━━━━━━━━━━━━━━━━[0m[90m╺[0m[90m━━━━━[0m [32m6/7[0m [beautifulsoup4]
[2K [90m━━━━━━━━━━━━━━━━━━━━━━━━━━━━━━━━━━━━━━━━[0m [32m7/7[0m [beautifulsoup4]
Step #6 - "compile-libfuzzer-introspector-x86_64": [?25h
[1A[2KSuccessfully installed beautifulsoup4-4.15.0 cxxfilt-0.3.0 lxml-6.1.1 pyyaml-6.0.3 rust-demangler-1.0 soupsieve-2.8.4 typing-extensions-4.16.0
Step #6 - "compile-libfuzzer-introspector-x86_64": [33mWARNING: Running pip as the 'root' user can result in broken permissions and conflicting behaviour with the system package manager, possibly rendering your system unusable. It is recommended to use a virtual environment instead: https://pip.pypa.io/warnings/venv. Use the --root-user-action option if you know what you are doing and want to suppress this warning.[0m[33m
Step #6 - "compile-libfuzzer-introspector-x86_64": [0mCollecting matplotlib
Step #6 - "compile-libfuzzer-introspector-x86_64": Downloading matplotlib-3.11.0-cp311-cp311-manylinux2014_x86_64.manylinux_2_17_x86_64.whl.metadata (80 kB)
Step #6 - "compile-libfuzzer-introspector-x86_64": Collecting contourpy>=1.0.1 (from matplotlib)
Step #6 - "compile-libfuzzer-introspector-x86_64": Downloading contourpy-1.3.3-cp311-cp311-manylinux_2_27_x86_64.manylinux_2_28_x86_64.whl.metadata (5.5 kB)
Step #6 - "compile-libfuzzer-introspector-x86_64": Collecting cycler>=0.10 (from matplotlib)
Step #6 - "compile-libfuzzer-introspector-x86_64": Downloading cycler-0.12.1-py3-none-any.whl.metadata (3.8 kB)
Step #6 - "compile-libfuzzer-introspector-x86_64": Collecting fonttools>=4.22.0 (from matplotlib)
Step #6 - "compile-libfuzzer-introspector-x86_64": Downloading fonttools-4.63.0-cp311-cp311-manylinux2014_x86_64.manylinux_2_17_x86_64.whl.metadata (118 kB)
Step #6 - "compile-libfuzzer-introspector-x86_64": Collecting kiwisolver>=1.3.1 (from matplotlib)
Step #6 - "compile-libfuzzer-introspector-x86_64": Downloading kiwisolver-1.5.0-cp311-cp311-manylinux2014_x86_64.manylinux_2_17_x86_64.whl.metadata (5.1 kB)
Step #6 - "compile-libfuzzer-introspector-x86_64": Collecting numpy>=1.25 (from matplotlib)
Step #6 - "compile-libfuzzer-introspector-x86_64": Downloading numpy-2.4.6-cp311-cp311-manylinux_2_27_x86_64.manylinux_2_28_x86_64.whl.metadata (6.6 kB)
Step #6 - "compile-libfuzzer-introspector-x86_64": Collecting packaging>=20.0 (from matplotlib)
Step #6 - "compile-libfuzzer-introspector-x86_64": Downloading packaging-26.2-py3-none-any.whl.metadata (3.5 kB)
Step #6 - "compile-libfuzzer-introspector-x86_64": Collecting pillow>=9 (from matplotlib)
Step #6 - "compile-libfuzzer-introspector-x86_64": Downloading pillow-12.3.0-cp311-cp311-manylinux_2_27_x86_64.manylinux_2_28_x86_64.whl.metadata (9.1 kB)
Step #6 - "compile-libfuzzer-introspector-x86_64": Collecting pyparsing>=3 (from matplotlib)
Step #6 - "compile-libfuzzer-introspector-x86_64": Downloading pyparsing-3.3.2-py3-none-any.whl.metadata (5.8 kB)
Step #6 - "compile-libfuzzer-introspector-x86_64": Collecting python-dateutil>=2.7 (from matplotlib)
Step #6 - "compile-libfuzzer-introspector-x86_64": Downloading python_dateutil-2.9.0.post0-py2.py3-none-any.whl.metadata (8.4 kB)
Step #6 - "compile-libfuzzer-introspector-x86_64": Requirement already satisfied: six>=1.5 in /usr/local/lib/python3.11/site-packages (from python-dateutil>=2.7->matplotlib) (1.15.0)
Step #6 - "compile-libfuzzer-introspector-x86_64": Downloading matplotlib-3.11.0-cp311-cp311-manylinux2014_x86_64.manylinux_2_17_x86_64.whl (10.0 MB)
Step #6 - "compile-libfuzzer-introspector-x86_64": [?25l [90m━━━━━━━━━━━━━━━━━━━━━━━━━━━━━━━━━━━━━━━━[0m [32m0.0/10.0 MB[0m [31m?[0m eta [36m-:--:--[0m
[2K [90m━━━━━━━━━━━━━━━━━━━━━━━━━━━━━━━━━━━━━━━━[0m [32m10.0/10.0 MB[0m [31m112.5 MB/s[0m [33m0:00:00[0m
Step #6 - "compile-libfuzzer-introspector-x86_64": [?25hDownloading contourpy-1.3.3-cp311-cp311-manylinux_2_27_x86_64.manylinux_2_28_x86_64.whl (355 kB)
Step #6 - "compile-libfuzzer-introspector-x86_64": Downloading cycler-0.12.1-py3-none-any.whl (8.3 kB)
Step #6 - "compile-libfuzzer-introspector-x86_64": Downloading fonttools-4.63.0-cp311-cp311-manylinux2014_x86_64.manylinux_2_17_x86_64.whl (5.1 MB)
Step #6 - "compile-libfuzzer-introspector-x86_64": [?25l [90m━━━━━━━━━━━━━━━━━━━━━━━━━━━━━━━━━━━━━━━━[0m [32m0.0/5.1 MB[0m [31m?[0m eta [36m-:--:--[0m
[2K [90m━━━━━━━━━━━━━━━━━━━━━━━━━━━━━━━━━━━━━━━━[0m [32m5.1/5.1 MB[0m [31m107.8 MB/s[0m [33m0:00:00[0m
Step #6 - "compile-libfuzzer-introspector-x86_64": [?25hDownloading kiwisolver-1.5.0-cp311-cp311-manylinux2014_x86_64.manylinux_2_17_x86_64.whl (1.4 MB)
Step #6 - "compile-libfuzzer-introspector-x86_64": [?25l [90m━━━━━━━━━━━━━━━━━━━━━━━━━━━━━━━━━━━━━━━━[0m [32m0.0/1.4 MB[0m [31m?[0m eta [36m-:--:--[0m
[2K [90m━━━━━━━━━━━━━━━━━━━━━━━━━━━━━━━━━━━━━━━━[0m [32m1.4/1.4 MB[0m [31m90.2 MB/s[0m [33m0:00:00[0m
Step #6 - "compile-libfuzzer-introspector-x86_64": [?25hDownloading numpy-2.4.6-cp311-cp311-manylinux_2_27_x86_64.manylinux_2_28_x86_64.whl (16.9 MB)
Step #6 - "compile-libfuzzer-introspector-x86_64": [?25l [90m━━━━━━━━━━━━━━━━━━━━━━━━━━━━━━━━━━━━━━━━[0m [32m0.0/16.9 MB[0m [31m?[0m eta [36m-:--:--[0m
[2K [90m━━━━━━━━━━━━━━━━━━━━━━━━━━━━━━━━━━━━━━━━[0m [32m16.9/16.9 MB[0m [31m133.8 MB/s[0m [33m0:00:00[0m
Step #6 - "compile-libfuzzer-introspector-x86_64": [?25hDownloading packaging-26.2-py3-none-any.whl (100 kB)
Step #6 - "compile-libfuzzer-introspector-x86_64": Downloading pillow-12.3.0-cp311-cp311-manylinux_2_27_x86_64.manylinux_2_28_x86_64.whl (6.9 MB)
Step #6 - "compile-libfuzzer-introspector-x86_64": [?25l [90m━━━━━━━━━━━━━━━━━━━━━━━━━━━━━━━━━━━━━━━━[0m [32m0.0/6.9 MB[0m [31m?[0m eta [36m-:--:--[0m
[2K [90m━━━━━━━━━━━━━━━━━━━━━━━━━━━━━━━━━━━━━━━━[0m [32m6.9/6.9 MB[0m [31m142.4 MB/s[0m [33m0:00:00[0m
Step #6 - "compile-libfuzzer-introspector-x86_64": [?25hDownloading pyparsing-3.3.2-py3-none-any.whl (122 kB)
Step #6 - "compile-libfuzzer-introspector-x86_64": Downloading python_dateutil-2.9.0.post0-py2.py3-none-any.whl (229 kB)
Step #6 - "compile-libfuzzer-introspector-x86_64": Installing collected packages: python-dateutil, pyparsing, pillow, packaging, numpy, kiwisolver, fonttools, cycler, contourpy, matplotlib
Step #6 - "compile-libfuzzer-introspector-x86_64": [?25l
[2K [91m━━━━━━━━[0m[90m╺[0m[90m━━━━━━━━━━━━━━━━━━━━━━━━━━━━━━━[0m [32m 2/10[0m [pillow]
[2K [91m━━━━━━━━[0m[90m╺[0m[90m━━━━━━━━━━━━━━━━━━━━━━━━━━━━━━━[0m [32m 2/10[0m [pillow]
[2K [91m━━━━━━━━━━━━[0m[90m╺[0m[90m━━━━━━━━━━━━━━━━━━━━━━━━━━━[0m [32m 3/10[0m [packaging]
[2K [91m━━━━━━━━━━━━━━━━[0m[90m╺[0m[90m━━━━━━━━━━━━━━━━━━━━━━━[0m [32m 4/10[0m [numpy]
[2K [91m━━━━━━━━━━━━━━━━[0m[90m╺[0m[90m━━━━━━━━━━━━━━━━━━━━━━━[0m [32m 4/10[0m [numpy]
[2K [91m━━━━━━━━━━━━━━━━[0m[90m╺[0m[90m━━━━━━━━━━━━━━━━━━━━━━━[0m [32m 4/10[0m [numpy]
[2K [91m━━━━━━━━━━━━━━━━[0m[90m╺[0m[90m━━━━━━━━━━━━━━━━━━━━━━━[0m [32m 4/10[0m [numpy]
[2K [91m━━━━━━━━━━━━━━━━[0m[90m╺[0m[90m━━━━━━━━━━━━━━━━━━━━━━━[0m [32m 4/10[0m [numpy]
[2K [91m━━━━━━━━━━━━━━━━[0m[90m╺[0m[90m━━━━━━━━━━━━━━━━━━━━━━━[0m [32m 4/10[0m [numpy]
[2K [91m━━━━━━━━━━━━━━━━[0m[90m╺[0m[90m━━━━━━━━━━━━━━━━━━━━━━━[0m [32m 4/10[0m [numpy]
[2K [91m━━━━━━━━━━━━━━━━[0m[90m╺[0m[90m━━━━━━━━━━━━━━━━━━━━━━━[0m [32m 4/10[0m [numpy]
[2K [91m━━━━━━━━━━━━━━━━[0m[90m╺[0m[90m━━━━━━━━━━━━━━━━━━━━━━━[0m [32m 4/10[0m [numpy]
[2K [91m━━━━━━━━━━━━━━━━[0m[90m╺[0m[90m━━━━━━━━━━━━━━━━━━━━━━━[0m [32m 4/10[0m [numpy]
[2K [91m━━━━━━━━━━━━━━━━[0m[90m╺[0m[90m━━━━━━━━━━━━━━━━━━━━━━━[0m [32m 4/10[0m [numpy]
[2K [91m━━━━━━━━━━━━━━━━━━━━━━━━[0m[90m╺[0m[90m━━━━━━━━━━━━━━━[0m [32m 6/10[0m [fonttools]
[2K [91m━━━━━━━━━━━━━━━━━━━━━━━━[0m[90m╺[0m[90m━━━━━━━━━━━━━━━[0m [32m 6/10[0m [fonttools]
[2K [91m━━━━━━━━━━━━━━━━━━━━━━━━[0m[90m╺[0m[90m━━━━━━━━━━━━━━━[0m [32m 6/10[0m [fonttools]
[2K [91m━━━━━━━━━━━━━━━━━━━━━━━━[0m[90m╺[0m[90m━━━━━━━━━━━━━━━[0m [32m 6/10[0m [fonttools]
[2K [91m━━━━━━━━━━━━━━━━━━━━━━━━[0m[90m╺[0m[90m━━━━━━━━━━━━━━━[0m [32m 6/10[0m [fonttools]
[2K [91m━━━━━━━━━━━━━━━━━━━━━━━━━━━━━━━━━━━━[0m[90m╺[0m[90m━━━[0m [32m 9/10[0m [matplotlib]
[2K [91m━━━━━━━━━━━━━━━━━━━━━━━━━━━━━━━━━━━━[0m[90m╺[0m[90m━━━[0m [32m 9/10[0m [matplotlib]
[2K [91m━━━━━━━━━━━━━━━━━━━━━━━━━━━━━━━━━━━━[0m[90m╺[0m[90m━━━[0m [32m 9/10[0m [matplotlib]
[2K [91m━━━━━━━━━━━━━━━━━━━━━━━━━━━━━━━━━━━━[0m[90m╺[0m[90m━━━[0m [32m 9/10[0m [matplotlib]
[2K [91m━━━━━━━━━━━━━━━━━━━━━━━━━━━━━━━━━━━━[0m[90m╺[0m[90m━━━[0m [32m 9/10[0m [matplotlib]
[2K [91m━━━━━━━━━━━━━━━━━━━━━━━━━━━━━━━━━━━━[0m[90m╺[0m[90m━━━[0m [32m 9/10[0m [matplotlib]
[2K [91m━━━━━━━━━━━━━━━━━━━━━━━━━━━━━━━━━━━━[0m[90m╺[0m[90m━━━[0m [32m 9/10[0m [matplotlib]
[2K [91m━━━━━━━━━━━━━━━━━━━━━━━━━━━━━━━━━━━━[0m[90m╺[0m[90m━━━[0m [32m 9/10[0m [matplotlib]
[2K [91m━━━━━━━━━━━━━━━━━━━━━━━━━━━━━━━━━━━━[0m[90m╺[0m[90m━━━[0m [32m 9/10[0m [matplotlib]
[2K [90m━━━━━━━━━━━━━━━━━━━━━━━━━━━━━━━━━━━━━━━━[0m [32m10/10[0m [matplotlib]
Step #6 - "compile-libfuzzer-introspector-x86_64": [?25h
[1A[2KSuccessfully installed contourpy-1.3.3 cycler-0.12.1 fonttools-4.63.0 kiwisolver-1.5.0 matplotlib-3.11.0 numpy-2.4.6 packaging-26.2 pillow-12.3.0 pyparsing-3.3.2 python-dateutil-2.9.0.post0
Step #6 - "compile-libfuzzer-introspector-x86_64": [33mWARNING: Running pip as the 'root' user can result in broken permissions and conflicting behaviour with the system package manager, possibly rendering your system unusable. It is recommended to use a virtual environment instead: https://pip.pypa.io/warnings/venv. Use the --root-user-action option if you know what you are doing and want to suppress this warning.[0m[33m
Step #6 - "compile-libfuzzer-introspector-x86_64": [0m/fuzz-introspector/src /src
Step #6 - "compile-libfuzzer-introspector-x86_64": Obtaining file:///fuzz-introspector/src
Step #6 - "compile-libfuzzer-introspector-x86_64": Installing build dependencies ... [?25l- \ | done
Step #6 - "compile-libfuzzer-introspector-x86_64": [?25h Checking if build backend supports build_editable ... [?25ldone
Step #6 - "compile-libfuzzer-introspector-x86_64": [?25h Getting requirements to build editable ... [?25l- done
Step #6 - "compile-libfuzzer-introspector-x86_64": [?25h Preparing editable metadata (pyproject.toml) ... [?25l- done
Step #6 - "compile-libfuzzer-introspector-x86_64": [?25hCollecting beautifulsoup4==4.10.0 (from fuzz-introspector==0.1.10)
Step #6 - "compile-libfuzzer-introspector-x86_64": Downloading beautifulsoup4-4.10.0-py3-none-any.whl.metadata (3.5 kB)
Step #6 - "compile-libfuzzer-introspector-x86_64": Requirement already satisfied: cxxfilt==0.3.0 in /usr/local/lib/python3.11/site-packages (from fuzz-introspector==0.1.10) (0.3.0)
Step #6 - "compile-libfuzzer-introspector-x86_64": Collecting lxml==5.3.0 (from fuzz-introspector==0.1.10)
Step #6 - "compile-libfuzzer-introspector-x86_64": Downloading lxml-5.3.0-cp311-cp311-manylinux_2_28_x86_64.whl.metadata (3.8 kB)
Step #6 - "compile-libfuzzer-introspector-x86_64": Collecting matplotlib==3.10.0 (from fuzz-introspector==0.1.10)
Step #6 - "compile-libfuzzer-introspector-x86_64": Downloading matplotlib-3.10.0-cp311-cp311-manylinux_2_17_x86_64.manylinux2014_x86_64.whl.metadata (11 kB)
Step #6 - "compile-libfuzzer-introspector-x86_64": Collecting PyYAML==6.0.2 (from fuzz-introspector==0.1.10)
Step #6 - "compile-libfuzzer-introspector-x86_64": Downloading PyYAML-6.0.2-cp311-cp311-manylinux_2_17_x86_64.manylinux2014_x86_64.whl.metadata (2.1 kB)
Step #6 - "compile-libfuzzer-introspector-x86_64": Collecting soupsieve==2.2.1 (from fuzz-introspector==0.1.10)
Step #6 - "compile-libfuzzer-introspector-x86_64": Downloading soupsieve-2.2.1-py3-none-any.whl.metadata (5.5 kB)
Step #6 - "compile-libfuzzer-introspector-x86_64": Collecting yapf==0.40.1 (from fuzz-introspector==0.1.10)
Step #6 - "compile-libfuzzer-introspector-x86_64": Downloading yapf-0.40.1-py3-none-any.whl.metadata (35 kB)
Step #6 - "compile-libfuzzer-introspector-x86_64": Collecting flake8 (from fuzz-introspector==0.1.10)
Step #6 - "compile-libfuzzer-introspector-x86_64": Downloading flake8-7.3.0-py2.py3-none-any.whl.metadata (3.8 kB)
Step #6 - "compile-libfuzzer-introspector-x86_64": Collecting pep8 (from fuzz-introspector==0.1.10)
Step #6 - "compile-libfuzzer-introspector-x86_64": Downloading pep8-1.7.1-py2.py3-none-any.whl.metadata (22 kB)
Step #6 - "compile-libfuzzer-introspector-x86_64": Collecting mypy (from fuzz-introspector==0.1.10)
Step #6 - "compile-libfuzzer-introspector-x86_64": Downloading mypy-2.1.0-cp311-cp311-manylinux2014_x86_64.manylinux_2_17_x86_64.manylinux_2_28_x86_64.whl.metadata (2.3 kB)
Step #6 - "compile-libfuzzer-introspector-x86_64": Collecting psutil (from fuzz-introspector==0.1.10)
Step #6 - "compile-libfuzzer-introspector-x86_64": Downloading psutil-7.2.2-cp36-abi3-manylinux2010_x86_64.manylinux_2_12_x86_64.manylinux_2_28_x86_64.whl.metadata (22 kB)
Step #6 - "compile-libfuzzer-introspector-x86_64": Collecting toml (from fuzz-introspector==0.1.10)
Step #6 - "compile-libfuzzer-introspector-x86_64": Downloading toml-0.10.2-py2.py3-none-any.whl.metadata (7.1 kB)
Step #6 - "compile-libfuzzer-introspector-x86_64": Collecting pytest (from fuzz-introspector==0.1.10)
Step #6 - "compile-libfuzzer-introspector-x86_64": Downloading pytest-9.1.1-py3-none-any.whl.metadata (7.6 kB)
Step #6 - "compile-libfuzzer-introspector-x86_64": Collecting sphinx==6.0.0 (from fuzz-introspector==0.1.10)
Step #6 - "compile-libfuzzer-introspector-x86_64": Downloading sphinx-6.0.0-py3-none-any.whl.metadata (6.2 kB)
Step #6 - "compile-libfuzzer-introspector-x86_64": Collecting sphinx_rtd_theme (from fuzz-introspector==0.1.10)
Step #6 - "compile-libfuzzer-introspector-x86_64": Downloading sphinx_rtd_theme-3.1.0-py2.py3-none-any.whl.metadata (4.5 kB)
Step #6 - "compile-libfuzzer-introspector-x86_64": Collecting configparser (from fuzz-introspector==0.1.10)
Step #6 - "compile-libfuzzer-introspector-x86_64": Downloading configparser-7.2.0-py3-none-any.whl.metadata (5.5 kB)
Step #6 - "compile-libfuzzer-introspector-x86_64": Collecting coverage (from fuzz-introspector==0.1.10)
Step #6 - "compile-libfuzzer-introspector-x86_64": Downloading coverage-7.15.0-cp311-cp311-manylinux1_x86_64.manylinux_2_28_x86_64.manylinux_2_5_x86_64.whl.metadata (8.6 kB)
Step #6 - "compile-libfuzzer-introspector-x86_64": Requirement already satisfied: setuptools>=65.5.1 in /usr/local/lib/python3.11/site-packages (from fuzz-introspector==0.1.10) (83.0.0)
Step #6 - "compile-libfuzzer-introspector-x86_64": Collecting tqdm (from fuzz-introspector==0.1.10)
Step #6 - "compile-libfuzzer-introspector-x86_64": Downloading tqdm-4.68.3-py3-none-any.whl.metadata (57 kB)
Step #6 - "compile-libfuzzer-introspector-x86_64": Requirement already satisfied: rust-demangler in /usr/local/lib/python3.11/site-packages (from fuzz-introspector==0.1.10) (1.0)
Step #6 - "compile-libfuzzer-introspector-x86_64": Collecting numpy==2.1.0 (from fuzz-introspector==0.1.10)
Step #6 - "compile-libfuzzer-introspector-x86_64": Downloading numpy-2.1.0-cp311-cp311-manylinux_2_17_x86_64.manylinux2014_x86_64.whl.metadata (60 kB)
Step #6 - "compile-libfuzzer-introspector-x86_64": Collecting tree-sitter==0.23.2 (from fuzz-introspector==0.1.10)
Step #6 - "compile-libfuzzer-introspector-x86_64": Downloading tree_sitter-0.23.2-cp311-cp311-manylinux_2_17_x86_64.manylinux2014_x86_64.whl.metadata (9.8 kB)
Step #6 - "compile-libfuzzer-introspector-x86_64": Collecting tree-sitter-python==0.23.6 (from fuzz-introspector==0.1.10)
Step #6 - "compile-libfuzzer-introspector-x86_64": Downloading tree_sitter_python-0.23.6-cp39-abi3-manylinux_2_5_x86_64.manylinux1_x86_64.manylinux_2_17_x86_64.manylinux2014_x86_64.whl.metadata (1.9 kB)
Step #6 - "compile-libfuzzer-introspector-x86_64": Collecting networkx (from fuzz-introspector==0.1.10)
Step #6 - "compile-libfuzzer-introspector-x86_64": Downloading networkx-3.6.1-py3-none-any.whl.metadata (6.8 kB)
Step #6 - "compile-libfuzzer-introspector-x86_64": Collecting tree-sitter-languages==1.10.2 (from fuzz-introspector==0.1.10)
Step #6 - "compile-libfuzzer-introspector-x86_64": Downloading tree_sitter_languages-1.10.2-cp311-cp311-manylinux_2_17_x86_64.manylinux2014_x86_64.whl.metadata (10 kB)
Step #6 - "compile-libfuzzer-introspector-x86_64": Collecting tree-sitter-cpp==0.23.4 (from fuzz-introspector==0.1.10)
Step #6 - "compile-libfuzzer-introspector-x86_64": Downloading tree_sitter_cpp-0.23.4-cp39-abi3-manylinux_2_17_x86_64.manylinux2014_x86_64.whl.metadata (1.8 kB)
Step #6 - "compile-libfuzzer-introspector-x86_64": Collecting tree-sitter-go==0.23.4 (from fuzz-introspector==0.1.10)
Step #6 - "compile-libfuzzer-introspector-x86_64": Downloading tree_sitter_go-0.23.4-cp39-abi3-manylinux_2_5_x86_64.manylinux1_x86_64.manylinux_2_17_x86_64.manylinux2014_x86_64.whl.metadata (1.7 kB)
Step #6 - "compile-libfuzzer-introspector-x86_64": Collecting tree-sitter-java==0.23.5 (from fuzz-introspector==0.1.10)
Step #6 - "compile-libfuzzer-introspector-x86_64": Downloading tree_sitter_java-0.23.5-cp39-abi3-manylinux_2_5_x86_64.manylinux1_x86_64.manylinux_2_17_x86_64.manylinux2014_x86_64.whl.metadata (1.7 kB)
Step #6 - "compile-libfuzzer-introspector-x86_64": Collecting tree-sitter-rust==0.23.2 (from fuzz-introspector==0.1.10)
Step #6 - "compile-libfuzzer-introspector-x86_64": Downloading tree_sitter_rust-0.23.2-cp39-abi3-manylinux_2_5_x86_64.manylinux1_x86_64.manylinux_2_17_x86_64.manylinux2014_x86_64.whl.metadata (2.8 kB)
Step #6 - "compile-libfuzzer-introspector-x86_64": Requirement already satisfied: contourpy>=1.0.1 in /usr/local/lib/python3.11/site-packages (from matplotlib==3.10.0->fuzz-introspector==0.1.10) (1.3.3)
Step #6 - "compile-libfuzzer-introspector-x86_64": Requirement already satisfied: cycler>=0.10 in /usr/local/lib/python3.11/site-packages (from matplotlib==3.10.0->fuzz-introspector==0.1.10) (0.12.1)
Step #6 - "compile-libfuzzer-introspector-x86_64": Requirement already satisfied: fonttools>=4.22.0 in /usr/local/lib/python3.11/site-packages (from matplotlib==3.10.0->fuzz-introspector==0.1.10) (4.63.0)
Step #6 - "compile-libfuzzer-introspector-x86_64": Requirement already satisfied: kiwisolver>=1.3.1 in /usr/local/lib/python3.11/site-packages (from matplotlib==3.10.0->fuzz-introspector==0.1.10) (1.5.0)
Step #6 - "compile-libfuzzer-introspector-x86_64": Requirement already satisfied: packaging>=20.0 in /usr/local/lib/python3.11/site-packages (from matplotlib==3.10.0->fuzz-introspector==0.1.10) (26.2)
Step #6 - "compile-libfuzzer-introspector-x86_64": Requirement already satisfied: pillow>=8 in /usr/local/lib/python3.11/site-packages (from matplotlib==3.10.0->fuzz-introspector==0.1.10) (12.3.0)
Step #6 - "compile-libfuzzer-introspector-x86_64": Requirement already satisfied: pyparsing>=2.3.1 in /usr/local/lib/python3.11/site-packages (from matplotlib==3.10.0->fuzz-introspector==0.1.10) (3.3.2)
Step #6 - "compile-libfuzzer-introspector-x86_64": Requirement already satisfied: python-dateutil>=2.7 in /usr/local/lib/python3.11/site-packages (from matplotlib==3.10.0->fuzz-introspector==0.1.10) (2.9.0.post0)
Step #6 - "compile-libfuzzer-introspector-x86_64": Collecting sphinxcontrib-applehelp (from sphinx==6.0.0->fuzz-introspector==0.1.10)
Step #6 - "compile-libfuzzer-introspector-x86_64": Downloading sphinxcontrib_applehelp-2.0.0-py3-none-any.whl.metadata (2.3 kB)
Step #6 - "compile-libfuzzer-introspector-x86_64": Collecting sphinxcontrib-devhelp (from sphinx==6.0.0->fuzz-introspector==0.1.10)
Step #6 - "compile-libfuzzer-introspector-x86_64": Downloading sphinxcontrib_devhelp-2.0.0-py3-none-any.whl.metadata (2.3 kB)
Step #6 - "compile-libfuzzer-introspector-x86_64": Collecting sphinxcontrib-jsmath (from sphinx==6.0.0->fuzz-introspector==0.1.10)
Step #6 - "compile-libfuzzer-introspector-x86_64": Downloading sphinxcontrib_jsmath-1.0.1-py2.py3-none-any.whl.metadata (1.4 kB)
Step #6 - "compile-libfuzzer-introspector-x86_64": Collecting sphinxcontrib-htmlhelp>=2.0.0 (from sphinx==6.0.0->fuzz-introspector==0.1.10)
Step #6 - "compile-libfuzzer-introspector-x86_64": Downloading sphinxcontrib_htmlhelp-2.1.0-py3-none-any.whl.metadata (2.3 kB)
Step #6 - "compile-libfuzzer-introspector-x86_64": Collecting sphinxcontrib-serializinghtml>=1.1.5 (from sphinx==6.0.0->fuzz-introspector==0.1.10)
Step #6 - "compile-libfuzzer-introspector-x86_64": Downloading sphinxcontrib_serializinghtml-2.0.0-py3-none-any.whl.metadata (2.4 kB)
Step #6 - "compile-libfuzzer-introspector-x86_64": Collecting sphinxcontrib-qthelp (from sphinx==6.0.0->fuzz-introspector==0.1.10)
Step #6 - "compile-libfuzzer-introspector-x86_64": Downloading sphinxcontrib_qthelp-2.0.0-py3-none-any.whl.metadata (2.3 kB)
Step #6 - "compile-libfuzzer-introspector-x86_64": Collecting Jinja2>=3.0 (from sphinx==6.0.0->fuzz-introspector==0.1.10)
Step #6 - "compile-libfuzzer-introspector-x86_64": Downloading jinja2-3.1.6-py3-none-any.whl.metadata (2.9 kB)
Step #6 - "compile-libfuzzer-introspector-x86_64": Collecting Pygments>=2.12 (from sphinx==6.0.0->fuzz-introspector==0.1.10)
Step #6 - "compile-libfuzzer-introspector-x86_64": Downloading pygments-2.20.0-py3-none-any.whl.metadata (2.5 kB)
Step #6 - "compile-libfuzzer-introspector-x86_64": Collecting docutils<0.20,>=0.18 (from sphinx==6.0.0->fuzz-introspector==0.1.10)
Step #6 - "compile-libfuzzer-introspector-x86_64": Downloading docutils-0.19-py3-none-any.whl.metadata (2.7 kB)
Step #6 - "compile-libfuzzer-introspector-x86_64": Collecting snowballstemmer>=2.0 (from sphinx==6.0.0->fuzz-introspector==0.1.10)
Step #6 - "compile-libfuzzer-introspector-x86_64": Downloading snowballstemmer-3.1.1-py3-none-any.whl.metadata (7.9 kB)
Step #6 - "compile-libfuzzer-introspector-x86_64": Collecting babel>=2.9 (from sphinx==6.0.0->fuzz-introspector==0.1.10)
Step #6 - "compile-libfuzzer-introspector-x86_64": Downloading babel-2.18.0-py3-none-any.whl.metadata (2.2 kB)
Step #6 - "compile-libfuzzer-introspector-x86_64": Collecting alabaster<0.8,>=0.7 (from sphinx==6.0.0->fuzz-introspector==0.1.10)
Step #6 - "compile-libfuzzer-introspector-x86_64": Downloading alabaster-0.7.16-py3-none-any.whl.metadata (2.9 kB)
Step #6 - "compile-libfuzzer-introspector-x86_64": Collecting imagesize>=1.3 (from sphinx==6.0.0->fuzz-introspector==0.1.10)
Step #6 - "compile-libfuzzer-introspector-x86_64": Downloading imagesize-2.0.0-py2.py3-none-any.whl.metadata (1.5 kB)
Step #6 - "compile-libfuzzer-introspector-x86_64": Collecting requests>=2.25.0 (from sphinx==6.0.0->fuzz-introspector==0.1.10)
Step #6 - "compile-libfuzzer-introspector-x86_64": Downloading requests-2.34.2-py3-none-any.whl.metadata (4.8 kB)
Step #6 - "compile-libfuzzer-introspector-x86_64": Collecting importlib-metadata>=6.6.0 (from yapf==0.40.1->fuzz-introspector==0.1.10)
Step #6 - "compile-libfuzzer-introspector-x86_64": Downloading importlib_metadata-9.0.0-py3-none-any.whl.metadata (4.5 kB)
Step #6 - "compile-libfuzzer-introspector-x86_64": Collecting platformdirs>=3.5.1 (from yapf==0.40.1->fuzz-introspector==0.1.10)
Step #6 - "compile-libfuzzer-introspector-x86_64": Downloading platformdirs-4.10.0-py3-none-any.whl.metadata (5.5 kB)
Step #6 - "compile-libfuzzer-introspector-x86_64": Collecting tomli>=2.0.1 (from yapf==0.40.1->fuzz-introspector==0.1.10)
Step #6 - "compile-libfuzzer-introspector-x86_64": Downloading tomli-2.4.1-cp311-cp311-manylinux2014_x86_64.manylinux_2_17_x86_64.manylinux_2_28_x86_64.whl.metadata (10 kB)
Step #6 - "compile-libfuzzer-introspector-x86_64": Collecting zipp>=3.20 (from importlib-metadata>=6.6.0->yapf==0.40.1->fuzz-introspector==0.1.10)
Step #6 - "compile-libfuzzer-introspector-x86_64": Downloading zipp-4.1.0-py3-none-any.whl.metadata (3.6 kB)
Step #6 - "compile-libfuzzer-introspector-x86_64": Collecting MarkupSafe>=2.0 (from Jinja2>=3.0->sphinx==6.0.0->fuzz-introspector==0.1.10)
Step #6 - "compile-libfuzzer-introspector-x86_64": Downloading markupsafe-3.0.3-cp311-cp311-manylinux2014_x86_64.manylinux_2_17_x86_64.manylinux_2_28_x86_64.whl.metadata (2.7 kB)
Step #6 - "compile-libfuzzer-introspector-x86_64": Requirement already satisfied: six>=1.5 in /usr/local/lib/python3.11/site-packages (from python-dateutil>=2.7->matplotlib==3.10.0->fuzz-introspector==0.1.10) (1.15.0)
Step #6 - "compile-libfuzzer-introspector-x86_64": Collecting charset_normalizer<4,>=2 (from requests>=2.25.0->sphinx==6.0.0->fuzz-introspector==0.1.10)
Step #6 - "compile-libfuzzer-introspector-x86_64": Downloading charset_normalizer-3.4.7-cp311-cp311-manylinux2014_x86_64.manylinux_2_17_x86_64.manylinux_2_28_x86_64.whl.metadata (40 kB)
Step #6 - "compile-libfuzzer-introspector-x86_64": Collecting idna<4,>=2.5 (from requests>=2.25.0->sphinx==6.0.0->fuzz-introspector==0.1.10)
Step #6 - "compile-libfuzzer-introspector-x86_64": Downloading idna-3.18-py3-none-any.whl.metadata (6.1 kB)
Step #6 - "compile-libfuzzer-introspector-x86_64": Collecting urllib3<3,>=1.26 (from requests>=2.25.0->sphinx==6.0.0->fuzz-introspector==0.1.10)
Step #6 - "compile-libfuzzer-introspector-x86_64": Downloading urllib3-2.7.0-py3-none-any.whl.metadata (6.9 kB)
Step #6 - "compile-libfuzzer-introspector-x86_64": Collecting certifi>=2023.5.7 (from requests>=2.25.0->sphinx==6.0.0->fuzz-introspector==0.1.10)
Step #6 - "compile-libfuzzer-introspector-x86_64": Downloading certifi-2026.6.17-py3-none-any.whl.metadata (2.5 kB)
Step #6 - "compile-libfuzzer-introspector-x86_64": Collecting mccabe<0.8.0,>=0.7.0 (from flake8->fuzz-introspector==0.1.10)
Step #6 - "compile-libfuzzer-introspector-x86_64": Downloading mccabe-0.7.0-py2.py3-none-any.whl.metadata (5.0 kB)
Step #6 - "compile-libfuzzer-introspector-x86_64": Collecting pycodestyle<2.15.0,>=2.14.0 (from flake8->fuzz-introspector==0.1.10)
Step #6 - "compile-libfuzzer-introspector-x86_64": Downloading pycodestyle-2.14.0-py2.py3-none-any.whl.metadata (4.5 kB)
Step #6 - "compile-libfuzzer-introspector-x86_64": Collecting pyflakes<3.5.0,>=3.4.0 (from flake8->fuzz-introspector==0.1.10)
Step #6 - "compile-libfuzzer-introspector-x86_64": Downloading pyflakes-3.4.0-py2.py3-none-any.whl.metadata (3.5 kB)
Step #6 - "compile-libfuzzer-introspector-x86_64": Requirement already satisfied: typing_extensions>=4.6.0 in /usr/local/lib/python3.11/site-packages (from mypy->fuzz-introspector==0.1.10) (4.16.0)
Step #6 - "compile-libfuzzer-introspector-x86_64": Collecting mypy_extensions>=1.0.0 (from mypy->fuzz-introspector==0.1.10)
Step #6 - "compile-libfuzzer-introspector-x86_64": Downloading mypy_extensions-1.1.0-py3-none-any.whl.metadata (1.1 kB)
Step #6 - "compile-libfuzzer-introspector-x86_64": Collecting pathspec>=1.0.0 (from mypy->fuzz-introspector==0.1.10)
Step #6 - "compile-libfuzzer-introspector-x86_64": Downloading pathspec-1.1.1-py3-none-any.whl.metadata (14 kB)
Step #6 - "compile-libfuzzer-introspector-x86_64": Collecting librt>=0.11.0 (from mypy->fuzz-introspector==0.1.10)
Step #6 - "compile-libfuzzer-introspector-x86_64": Downloading librt-0.12.0-cp311-cp311-manylinux2014_x86_64.manylinux_2_17_x86_64.manylinux_2_28_x86_64.whl.metadata (1.3 kB)
Step #6 - "compile-libfuzzer-introspector-x86_64": Collecting ast-serialize<1.0.0,>=0.3.0 (from mypy->fuzz-introspector==0.1.10)
Step #6 - "compile-libfuzzer-introspector-x86_64": Downloading ast_serialize-0.6.0-cp39-abi3-manylinux_2_17_x86_64.manylinux2014_x86_64.whl.metadata (1.3 kB)
Step #6 - "compile-libfuzzer-introspector-x86_64": Collecting iniconfig>=1.0.1 (from pytest->fuzz-introspector==0.1.10)
Step #6 - "compile-libfuzzer-introspector-x86_64": Downloading iniconfig-2.3.0-py3-none-any.whl.metadata (2.5 kB)
Step #6 - "compile-libfuzzer-introspector-x86_64": Collecting pluggy<2,>=1.5 (from pytest->fuzz-introspector==0.1.10)
Step #6 - "compile-libfuzzer-introspector-x86_64": Downloading pluggy-1.6.0-py3-none-any.whl.metadata (4.8 kB)
Step #6 - "compile-libfuzzer-introspector-x86_64": Collecting sphinxcontrib-jquery<5,>=4 (from sphinx_rtd_theme->fuzz-introspector==0.1.10)
Step #6 - "compile-libfuzzer-introspector-x86_64": Downloading sphinxcontrib_jquery-4.1-py2.py3-none-any.whl.metadata (2.6 kB)
Step #6 - "compile-libfuzzer-introspector-x86_64": Downloading beautifulsoup4-4.10.0-py3-none-any.whl (97 kB)
Step #6 - "compile-libfuzzer-introspector-x86_64": Downloading lxml-5.3.0-cp311-cp311-manylinux_2_28_x86_64.whl (5.0 MB)
Step #6 - "compile-libfuzzer-introspector-x86_64": [?25l [90m━━━━━━━━━━━━━━━━━━━━━━━━━━━━━━━━━━━━━━━━[0m [32m0.0/5.0 MB[0m [31m?[0m eta [36m-:--:--[0m
[2K [90m━━━━━━━━━━━━━━━━━━━━━━━━━━━━━━━━━━━━━━━━[0m [32m5.0/5.0 MB[0m [31m79.8 MB/s[0m [33m0:00:00[0m
Step #6 - "compile-libfuzzer-introspector-x86_64": [?25hDownloading matplotlib-3.10.0-cp311-cp311-manylinux_2_17_x86_64.manylinux2014_x86_64.whl (8.6 MB)
Step #6 - "compile-libfuzzer-introspector-x86_64": [?25l [90m━━━━━━━━━━━━━━━━━━━━━━━━━━━━━━━━━━━━━━━━[0m [32m0.0/8.6 MB[0m [31m?[0m eta [36m-:--:--[0m
[2K [90m━━━━━━━━━━━━━━━━━━━━━━━━━━━━━━━━━━━━━━━━[0m [32m8.6/8.6 MB[0m [31m124.2 MB/s[0m [33m0:00:00[0m
Step #6 - "compile-libfuzzer-introspector-x86_64": [?25hDownloading numpy-2.1.0-cp311-cp311-manylinux_2_17_x86_64.manylinux2014_x86_64.whl (16.3 MB)
Step #6 - "compile-libfuzzer-introspector-x86_64": [?25l [90m━━━━━━━━━━━━━━━━━━━━━━━━━━━━━━━━━━━━━━━━[0m [32m0.0/16.3 MB[0m [31m?[0m eta [36m-:--:--[0m
[2K [90m━━━━━━━━━━━━━━━━━━━━━━━━━━━━━━━━━━━━━━━━[0m [32m16.3/16.3 MB[0m [31m132.1 MB/s[0m [33m0:00:00[0m
Step #6 - "compile-libfuzzer-introspector-x86_64": [?25hDownloading PyYAML-6.0.2-cp311-cp311-manylinux_2_17_x86_64.manylinux2014_x86_64.whl (762 kB)
Step #6 - "compile-libfuzzer-introspector-x86_64": [?25l [90m━━━━━━━━━━━━━━━━━━━━━━━━━━━━━━━━━━━━━━━━[0m [32m0.0/763.0 kB[0m [31m?[0m eta [36m-:--:--[0m
[2K [90m━━━━━━━━━━━━━━━━━━━━━━━━━━━━━━━━━━━━━━━━[0m [32m763.0/763.0 kB[0m [31m50.6 MB/s[0m [33m0:00:00[0m
Step #6 - "compile-libfuzzer-introspector-x86_64": [?25hDownloading soupsieve-2.2.1-py3-none-any.whl (33 kB)
Step #6 - "compile-libfuzzer-introspector-x86_64": Downloading sphinx-6.0.0-py3-none-any.whl (3.0 MB)
Step #6 - "compile-libfuzzer-introspector-x86_64": [?25l [90m━━━━━━━━━━━━━━━━━━━━━━━━━━━━━━━━━━━━━━━━[0m [32m0.0/3.0 MB[0m [31m?[0m eta [36m-:--:--[0m
[2K [90m━━━━━━━━━━━━━━━━━━━━━━━━━━━━━━━━━━━━━━━━[0m [32m3.0/3.0 MB[0m [31m136.1 MB/s[0m [33m0:00:00[0m
Step #6 - "compile-libfuzzer-introspector-x86_64": [?25hDownloading tree_sitter-0.23.2-cp311-cp311-manylinux_2_17_x86_64.manylinux2014_x86_64.whl (567 kB)
Step #6 - "compile-libfuzzer-introspector-x86_64": [?25l [90m━━━━━━━━━━━━━━━━━━━━━━━━━━━━━━━━━━━━━━━━[0m [32m0.0/567.6 kB[0m [31m?[0m eta [36m-:--:--[0m
[2K [90m━━━━━━━━━━━━━━━━━━━━━━━━━━━━━━━━━━━━━━━━[0m [32m567.6/567.6 kB[0m [31m35.5 MB/s[0m [33m0:00:00[0m
Step #6 - "compile-libfuzzer-introspector-x86_64": [?25hDownloading tree_sitter_cpp-0.23.4-cp39-abi3-manylinux_2_17_x86_64.manylinux2014_x86_64.whl (316 kB)
Step #6 - "compile-libfuzzer-introspector-x86_64": Downloading tree_sitter_go-0.23.4-cp39-abi3-manylinux_2_5_x86_64.manylinux1_x86_64.manylinux_2_17_x86_64.manylinux2014_x86_64.whl (65 kB)
Step #6 - "compile-libfuzzer-introspector-x86_64": Downloading tree_sitter_java-0.23.5-cp39-abi3-manylinux_2_5_x86_64.manylinux1_x86_64.manylinux_2_17_x86_64.manylinux2014_x86_64.whl (84 kB)
Step #6 - "compile-libfuzzer-introspector-x86_64": Downloading tree_sitter_languages-1.10.2-cp311-cp311-manylinux_2_17_x86_64.manylinux2014_x86_64.whl (8.4 MB)
Step #6 - "compile-libfuzzer-introspector-x86_64": [?25l [90m━━━━━━━━━━━━━━━━━━━━━━━━━━━━━━━━━━━━━━━━[0m [32m0.0/8.4 MB[0m [31m?[0m eta [36m-:--:--[0m
[2K [90m━━━━━━━━━━━━━━━━━━━━━━━━━━━━━━━━━━━━━━━━[0m [32m8.4/8.4 MB[0m [31m120.6 MB/s[0m [33m0:00:00[0m
Step #6 - "compile-libfuzzer-introspector-x86_64": [?25hDownloading tree_sitter_python-0.23.6-cp39-abi3-manylinux_2_5_x86_64.manylinux1_x86_64.manylinux_2_17_x86_64.manylinux2014_x86_64.whl (112 kB)
Step #6 - "compile-libfuzzer-introspector-x86_64": Downloading tree_sitter_rust-0.23.2-cp39-abi3-manylinux_2_5_x86_64.manylinux1_x86_64.manylinux_2_17_x86_64.manylinux2014_x86_64.whl (157 kB)
Step #6 - "compile-libfuzzer-introspector-x86_64": Downloading yapf-0.40.1-py3-none-any.whl (250 kB)
Step #6 - "compile-libfuzzer-introspector-x86_64": Downloading alabaster-0.7.16-py3-none-any.whl (13 kB)
Step #6 - "compile-libfuzzer-introspector-x86_64": Downloading docutils-0.19-py3-none-any.whl (570 kB)
Step #6 - "compile-libfuzzer-introspector-x86_64": [?25l [90m━━━━━━━━━━━━━━━━━━━━━━━━━━━━━━━━━━━━━━━━[0m [32m0.0/570.5 kB[0m [31m?[0m eta [36m-:--:--[0m
[2K [90m━━━━━━━━━━━━━━━━━━━━━━━━━━━━━━━━━━━━━━━━[0m [32m570.5/570.5 kB[0m [31m37.5 MB/s[0m [33m0:00:00[0m
Step #6 - "compile-libfuzzer-introspector-x86_64": [?25hDownloading babel-2.18.0-py3-none-any.whl (10.2 MB)
Step #6 - "compile-libfuzzer-introspector-x86_64": [?25l [90m━━━━━━━━━━━━━━━━━━━━━━━━━━━━━━━━━━━━━━━━[0m [32m0.0/10.2 MB[0m [31m?[0m eta [36m-:--:--[0m
[2K [90m━━━━━━━━━━━━━━━━━━━━━━━━━━━━━━━━━━━━━━━━[0m [32m10.2/10.2 MB[0m [31m128.6 MB/s[0m [33m0:00:00[0m
Step #6 - "compile-libfuzzer-introspector-x86_64": [?25hDownloading imagesize-2.0.0-py2.py3-none-any.whl (9.4 kB)
Step #6 - "compile-libfuzzer-introspector-x86_64": Downloading importlib_metadata-9.0.0-py3-none-any.whl (27 kB)
Step #6 - "compile-libfuzzer-introspector-x86_64": Downloading jinja2-3.1.6-py3-none-any.whl (134 kB)
Step #6 - "compile-libfuzzer-introspector-x86_64": Downloading markupsafe-3.0.3-cp311-cp311-manylinux2014_x86_64.manylinux_2_17_x86_64.manylinux_2_28_x86_64.whl (22 kB)
Step #6 - "compile-libfuzzer-introspector-x86_64": Downloading platformdirs-4.10.0-py3-none-any.whl (22 kB)
Step #6 - "compile-libfuzzer-introspector-x86_64": Downloading pygments-2.20.0-py3-none-any.whl (1.2 MB)
Step #6 - "compile-libfuzzer-introspector-x86_64": [?25l [90m━━━━━━━━━━━━━━━━━━━━━━━━━━━━━━━━━━━━━━━━[0m [32m0.0/1.2 MB[0m [31m?[0m eta [36m-:--:--[0m
[2K [90m━━━━━━━━━━━━━━━━━━━━━━━━━━━━━━━━━━━━━━━━[0m [32m1.2/1.2 MB[0m [31m79.5 MB/s[0m [33m0:00:00[0m
Step #6 - "compile-libfuzzer-introspector-x86_64": [?25hDownloading requests-2.34.2-py3-none-any.whl (73 kB)
Step #6 - "compile-libfuzzer-introspector-x86_64": Downloading charset_normalizer-3.4.7-cp311-cp311-manylinux2014_x86_64.manylinux_2_17_x86_64.manylinux_2_28_x86_64.whl (214 kB)
Step #6 - "compile-libfuzzer-introspector-x86_64": Downloading idna-3.18-py3-none-any.whl (65 kB)
Step #6 - "compile-libfuzzer-introspector-x86_64": Downloading urllib3-2.7.0-py3-none-any.whl (131 kB)
Step #6 - "compile-libfuzzer-introspector-x86_64": Downloading certifi-2026.6.17-py3-none-any.whl (133 kB)
Step #6 - "compile-libfuzzer-introspector-x86_64": Downloading snowballstemmer-3.1.1-py3-none-any.whl (104 kB)
Step #6 - "compile-libfuzzer-introspector-x86_64": Downloading sphinxcontrib_htmlhelp-2.1.0-py3-none-any.whl (98 kB)
Step #6 - "compile-libfuzzer-introspector-x86_64": Downloading sphinxcontrib_serializinghtml-2.0.0-py3-none-any.whl (92 kB)
Step #6 - "compile-libfuzzer-introspector-x86_64": Downloading tomli-2.4.1-cp311-cp311-manylinux2014_x86_64.manylinux_2_17_x86_64.manylinux_2_28_x86_64.whl (243 kB)
Step #6 - "compile-libfuzzer-introspector-x86_64": Downloading zipp-4.1.0-py3-none-any.whl (10 kB)
Step #6 - "compile-libfuzzer-introspector-x86_64": Downloading configparser-7.2.0-py3-none-any.whl (17 kB)
Step #6 - "compile-libfuzzer-introspector-x86_64": Downloading coverage-7.15.0-cp311-cp311-manylinux1_x86_64.manylinux_2_28_x86_64.manylinux_2_5_x86_64.whl (253 kB)
Step #6 - "compile-libfuzzer-introspector-x86_64": Downloading flake8-7.3.0-py2.py3-none-any.whl (57 kB)
Step #6 - "compile-libfuzzer-introspector-x86_64": Downloading mccabe-0.7.0-py2.py3-none-any.whl (7.3 kB)
Step #6 - "compile-libfuzzer-introspector-x86_64": Downloading pycodestyle-2.14.0-py2.py3-none-any.whl (31 kB)
Step #6 - "compile-libfuzzer-introspector-x86_64": Downloading pyflakes-3.4.0-py2.py3-none-any.whl (63 kB)
Step #6 - "compile-libfuzzer-introspector-x86_64": Downloading mypy-2.1.0-cp311-cp311-manylinux2014_x86_64.manylinux_2_17_x86_64.manylinux_2_28_x86_64.whl (14.9 MB)
Step #6 - "compile-libfuzzer-introspector-x86_64": [?25l [90m━━━━━━━━━━━━━━━━━━━━━━━━━━━━━━━━━━━━━━━━[0m [32m0.0/14.9 MB[0m [31m?[0m eta [36m-:--:--[0m
[2K [90m━━━━━━━━━━━━━━━━━━━━━━━━━━━━━━━━━━━━━━━━[0m [32m14.9/14.9 MB[0m [31m134.5 MB/s[0m [33m0:00:00[0m
Step #6 - "compile-libfuzzer-introspector-x86_64": [?25hDownloading ast_serialize-0.6.0-cp39-abi3-manylinux_2_17_x86_64.manylinux2014_x86_64.whl (1.3 MB)
Step #6 - "compile-libfuzzer-introspector-x86_64": [?25l [90m━━━━━━━━━━━━━━━━━━━━━━━━━━━━━━━━━━━━━━━━[0m [32m0.0/1.3 MB[0m [31m?[0m eta [36m-:--:--[0m
[2K [90m━━━━━━━━━━━━━━━━━━━━━━━━━━━━━━━━━━━━━━━━[0m [32m1.3/1.3 MB[0m [31m84.4 MB/s[0m [33m0:00:00[0m
Step #6 - "compile-libfuzzer-introspector-x86_64": [?25hDownloading librt-0.12.0-cp311-cp311-manylinux2014_x86_64.manylinux_2_17_x86_64.manylinux_2_28_x86_64.whl (502 kB)
Step #6 - "compile-libfuzzer-introspector-x86_64": Downloading mypy_extensions-1.1.0-py3-none-any.whl (5.0 kB)
Step #6 - "compile-libfuzzer-introspector-x86_64": Downloading pathspec-1.1.1-py3-none-any.whl (57 kB)
Step #6 - "compile-libfuzzer-introspector-x86_64": Downloading networkx-3.6.1-py3-none-any.whl (2.1 MB)
Step #6 - "compile-libfuzzer-introspector-x86_64": [?25l [90m━━━━━━━━━━━━━━━━━━━━━━━━━━━━━━━━━━━━━━━━[0m [32m0.0/2.1 MB[0m [31m?[0m eta [36m-:--:--[0m
[2K [90m━━━━━━━━━━━━━━━━━━━━━━━━━━━━━━━━━━━━━━━━[0m [32m2.1/2.1 MB[0m [31m111.8 MB/s[0m [33m0:00:00[0m
Step #6 - "compile-libfuzzer-introspector-x86_64": [?25hDownloading pep8-1.7.1-py2.py3-none-any.whl (41 kB)
Step #6 - "compile-libfuzzer-introspector-x86_64": Downloading psutil-7.2.2-cp36-abi3-manylinux2010_x86_64.manylinux_2_12_x86_64.manylinux_2_28_x86_64.whl (155 kB)
Step #6 - "compile-libfuzzer-introspector-x86_64": Downloading pytest-9.1.1-py3-none-any.whl (386 kB)
Step #6 - "compile-libfuzzer-introspector-x86_64": Downloading pluggy-1.6.0-py3-none-any.whl (20 kB)
Step #6 - "compile-libfuzzer-introspector-x86_64": Downloading iniconfig-2.3.0-py3-none-any.whl (7.5 kB)
Step #6 - "compile-libfuzzer-introspector-x86_64": Downloading sphinx_rtd_theme-3.1.0-py2.py3-none-any.whl (7.7 MB)
Step #6 - "compile-libfuzzer-introspector-x86_64": [?25l [90m━━━━━━━━━━━━━━━━━━━━━━━━━━━━━━━━━━━━━━━━[0m [32m0.0/7.7 MB[0m [31m?[0m eta [36m-:--:--[0m
[2K [90m━━━━━━━━━━━━━━━━━━━━━━━━━━━━━━━━━━━━━━━━[0m [32m7.7/7.7 MB[0m [31m121.7 MB/s[0m [33m0:00:00[0m
Step #6 - "compile-libfuzzer-introspector-x86_64": [?25hDownloading sphinxcontrib_jquery-4.1-py2.py3-none-any.whl (121 kB)
Step #6 - "compile-libfuzzer-introspector-x86_64": Downloading sphinxcontrib_applehelp-2.0.0-py3-none-any.whl (119 kB)
Step #6 - "compile-libfuzzer-introspector-x86_64": Downloading sphinxcontrib_devhelp-2.0.0-py3-none-any.whl (82 kB)
Step #6 - "compile-libfuzzer-introspector-x86_64": Downloading sphinxcontrib_jsmath-1.0.1-py2.py3-none-any.whl (5.1 kB)
Step #6 - "compile-libfuzzer-introspector-x86_64": Downloading sphinxcontrib_qthelp-2.0.0-py3-none-any.whl (88 kB)
Step #6 - "compile-libfuzzer-introspector-x86_64": Downloading toml-0.10.2-py2.py3-none-any.whl (16 kB)
Step #6 - "compile-libfuzzer-introspector-x86_64": Downloading tqdm-4.68.3-py3-none-any.whl (78 kB)
Step #6 - "compile-libfuzzer-introspector-x86_64": Building wheels for collected packages: fuzz-introspector
Step #6 - "compile-libfuzzer-introspector-x86_64": Building editable for fuzz-introspector (pyproject.toml) ... [?25l- done
Step #6 - "compile-libfuzzer-introspector-x86_64": [?25h Created wheel for fuzz-introspector: filename=fuzz_introspector-0.1.10-0.editable-py3-none-any.whl size=3903 sha256=9fbe2878b1686f70da9b12ae6f33b7198931885b4f200c0a35add17d76bbd435
Step #6 - "compile-libfuzzer-introspector-x86_64": Stored in directory: /tmp/pip-ephem-wheel-cache-41by90ol/wheels/44/ee/b6/7a2a30503e5336c67773d206f572139af7f7e84341b0b70950
Step #6 - "compile-libfuzzer-introspector-x86_64": Successfully built fuzz-introspector
Step #6 - "compile-libfuzzer-introspector-x86_64": Installing collected packages: pep8, zipp, urllib3, tree-sitter-rust, tree-sitter-python, tree-sitter-java, tree-sitter-go, tree-sitter-cpp, tree-sitter, tqdm, tomli, toml, sphinxcontrib-serializinghtml, sphinxcontrib-qthelp, sphinxcontrib-jsmath, sphinxcontrib-htmlhelp, sphinxcontrib-devhelp, sphinxcontrib-applehelp, soupsieve, snowballstemmer, PyYAML, Pygments, pyflakes, pycodestyle, psutil, pluggy, platformdirs, pathspec, numpy, networkx, mypy_extensions, mccabe, MarkupSafe, lxml, librt, iniconfig, imagesize, idna, docutils, coverage, configparser, charset_normalizer, certifi, babel, ast-serialize, alabaster, tree-sitter-languages, requests, pytest, mypy, Jinja2, importlib-metadata, flake8, beautifulsoup4, yapf, sphinx, matplotlib, sphinxcontrib-jquery, sphinx_rtd_theme, fuzz-introspector
Step #6 - "compile-libfuzzer-introspector-x86_64": [?25l
[2K [91m━━━━━[0m[90m╺[0m[90m━━━━━━━━━━━━━━━━━━━━━━━━━━━━━━━━━━[0m [32m 8/60[0m [tree-sitter]
[2K [91m━━━━━━━━━━[0m[90m╺[0m[90m━━━━━━━━━━━━━━━━━━━━━━━━━━━━━[0m [32m15/60[0m [sphinxcontrib-htmlhelp]
[2K Attempting uninstall: soupsieve
Step #6 - "compile-libfuzzer-introspector-x86_64": [91m━━━━━━━━━━[0m[90m╺[0m[90m━━━━━━━━━━━━━━━━━━━━━━━━━━━━━[0m [32m15/60[0m [sphinxcontrib-htmlhelp]
[2K Found existing installation: soupsieve 2.8.4
Step #6 - "compile-libfuzzer-introspector-x86_64": [91m━━━━━━━━━━[0m[90m╺[0m[90m━━━━━━━━━━━━━━━━━━━━━━━━━━━━━[0m [32m15/60[0m [sphinxcontrib-htmlhelp]
[2K Uninstalling soupsieve-2.8.4:
Step #6 - "compile-libfuzzer-introspector-x86_64": [91m━━━━━━━━━━[0m[90m╺[0m[90m━━━━━━━━━━━━━━━━━━━━━━━━━━━━━[0m [32m15/60[0m [sphinxcontrib-htmlhelp]
[2K Successfully uninstalled soupsieve-2.8.4
Step #6 - "compile-libfuzzer-introspector-x86_64": [91m━━━━━━━━━━[0m[90m╺[0m[90m━━━━━━━━━━━━━━━━━━━━━━━━━━━━━[0m [32m15/60[0m [sphinxcontrib-htmlhelp]
[2K [91m━━━━━━━━━━━━[0m[91m╸[0m[90m━━━━━━━━━━━━━━━━━━━━━━━━━━━[0m [32m19/60[0m [snowballstemmer]
[2K Attempting uninstall: PyYAML
Step #6 - "compile-libfuzzer-introspector-x86_64": [91m━━━━━━━━━━━━[0m[91m╸[0m[90m━━━━━━━━━━━━━━━━━━━━━━━━━━━[0m [32m19/60[0m [snowballstemmer]
[2K Found existing installation: PyYAML 6.0.3
Step #6 - "compile-libfuzzer-introspector-x86_64": [91m━━━━━━━━━━━━[0m[91m╸[0m[90m━━━━━━━━━━━━━━━━━━━━━━━━━━━[0m [32m19/60[0m [snowballstemmer]
[2K Uninstalling PyYAML-6.0.3:
Step #6 - "compile-libfuzzer-introspector-x86_64": [91m━━━━━━━━━━━━[0m[91m╸[0m[90m━━━━━━━━━━━━━━━━━━━━━━━━━━━[0m [32m19/60[0m [snowballstemmer]
[2K Successfully uninstalled PyYAML-6.0.3
Step #6 - "compile-libfuzzer-introspector-x86_64": [91m━━━━━━━━━━━━[0m[91m╸[0m[90m━━━━━━━━━━━━━━━━━━━━━━━━━━━[0m [32m19/60[0m [snowballstemmer]
[2K [91m━━━━━━━━━━━━━[0m[90m╺[0m[90m━━━━━━━━━━━━━━━━━━━━━━━━━━[0m [32m20/60[0m [PyYAML]
[2K [91m━━━━━━━━━━━━━━[0m[90m╺[0m[90m━━━━━━━━━━━━━━━━━━━━━━━━━[0m [32m21/60[0m [Pygments]
[2K [91m━━━━━━━━━━━━━━[0m[90m╺[0m[90m━━━━━━━━━━━━━━━━━━━━━━━━━[0m [32m21/60[0m [Pygments]
[2K [91m━━━━━━━━━━━━━━[0m[90m╺[0m[90m━━━━━━━━━━━━━━━━━━━━━━━━━[0m [32m21/60[0m [Pygments]
[2K [91m━━━━━━━━━━━━━━[0m[91m╸[0m[90m━━━━━━━━━━━━━━━━━━━━━━━━━[0m [32m22/60[0m [pyflakes]
[2K [91m━━━━━━━━━━━━━━━━━[0m[90m╺[0m[90m━━━━━━━━━━━━━━━━━━━━━━[0m [32m26/60[0m [platformdirs]
[2K Attempting uninstall: numpy
Step #6 - "compile-libfuzzer-introspector-x86_64": [91m━━━━━━━━━━━━━━━━━[0m[90m╺[0m[90m━━━━━━━━━━━━━━━━━━━━━━[0m [32m26/60[0m [platformdirs]
[2K Found existing installation: numpy 2.4.6
Step #6 - "compile-libfuzzer-introspector-x86_64": [91m━━━━━━━━━━━━━━━━━[0m[90m╺[0m[90m━━━━━━━━━━━━━━━━━━━━━━[0m [32m26/60[0m [platformdirs]
[2K Uninstalling numpy-2.4.6:
Step #6 - "compile-libfuzzer-introspector-x86_64": [91m━━━━━━━━━━━━━━━━━[0m[90m╺[0m[90m━━━━━━━━━━━━━━━━━━━━━━[0m [32m26/60[0m [platformdirs]
[2K Successfully uninstalled numpy-2.4.6
Step #6 - "compile-libfuzzer-introspector-x86_64": [91m━━━━━━━━━━━━━━━━━[0m[90m╺[0m[90m━━━━━━━━━━━━━━━━━━━━━━[0m [32m26/60[0m [platformdirs]
[2K [91m━━━━━━━━━━━━━━━━━━[0m[91m╸[0m[90m━━━━━━━━━━━━━━━━━━━━━[0m [32m28/60[0m [numpy]
[2K [91m━━━━━━━━━━━━━━━━━━[0m[91m╸[0m[90m━━━━━━━━━━━━━━━━━━━━━[0m [32m28/60[0m [numpy]
[2K [91m━━━━━━━━━━━━━━━━━━[0m[91m╸[0m[90m━━━━━━━━━━━━━━━━━━━━━[0m [32m28/60[0m [numpy]
[2K [91m━━━━━━━━━━━━━━━━━━[0m[91m╸[0m[90m━━━━━━━━━━━━━━━━━━━━━[0m [32m28/60[0m [numpy]
[2K [91m━━━━━━━━━━━━━━━━━━[0m[91m╸[0m[90m━━━━━━━━━━━━━━━━━━━━━[0m [32m28/60[0m [numpy]
[2K [91m━━━━━━━━━━━━━━━━━━[0m[91m╸[0m[90m━━━━━━━━━━━━━━━━━━━━━[0m [32m28/60[0m [numpy]
[2K [91m━━━━━━━━━━━━━━━━━━[0m[91m╸[0m[90m━━━━━━━━━━━━━━━━━━━━━[0m [32m28/60[0m [numpy]
[2K [91m━━━━━━━━━━━━━━━━━━[0m[91m╸[0m[90m━━━━━━━━━━━━━━━━━━━━━[0m [32m28/60[0m [numpy]
[2K [91m━━━━━━━━━━━━━━━━━━[0m[91m╸[0m[90m━━━━━━━━━━━━━━━━━━━━━[0m [32m28/60[0m [numpy]
[2K [91m━━━━━━━━━━━━━━━━━━[0m[91m╸[0m[90m━━━━━━━━━━━━━━━━━━━━━[0m [32m28/60[0m [numpy]
[2K [91m━━━━━━━━━━━━━━━━━━[0m[91m╸[0m[90m━━━━━━━━━━━━━━━━━━━━━[0m [32m28/60[0m [numpy]
[2K [91m━━━━━━━━━━━━━━━━━━[0m[91m╸[0m[90m━━━━━━━━━━━━━━━━━━━━━[0m [32m28/60[0m [numpy]
[2K [91m━━━━━━━━━━━━━━━━━━━[0m[90m╺[0m[90m━━━━━━━━━━━━━━━━━━━━[0m [32m29/60[0m [networkx]
[2K [91m━━━━━━━━━━━━━━━━━━━[0m[90m╺[0m[90m━━━━━━━━━━━━━━━━━━━━[0m [32m29/60[0m [networkx]
[2K [91m━━━━━━━━━━━━━━━━━━━[0m[90m╺[0m[90m━━━━━━━━━━━━━━━━━━━━[0m [32m29/60[0m [networkx]
[2K [91m━━━━━━━━━━━━━━━━━━━[0m[90m╺[0m[90m━━━━━━━━━━━━━━━━━━━━[0m [32m29/60[0m [networkx]
[2K [91m━━━━━━━━━━━━━━━━━━━[0m[90m╺[0m[90m━━━━━━━━━━━━━━━━━━━━[0m [32m29/60[0m [networkx]
[2K [91m━━━━━━━━━━━━━━━━━━━[0m[90m╺[0m[90m━━━━━━━━━━━━━━━━━━━━[0m [32m29/60[0m [networkx]
[2K [91m━━━━━━━━━━━━━━━━━━━[0m[90m╺[0m[90m━━━━━━━━━━━━━━━━━━━━[0m [32m29/60[0m [networkx]
[2K Attempting uninstall: lxml
Step #6 - "compile-libfuzzer-introspector-x86_64": [91m━━━━━━━━━━━━━━━━━━━[0m[90m╺[0m[90m━━━━━━━━━━━━━━━━━━━━[0m [32m29/60[0m [networkx]
[2K Found existing installation: lxml 6.1.1
Step #6 - "compile-libfuzzer-introspector-x86_64": [91m━━━━━━━━━━━━━━━━━━━[0m[90m╺[0m[90m━━━━━━━━━━━━━━━━━━━━[0m [32m29/60[0m [networkx]
[2K Uninstalling lxml-6.1.1:
Step #6 - "compile-libfuzzer-introspector-x86_64": [91m━━━━━━━━━━━━━━━━━━━[0m[90m╺[0m[90m━━━━━━━━━━━━━━━━━━━━[0m [32m29/60[0m [networkx]
[2K Successfully uninstalled lxml-6.1.1
Step #6 - "compile-libfuzzer-introspector-x86_64": [91m━━━━━━━━━━━━━━━━━━━[0m[90m╺[0m[90m━━━━━━━━━━━━━━━━━━━━[0m [32m29/60[0m [networkx]
[2K [91m━━━━━━━━━━━━━━━━━━━━━━[0m[90m╺[0m[90m━━━━━━━━━━━━━━━━━[0m [32m33/60[0m [lxml]
[2K [91m━━━━━━━━━━━━━━━━━━━━━━━━━[0m[90m╺[0m[90m━━━━━━━━━━━━━━[0m [32m38/60[0m [docutils]
[2K [91m━━━━━━━━━━━━━━━━━━━━━━━━━[0m[90m╺[0m[90m━━━━━━━━━━━━━━[0m [32m38/60[0m [docutils]
[2K [91m━━━━━━━━━━━━━━━━━━━━━━━━━━━[0m[90m╺[0m[90m━━━━━━━━━━━━[0m [32m41/60[0m [charset_normalizer]
[2K [91m━━━━━━━━━━━━━━━━━━━━━━━━━━━━[0m[91m╸[0m[90m━━━━━━━━━━━[0m [32m43/60[0m [babel]
[2K [91m━━━━━━━━━━━━━━━━━━━━━━━━━━━━[0m[91m╸[0m[90m━━━━━━━━━━━[0m [32m43/60[0m [babel]
[2K [91m━━━━━━━━━━━━━━━━━━━━━━━━━━━━━━[0m[91m╸[0m[90m━━━━━━━━━[0m [32m46/60[0m [tree-sitter-languages]
[2K [91m━━━━━━━━━━━━━━━━━━━━━━━━━━━━━━[0m[91m╸[0m[90m━━━━━━━━━[0m [32m46/60[0m [tree-sitter-languages]
[2K [91m━━━━━━━━━━━━━━━━━━━━━━━━━━━━━━━━[0m[90m╺[0m[90m━━━━━━━[0m [32m48/60[0m [pytest]
[2K [91m━━━━━━━━━━━━━━━━━━━━━━━━━━━━━━━━[0m[91m╸[0m[90m━━━━━━━[0m [32m49/60[0m [mypy]
[2K [91m━━━━━━━━━━━━━━━━━━━━━━━━━━━━━━━━[0m[91m╸[0m[90m━━━━━━━[0m [32m49/60[0m [mypy]
[2K [91m━━━━━━━━━━━━━━━━━━━━━━━━━━━━━━━━[0m[91m╸[0m[90m━━━━━━━[0m [32m49/60[0m [mypy]
[2K [91m━━━━━━━━━━━━━━━━━━━━━━━━━━━━━━━━[0m[91m╸[0m[90m━━━━━━━[0m [32m49/60[0m [mypy]
[2K [91m━━━━━━━━━━━━━━━━━━━━━━━━━━━━━━━━[0m[91m╸[0m[90m━━━━━━━[0m [32m49/60[0m [mypy]
[2K [91m━━━━━━━━━━━━━━━━━━━━━━━━━━━━━━━━[0m[91m╸[0m[90m━━━━━━━[0m [32m49/60[0m [mypy]
[2K [91m━━━━━━━━━━━━━━━━━━━━━━━━━━━━━━━━[0m[91m╸[0m[90m━━━━━━━[0m [32m49/60[0m [mypy]
[2K [91m━━━━━━━━━━━━━━━━━━━━━━━━━━━━━━━━[0m[91m╸[0m[90m━━━━━━━[0m [32m49/60[0m [mypy]
[2K [91m━━━━━━━━━━━━━━━━━━━━━━━━━━━━━━━━[0m[91m╸[0m[90m━━━━━━━[0m [32m49/60[0m [mypy]
[2K [91m━━━━━━━━━━━━━━━━━━━━━━━━━━━━━━━━━[0m[90m╺[0m[90m━━━━━━[0m [32m50/60[0m [Jinja2]
[2K Attempting uninstall: beautifulsoup4
Step #6 - "compile-libfuzzer-introspector-x86_64": [91m━━━━━━━━━━━━━━━━━━━━━━━━━━━━━━━━━[0m[90m╺[0m[90m━━━━━━[0m [32m50/60[0m [Jinja2]
[2K Found existing installation: beautifulsoup4 4.15.0
Step #6 - "compile-libfuzzer-introspector-x86_64": [91m━━━━━━━━━━━━━━━━━━━━━━━━━━━━━━━━━[0m[90m╺[0m[90m━━━━━━[0m [32m50/60[0m [Jinja2]
[2K Uninstalling beautifulsoup4-4.15.0:
Step #6 - "compile-libfuzzer-introspector-x86_64": [91m━━━━━━━━━━━━━━━━━━━━━━━━━━━━━━━━━[0m[90m╺[0m[90m━━━━━━[0m [32m50/60[0m [Jinja2]
[2K Successfully uninstalled beautifulsoup4-4.15.0
Step #6 - "compile-libfuzzer-introspector-x86_64": [91m━━━━━━━━━━━━━━━━━━━━━━━━━━━━━━━━━[0m[90m╺[0m[90m━━━━━━[0m [32m50/60[0m [Jinja2]
[2K [91m━━━━━━━━━━━━━━━━━━━━━━━━━━━━━━━━━━━[0m[90m╺[0m[90m━━━━[0m [32m53/60[0m [beautifulsoup4]
[2K [91m━━━━━━━━━━━━━━━━━━━━━━━━━━━━━━━━━━━━[0m[91m╸[0m[90m━━━[0m [32m55/60[0m [sphinx]
[2K [91m━━━━━━━━━━━━━━━━━━━━━━━━━━━━━━━━━━━━[0m[91m╸[0m[90m━━━[0m [32m55/60[0m [sphinx]
[2K [91m━━━━━━━━━━━━━━━━━━━━━━━━━━━━━━━━━━━━[0m[91m╸[0m[90m━━━[0m [32m55/60[0m [sphinx]
[2K [91m━━━━━━━━━━━━━━━━━━━━━━━━━━━━━━━━━━━━[0m[91m╸[0m[90m━━━[0m [32m55/60[0m [sphinx]
[2K Attempting uninstall: matplotlib
Step #6 - "compile-libfuzzer-introspector-x86_64": [91m━━━━━━━━━━━━━━━━━━━━━━━━━━━━━━━━━━━━[0m[91m╸[0m[90m━━━[0m [32m55/60[0m [sphinx]
[2K Found existing installation: matplotlib 3.11.0
Step #6 - "compile-libfuzzer-introspector-x86_64": [91m━━━━━━━━━━━━━━━━━━━━━━━━━━━━━━━━━━━━[0m[91m╸[0m[90m━━━[0m [32m55/60[0m [sphinx]
[2K Uninstalling matplotlib-3.11.0:
Step #6 - "compile-libfuzzer-introspector-x86_64": [91m━━━━━━━━━━━━━━━━━━━━━━━━━━━━━━━━━━━━[0m[91m╸[0m[90m━━━[0m [32m55/60[0m [sphinx]
[2K [91m━━━━━━━━━━━━━━━━━━━━━━━━━━━━━━━━━━━━━[0m[90m╺[0m[90m━━[0m [32m56/60[0m [matplotlib]
[2K Successfully uninstalled matplotlib-3.11.0
Step #6 - "compile-libfuzzer-introspector-x86_64": [91m━━━━━━━━━━━━━━━━━━━━━━━━━━━━━━━━━━━━━[0m[90m╺[0m[90m━━[0m [32m56/60[0m [matplotlib]
[2K [91m━━━━━━━━━━━━━━━━━━━━━━━━━━━━━━━━━━━━━[0m[90m╺[0m[90m━━[0m [32m56/60[0m [matplotlib]
[2K [91m━━━━━━━━━━━━━━━━━━━━━━━━━━━━━━━━━━━━━[0m[90m╺[0m[90m━━[0m [32m56/60[0m [matplotlib]
[2K [91m━━━━━━━━━━━━━━━━━━━━━━━━━━━━━━━━━━━━━[0m[90m╺[0m[90m━━[0m [32m56/60[0m [matplotlib]
[2K [91m━━━━━━━━━━━━━━━━━━━━━━━━━━━━━━━━━━━━━[0m[90m╺[0m[90m━━[0m [32m56/60[0m [matplotlib]
[2K [91m━━━━━━━━━━━━━━━━━━━━━━━━━━━━━━━━━━━━━[0m[90m╺[0m[90m━━[0m [32m56/60[0m [matplotlib]
[2K [91m━━━━━━━━━━━━━━━━━━━━━━━━━━━━━━━━━━━━━[0m[90m╺[0m[90m━━[0m [32m56/60[0m [matplotlib]
[2K [91m━━━━━━━━━━━━━━━━━━━━━━━━━━━━━━━━━━━━━[0m[90m╺[0m[90m━━[0m [32m56/60[0m [matplotlib]
[2K [91m━━━━━━━━━━━━━━━━━━━━━━━━━━━━━━━━━━━━━[0m[90m╺[0m[90m━━[0m [32m56/60[0m [matplotlib]
[2K [90m━━━━━━━━━━━━━━━━━━━━━━━━━━━━━━━━━━━━━━━━[0m [32m60/60[0m [fuzz-introspector]
Step #6 - "compile-libfuzzer-introspector-x86_64": [?25h
[1A[2KSuccessfully installed Jinja2-3.1.6 MarkupSafe-3.0.3 PyYAML-6.0.2 Pygments-2.20.0 alabaster-0.7.16 ast-serialize-0.6.0 babel-2.18.0 beautifulsoup4-4.10.0 certifi-2026.6.17 charset_normalizer-3.4.7 configparser-7.2.0 coverage-7.15.0 docutils-0.19 flake8-7.3.0 fuzz-introspector-0.1.10 idna-3.18 imagesize-2.0.0 importlib-metadata-9.0.0 iniconfig-2.3.0 librt-0.12.0 lxml-5.3.0 matplotlib-3.10.0 mccabe-0.7.0 mypy-2.1.0 mypy_extensions-1.1.0 networkx-3.6.1 numpy-2.1.0 pathspec-1.1.1 pep8-1.7.1 platformdirs-4.10.0 pluggy-1.6.0 psutil-7.2.2 pycodestyle-2.14.0 pyflakes-3.4.0 pytest-9.1.1 requests-2.34.2 snowballstemmer-3.1.1 soupsieve-2.2.1 sphinx-6.0.0 sphinx_rtd_theme-3.1.0 sphinxcontrib-applehelp-2.0.0 sphinxcontrib-devhelp-2.0.0 sphinxcontrib-htmlhelp-2.1.0 sphinxcontrib-jquery-4.1 sphinxcontrib-jsmath-1.0.1 sphinxcontrib-qthelp-2.0.0 sphinxcontrib-serializinghtml-2.0.0 toml-0.10.2 tomli-2.4.1 tqdm-4.68.3 tree-sitter-0.23.2 tree-sitter-cpp-0.23.4 tree-sitter-go-0.23.4 tree-sitter-java-0.23.5 tree-sitter-languages-1.10.2 tree-sitter-python-0.23.6 tree-sitter-rust-0.23.2 urllib3-2.7.0 yapf-0.40.1 zipp-4.1.0
Step #6 - "compile-libfuzzer-introspector-x86_64": [33mWARNING: Running pip as the 'root' user can result in broken permissions and conflicting behaviour with the system package manager, possibly rendering your system unusable. It is recommended to use a virtual environment instead: https://pip.pypa.io/warnings/venv. Use the --root-user-action option if you know what you are doing and want to suppress this warning.[0m[33m
Step #6 - "compile-libfuzzer-introspector-x86_64": [0m/src
Step #6 - "compile-libfuzzer-introspector-x86_64": 2026-07-05 10:07:10.870 INFO cli - main: Running fuzz introspector post-processing
Step #6 - "compile-libfuzzer-introspector-x86_64": 2026-07-05 10:07:10.981 INFO analysis - extract_tests_from_directories: All test files
Step #6 - "compile-libfuzzer-introspector-x86_64": 2026-07-05 10:07:10.981 INFO analysis - extract_tests_from_directories: /src/snappy/snappy-test.cc
Step #6 - "compile-libfuzzer-introspector-x86_64": 2026-07-05 10:07:10.982 INFO analysis - extract_tests_from_directories: /src/snappy/snappy_unittest.cc
Step #6 - "compile-libfuzzer-introspector-x86_64": 2026-07-05 10:07:10.982 INFO analysis - extract_tests_from_directories: /src/snappy/snappy_test_data.cc
Step #6 - "compile-libfuzzer-introspector-x86_64": 2026-07-05 10:07:10.982 INFO analysis - extract_tests_from_directories: /src/snappy/snappy_test_tool.cc
Step #6 - "compile-libfuzzer-introspector-x86_64": 2026-07-05 10:07:11.011 INFO cli - main: Ending fuzz introspector post-processing
Step #6 - "compile-libfuzzer-introspector-x86_64": 2026-07-05 10:07:11.177 INFO cli - main: Running fuzz introspector post-processing
Step #6 - "compile-libfuzzer-introspector-x86_64": 2026-07-05 10:07:11.188 INFO oss_fuzz - analyse_folder: Found 276 files to include in analysis
Step #6 - "compile-libfuzzer-introspector-x86_64": 2026-07-05 10:07:11.188 INFO oss_fuzz - analyse_folder: Going C/C++ route
Step #6 - "compile-libfuzzer-introspector-x86_64": 2026-07-05 10:07:11.188 INFO oss_fuzz - analyse_folder: Loading tree-sitter trees
Step #6 - "compile-libfuzzer-introspector-x86_64": 2026-07-05 10:07:11.214 INFO frontend_c_cpp - load_treesitter_trees: harness: /src/snappy/snappy_uncompress_fuzzer.cc
Step #6 - "compile-libfuzzer-introspector-x86_64": 2026-07-05 10:07:13.094 INFO frontend_c_cpp - load_treesitter_trees: harness: /src/snappy/snappy_compress_fuzzer.cc
Step #6 - "compile-libfuzzer-introspector-x86_64": 2026-07-05 10:15:37.894 INFO oss_fuzz - analyse_folder: Dump methods for snappy_uncompress_fuzzer
Step #6 - "compile-libfuzzer-introspector-x86_64": 2026-07-05 10:15:37.894 INFO datatypes - dump_module_logic: Generating report
Step #6 - "compile-libfuzzer-introspector-x86_64": 2026-07-05 11:02:16.715 INFO datatypes - dump_module_logic: Report generated
Step #6 - "compile-libfuzzer-introspector-x86_64": 2026-07-05 11:02:17.817 INFO datatypes - dump_module_logic: Dumping project-wide logic.
Step #6 - "compile-libfuzzer-introspector-x86_64": 2026-07-05 11:02:17.817 INFO datatypes - dump_module_logic: Using safe yaml safe C dumper.
Step #6 - "compile-libfuzzer-introspector-x86_64": 2026-07-05 11:02:29.733 INFO datatypes - dump_module_logic: Dumped
Step #6 - "compile-libfuzzer-introspector-x86_64": 2026-07-05 11:02:29.771 INFO oss_fuzz - analyse_folder: Extracting calltree for snappy_uncompress_fuzzer
Step #6 - "compile-libfuzzer-introspector-x86_64": 2026-07-05 11:02:29.921 INFO oss_fuzz - analyse_folder: Calltree extracted
Step #6 - "compile-libfuzzer-introspector-x86_64": 2026-07-05 11:02:29.921 INFO datatypes - dump_type_definition: Dumping custom type definitions.
Step #6 - "compile-libfuzzer-introspector-x86_64": 2026-07-05 11:02:29.931 INFO datatypes - dump_type_definition: Custom type definitions dumping completed.
Step #6 - "compile-libfuzzer-introspector-x86_64": 2026-07-05 11:02:29.931 INFO datatypes - dump_macro_block_info: Dumping macro blocks information.
Step #6 - "compile-libfuzzer-introspector-x86_64": 2026-07-05 11:02:29.946 INFO datatypes - dump_macro_block_info: Macro blocks information dumping completed.
Step #6 - "compile-libfuzzer-introspector-x86_64": 2026-07-05 11:02:29.946 INFO oss_fuzz - analyse_folder: Dump methods for snappy_compress_fuzzer
Step #6 - "compile-libfuzzer-introspector-x86_64": 2026-07-05 11:02:29.946 INFO datatypes - dump_module_logic: Generating report
Step #6 - "compile-libfuzzer-introspector-x86_64": 2026-07-05 11:02:30.720 INFO datatypes - dump_module_logic: Report generated
Step #6 - "compile-libfuzzer-introspector-x86_64": 2026-07-05 11:02:31.522 INFO datatypes - dump_module_logic: Dumping project-wide logic.
Step #6 - "compile-libfuzzer-introspector-x86_64": 2026-07-05 11:02:31.522 INFO datatypes - dump_module_logic: Using safe yaml safe C dumper.
Step #6 - "compile-libfuzzer-introspector-x86_64": 2026-07-05 11:02:43.633 INFO datatypes - dump_module_logic: Dumped
Step #6 - "compile-libfuzzer-introspector-x86_64": 2026-07-05 11:02:43.678 INFO oss_fuzz - analyse_folder: Extracting calltree for snappy_compress_fuzzer
Step #6 - "compile-libfuzzer-introspector-x86_64": 2026-07-05 11:02:44.255 INFO oss_fuzz - analyse_folder: Calltree extracted
Step #6 - "compile-libfuzzer-introspector-x86_64": 2026-07-05 11:02:44.256 INFO datatypes - dump_type_definition: Dumping custom type definitions.
Step #6 - "compile-libfuzzer-introspector-x86_64": 2026-07-05 11:02:44.270 INFO datatypes - dump_type_definition: Custom type definitions dumping completed.
Step #6 - "compile-libfuzzer-introspector-x86_64": 2026-07-05 11:02:44.271 INFO datatypes - dump_macro_block_info: Dumping macro blocks information.
Step #6 - "compile-libfuzzer-introspector-x86_64": 2026-07-05 11:02:44.289 INFO datatypes - dump_macro_block_info: Macro blocks information dumping completed.
Step #6 - "compile-libfuzzer-introspector-x86_64": 2026-07-05 11:02:44.289 INFO commands - analyse_end_to_end: No harness list at place
Step #6 - "compile-libfuzzer-introspector-x86_64": 2026-07-05 11:02:44.289 INFO commands - run_analysis_on_dir: Running analysis
Step #6 - "compile-libfuzzer-introspector-x86_64": 2026-07-05 11:02:44.315 INFO analysis - load_data_files: Loading profiles using files
Step #6 - "compile-libfuzzer-introspector-x86_64": 2026-07-05 11:02:44.315 INFO data_loader - load_all_profiles: Loading profiles from /src/inspector
Step #6 - "compile-libfuzzer-introspector-x86_64": 2026-07-05 11:02:44.316 INFO data_loader - load_all_profiles: []
Step #6 - "compile-libfuzzer-introspector-x86_64": 2026-07-05 11:02:44.316 INFO data_loader - load_all_profiles: - found 2 profiles to load
Step #6 - "compile-libfuzzer-introspector-x86_64": 2026-07-05 11:02:44.344 INFO data_loader - read_fuzzer_data_file_to_profile: - loading /src/inspector/fuzzerLogFile-snappy_compress_fuzzer.data
Step #6 - "compile-libfuzzer-introspector-x86_64": 2026-07-05 11:02:44.344 INFO data_loader - read_fuzzer_data_file_to_profile: target data f: /src/inspector/fuzzerLogFile-snappy_compress_fuzzer.data
Step #6 - "compile-libfuzzer-introspector-x86_64": 2026-07-05 11:02:44.344 INFO utils - data_file_read_yaml: Set base loader to use CSafeLoader
Step #6 - "compile-libfuzzer-introspector-x86_64": 2026-07-05 11:02:44.347 INFO data_loader - read_fuzzer_data_file_to_profile: - loading /src/inspector/fuzzerLogFile-snappy_uncompress_fuzzer.data
Step #6 - "compile-libfuzzer-introspector-x86_64": 2026-07-05 11:02:44.347 INFO data_loader - read_fuzzer_data_file_to_profile: target data f: /src/inspector/fuzzerLogFile-snappy_uncompress_fuzzer.data
Step #6 - "compile-libfuzzer-introspector-x86_64": 2026-07-05 11:02:44.347 INFO utils - data_file_read_yaml: Set base loader to use CSafeLoader
Step #6 - "compile-libfuzzer-introspector-x86_64": 2026-07-05 11:03:01.828 INFO utils - data_file_read_yaml: Loaded single yaml module
Step #6 - "compile-libfuzzer-introspector-x86_64": 2026-07-05 11:03:01.840 INFO utils - data_file_read_yaml: Loaded single yaml module
Step #6 - "compile-libfuzzer-introspector-x86_64": 2026-07-05 11:03:02.299 INFO data_loader - read_fuzzer_data_file_to_profile: Returning profile
Step #6 - "compile-libfuzzer-introspector-x86_64": 2026-07-05 11:03:02.311 INFO data_loader - read_fuzzer_data_file_to_profile: Returning profile
Step #6 - "compile-libfuzzer-introspector-x86_64": 2026-07-05 11:03:02.988 INFO analysis - load_data_files: Found 2 profiles
Step #6 - "compile-libfuzzer-introspector-x86_64": 2026-07-05 11:03:02.989 INFO analysis - load_data_files: [+] Accummulating profiles
Step #6 - "compile-libfuzzer-introspector-x86_64": 2026-07-05 11:03:02.989 INFO analysis - load_data_files: Accummulating using multiprocessing
Step #6 - "compile-libfuzzer-introspector-x86_64": 2026-07-05 11:03:03.013 INFO fuzzer_profile - accummulate_profile: /src/snappy/snappy_compress_fuzzer.cc: propagating functions reached
Step #6 - "compile-libfuzzer-introspector-x86_64": 2026-07-05 11:03:03.019 INFO fuzzer_profile - accummulate_profile: /src/snappy/snappy_uncompress_fuzzer.cc: propagating functions reached
Step #6 - "compile-libfuzzer-introspector-x86_64": 2026-07-05 11:03:03.063 INFO fuzzer_profile - accummulate_profile: /src/snappy/snappy_compress_fuzzer.cc: setting reached funcs
Step #6 - "compile-libfuzzer-introspector-x86_64": 2026-07-05 11:03:03.063 INFO fuzzer_profile - accummulate_profile: /src/snappy/snappy_compress_fuzzer.cc: setting unreached funcs
Step #6 - "compile-libfuzzer-introspector-x86_64": 2026-07-05 11:03:03.066 INFO fuzzer_profile - accummulate_profile: /src/snappy/snappy_uncompress_fuzzer.cc: setting reached funcs
Step #6 - "compile-libfuzzer-introspector-x86_64": 2026-07-05 11:03:03.066 INFO fuzzer_profile - accummulate_profile: /src/snappy/snappy_uncompress_fuzzer.cc: setting unreached funcs
Step #6 - "compile-libfuzzer-introspector-x86_64": 2026-07-05 11:03:03.067 INFO fuzzer_profile - accummulate_profile: /src/snappy/snappy_compress_fuzzer.cc: loading coverage
Step #6 - "compile-libfuzzer-introspector-x86_64": 2026-07-05 11:03:03.067 INFO fuzzer_profile - _load_coverage: Loading coverage of type c-cpp
Step #6 - "compile-libfuzzer-introspector-x86_64": 2026-07-05 11:03:03.067 INFO code_coverage - load_llvm_coverage: Loading LLVM coverage for target /src/snappy/snappy_compress_fuzzer.cc
Step #6 - "compile-libfuzzer-introspector-x86_64": 2026-07-05 11:03:03.067 INFO code_coverage - load_llvm_coverage: Found 0 coverage reports
Step #6 - "compile-libfuzzer-introspector-x86_64": 2026-07-05 11:03:03.067 INFO code_coverage - load_llvm_coverage: Using the following coverages []
Step #6 - "compile-libfuzzer-introspector-x86_64": 2026-07-05 11:03:03.067 INFO fuzzer_profile - accummulate_profile: /src/snappy/snappy_compress_fuzzer.cc: setting file targets
Step #6 - "compile-libfuzzer-introspector-x86_64": 2026-07-05 11:03:03.068 INFO fuzzer_profile - accummulate_profile: /src/snappy/snappy_compress_fuzzer.cc: setting total basic blocks
Step #6 - "compile-libfuzzer-introspector-x86_64": 2026-07-05 11:03:03.068 INFO fuzzer_profile - accummulate_profile: /src/snappy/snappy_compress_fuzzer.cc: setting cyclomatic complexity
Step #6 - "compile-libfuzzer-introspector-x86_64": 2026-07-05 11:03:03.068 INFO fuzzer_profile - accummulate_profile: /src/snappy/snappy_compress_fuzzer.cc: setting fd cache
Step #6 - "compile-libfuzzer-introspector-x86_64": 2026-07-05 11:03:03.069 INFO fuzzer_profile - accummulate_profile: /src/snappy/snappy_uncompress_fuzzer.cc: loading coverage
Step #6 - "compile-libfuzzer-introspector-x86_64": 2026-07-05 11:03:03.069 INFO fuzzer_profile - _load_coverage: Loading coverage of type c-cpp
Step #6 - "compile-libfuzzer-introspector-x86_64": 2026-07-05 11:03:03.069 INFO code_coverage - load_llvm_coverage: Loading LLVM coverage for target /src/snappy/snappy_uncompress_fuzzer.cc
Step #6 - "compile-libfuzzer-introspector-x86_64": 2026-07-05 11:03:03.070 INFO code_coverage - load_llvm_coverage: Found 0 coverage reports
Step #6 - "compile-libfuzzer-introspector-x86_64": 2026-07-05 11:03:03.070 INFO code_coverage - load_llvm_coverage: Using the following coverages []
Step #6 - "compile-libfuzzer-introspector-x86_64": 2026-07-05 11:03:03.070 INFO fuzzer_profile - accummulate_profile: /src/snappy/snappy_uncompress_fuzzer.cc: setting file targets
Step #6 - "compile-libfuzzer-introspector-x86_64": 2026-07-05 11:03:03.070 INFO fuzzer_profile - accummulate_profile: /src/snappy/snappy_uncompress_fuzzer.cc: setting total basic blocks
Step #6 - "compile-libfuzzer-introspector-x86_64": 2026-07-05 11:03:03.070 INFO fuzzer_profile - accummulate_profile: /src/snappy/snappy_uncompress_fuzzer.cc: setting cyclomatic complexity
Step #6 - "compile-libfuzzer-introspector-x86_64": 2026-07-05 11:03:03.070 INFO fuzzer_profile - accummulate_profile: /src/snappy/snappy_uncompress_fuzzer.cc: setting fd cache
Step #6 - "compile-libfuzzer-introspector-x86_64": 2026-07-05 11:03:03.077 INFO fuzzer_profile - accummulate_profile: /src/snappy/snappy_compress_fuzzer.cc: setting reached funcs in runtime
Step #6 - "compile-libfuzzer-introspector-x86_64": 2026-07-05 11:03:03.077 INFO fuzzer_profile - accummulate_profile: /src/snappy/snappy_compress_fuzzer.cc: finished accummulating profile
Step #6 - "compile-libfuzzer-introspector-x86_64": 2026-07-05 11:03:03.077 INFO fuzzer_profile - accummulate_profile: /src/snappy/snappy_uncompress_fuzzer.cc: setting reached funcs in runtime
Step #6 - "compile-libfuzzer-introspector-x86_64": 2026-07-05 11:03:03.078 INFO fuzzer_profile - accummulate_profile: /src/snappy/snappy_uncompress_fuzzer.cc: finished accummulating profile
Step #6 - "compile-libfuzzer-introspector-x86_64": 2026-07-05 11:03:03.524 INFO analysis - load_data_files: [+] Creating project profile
Step #6 - "compile-libfuzzer-introspector-x86_64": 2026-07-05 11:03:03.524 INFO project_profile - __init__: Creating merged profile of 2 profiles
Step #6 - "compile-libfuzzer-introspector-x86_64": 2026-07-05 11:03:03.524 INFO project_profile - __init__: Populating functions reached
Step #6 - "compile-libfuzzer-introspector-x86_64": 2026-07-05 11:03:03.524 INFO project_profile - __init__: Populating functions unreached
Step #6 - "compile-libfuzzer-introspector-x86_64": 2026-07-05 11:03:03.526 INFO project_profile - __init__: Creating all_functions dictionary
Step #6 - "compile-libfuzzer-introspector-x86_64": 2026-07-05 11:03:03.557 INFO project_profile - __init__: Gathering complexity and incoming references of each function
Step #6 - "compile-libfuzzer-introspector-x86_64": 2026-07-05 11:03:03.593 INFO project_profile - __init__: Completed creationg of merged profile
Step #6 - "compile-libfuzzer-introspector-x86_64": 2026-07-05 11:03:03.593 INFO analysis - load_data_files: [+] Refining profiles
Step #6 - "compile-libfuzzer-introspector-x86_64": 2026-07-05 11:03:03.610 INFO utils - get_target_coverage_url: Extracting coverage for https://storage.googleapis.com/oss-fuzz-coverage/snappy/reports/20260705/linux -- snappy_uncompress_fuzzer.cc
Step #6 - "compile-libfuzzer-introspector-x86_64": 2026-07-05 11:03:03.610 INFO analysis - overlay_calltree_with_coverage: Using coverage url: https://storage.googleapis.com/oss-fuzz-coverage/snappy/reports-by-target/20260705/snappy_uncompress_fuzzer.cc/linux
Step #6 - "compile-libfuzzer-introspector-x86_64": 2026-07-05 11:03:03.611 INFO analysis - get_node_coverage_hitcount: There is no coverage data (not even all negative).
Step #6 - "compile-libfuzzer-introspector-x86_64": 2026-07-05 11:03:03.611 INFO analysis - overlay_calltree_with_coverage: Overlaying 2
Step #6 - "compile-libfuzzer-introspector-x86_64": 2026-07-05 11:03:03.611 INFO analysis - overlay_calltree_with_coverage: Overlaying 3
Step #6 - "compile-libfuzzer-introspector-x86_64": 2026-07-05 11:03:03.611 INFO analysis - overlay_calltree_with_coverage: Updating branch complexities
Step #6 - "compile-libfuzzer-introspector-x86_64": 2026-07-05 11:03:03.613 INFO analysis - overlay_calltree_with_coverage: [+] found 0 branch blockers.
Step #6 - "compile-libfuzzer-introspector-x86_64": 2026-07-05 11:03:03.613 INFO utils - get_target_coverage_url: Extracting coverage for https://storage.googleapis.com/oss-fuzz-coverage/snappy/reports/20260705/linux -- snappy_compress_fuzzer.cc
Step #6 - "compile-libfuzzer-introspector-x86_64": 2026-07-05 11:03:03.613 INFO analysis - overlay_calltree_with_coverage: Using coverage url: https://storage.googleapis.com/oss-fuzz-coverage/snappy/reports-by-target/20260705/snappy_compress_fuzzer.cc/linux
Step #6 - "compile-libfuzzer-introspector-x86_64": 2026-07-05 11:03:03.613 INFO analysis - get_node_coverage_hitcount: There is no coverage data (not even all negative).
Step #6 - "compile-libfuzzer-introspector-x86_64": 2026-07-05 11:03:03.614 INFO analysis - overlay_calltree_with_coverage: Overlaying 2
Step #6 - "compile-libfuzzer-introspector-x86_64": 2026-07-05 11:03:03.614 INFO analysis - overlay_calltree_with_coverage: Overlaying 3
Step #6 - "compile-libfuzzer-introspector-x86_64": 2026-07-05 11:03:03.614 INFO analysis - overlay_calltree_with_coverage: Updating branch complexities
Step #6 - "compile-libfuzzer-introspector-x86_64": 2026-07-05 11:03:03.615 INFO analysis - overlay_calltree_with_coverage: [+] found 0 branch blockers.
Step #6 - "compile-libfuzzer-introspector-x86_64": 2026-07-05 11:03:03.655 INFO commands - run_analysis_on_dir: Analyses to run: ['OptimalTargets', 'FuzzEngineInputAnalysis', 'RuntimeCoverageAnalysis', 'FuzzDriverSynthesizerAnalysis', 'BugDigestorAnalysis', 'FilePathAnalyser', 'ThirdPartyAPICoverageAnalyser', 'MetadataAnalysis', 'SinkCoverageAnalyser', 'AnnotatedCFG', 'SourceCodeLineAnalyser', 'FarReachLowCoverageAnalyser', 'PublicCandidateAnalyser', 'FrontendAnalyser']
Step #6 - "compile-libfuzzer-introspector-x86_64": 2026-07-05 11:03:03.655 INFO commands - run_analysis_on_dir: [+] Creating HTML report
Step #6 - "compile-libfuzzer-introspector-x86_64": 2026-07-05 11:03:03.655 INFO html_report - create_html_report: - Creating HTML report
Step #6 - "compile-libfuzzer-introspector-x86_64": 2026-07-05 11:03:03.655 INFO html_report - create_section_project_overview: - Creating reachability overview table
Step #6 - "compile-libfuzzer-introspector-x86_64": 2026-07-05 11:03:03.703 INFO html_report - create_section_fuzzers_overview: - Creating table with overview of all fuzzers
Step #6 - "compile-libfuzzer-introspector-x86_64": 2026-07-05 11:03:03.703 INFO html_report - create_section_all_functions: - Creating table with information about all functions in target
Step #6 - "compile-libfuzzer-introspector-x86_64": 2026-07-05 11:03:03.776 INFO html_report - create_all_function_table: Assembled a total of 4718 entries
Step #6 - "compile-libfuzzer-introspector-x86_64": 2026-07-05 11:03:03.776 INFO html_report - create_section_fuzzer_detailed_section: - Creating section with details about each fuzzer
Step #6 - "compile-libfuzzer-introspector-x86_64": 2026-07-05 11:03:03.776 INFO calltree_analysis - __init__: Creating FuzzCalltreeAnalysis
Step #6 - "compile-libfuzzer-introspector-x86_64": 2026-07-05 11:03:03.777 INFO calltree_analysis - create_calltree: In calltree
Step #6 - "compile-libfuzzer-introspector-x86_64": 2026-07-05 11:03:03.777 INFO calltree_analysis - create_calltree: At end
Step #6 - "compile-libfuzzer-introspector-x86_64": 2026-07-05 11:03:03.777 INFO calltree_analysis - create_calltree: calltree_html_section_string: : 20 -- : 20
Step #6 - "compile-libfuzzer-introspector-x86_64": 2026-07-05 11:03:03.777 INFO calltree_analysis - create_calltree: Calltree created
Step #6 - "compile-libfuzzer-introspector-x86_64": 2026-07-05 11:03:03.777 INFO calltree_analysis - create_fuzz_blocker_table: Creating fuzz blocker table
Step #6 - "compile-libfuzzer-introspector-x86_64": 2026-07-05 11:03:04.095 INFO font_manager - _load_fontmanager: generated new fontManager
Step #6 - "compile-libfuzzer-introspector-x86_64": 2026-07-05 11:03:04.267 INFO html_helpers - create_horisontal_calltree_image: Creating image snappy_uncompress_fuzzer.cc_colormap.png
Step #6 - "compile-libfuzzer-introspector-x86_64": 2026-07-05 11:03:04.267 INFO html_helpers - create_horisontal_calltree_image: - extracted the callsites (14 nodes)
Step #6 - "compile-libfuzzer-introspector-x86_64": 2026-07-05 11:03:04.284 INFO html_helpers - create_horisontal_calltree_image: - iterated over color list
Step #6 - "compile-libfuzzer-introspector-x86_64": 2026-07-05 11:03:04.284 INFO html_helpers - create_horisontal_calltree_image: - saving image
Step #6 - "compile-libfuzzer-introspector-x86_64": 2026-07-05 11:03:04.350 INFO html_helpers - create_horisontal_calltree_image: - image saved
Step #6 - "compile-libfuzzer-introspector-x86_64": 2026-07-05 11:03:04.350 INFO calltree_analysis - __init__: Creating FuzzCalltreeAnalysis
Step #6 - "compile-libfuzzer-introspector-x86_64": 2026-07-05 11:03:04.350 INFO calltree_analysis - create_calltree: In calltree
Step #6 - "compile-libfuzzer-introspector-x86_64": 2026-07-05 11:03:04.351 INFO calltree_analysis - create_calltree: At end
Step #6 - "compile-libfuzzer-introspector-x86_64": 2026-07-05 11:03:04.351 INFO calltree_analysis - create_calltree: calltree_html_section_string: : 56 -- : 56
Step #6 - "compile-libfuzzer-introspector-x86_64": 2026-07-05 11:03:04.351 INFO calltree_analysis - create_calltree: Calltree created
Step #6 - "compile-libfuzzer-introspector-x86_64": 2026-07-05 11:03:04.351 INFO calltree_analysis - create_fuzz_blocker_table: Creating fuzz blocker table
Step #6 - "compile-libfuzzer-introspector-x86_64": 2026-07-05 11:03:04.370 INFO html_helpers - create_horisontal_calltree_image: Creating image snappy_compress_fuzzer.cc_colormap.png
Step #6 - "compile-libfuzzer-introspector-x86_64": 2026-07-05 11:03:04.370 INFO html_helpers - create_horisontal_calltree_image: - extracted the callsites (44 nodes)
Step #6 - "compile-libfuzzer-introspector-x86_64": 2026-07-05 11:03:04.383 INFO html_helpers - create_horisontal_calltree_image: - iterated over color list
Step #6 - "compile-libfuzzer-introspector-x86_64": 2026-07-05 11:03:04.383 INFO html_helpers - create_horisontal_calltree_image: - saving image
Step #6 - "compile-libfuzzer-introspector-x86_64": 2026-07-05 11:03:04.436 INFO html_helpers - create_horisontal_calltree_image: - image saved
Step #6 - "compile-libfuzzer-introspector-x86_64": 2026-07-05 11:03:04.437 INFO html_report - create_section_optional_analyses: - Handling optional analyses
Step #6 - "compile-libfuzzer-introspector-x86_64": 2026-07-05 11:03:04.437 INFO optimal_targets - analysis_func: - Running analysis OptimalTargets
Step #6 - "compile-libfuzzer-introspector-x86_64": 2026-07-05 11:03:04.437 INFO optimal_targets - iteratively_get_optimal_targets: - in iteratively_get_optimal_targets
Step #6 - "compile-libfuzzer-introspector-x86_64": 2026-07-05 11:03:04.846 INFO optimal_targets - analysis_get_optimal_targets: - in analysis_get_optimal_targets
Step #6 - "compile-libfuzzer-introspector-x86_64": 2026-07-05 11:03:04.846 INFO optimal_targets - analysis_get_optimal_targets: Filtering optimal functions from 4718 functions
Step #6 - "compile-libfuzzer-introspector-x86_64": 2026-07-05 11:03:04.849 INFO optimal_targets - analysis_get_optimal_targets: Found a total of 25 potential targets
Step #6 - "compile-libfuzzer-introspector-x86_64": 2026-07-05 11:03:04.849 INFO optimal_targets - iteratively_get_optimal_targets: Getting 7 optimal targets
Step #6 - "compile-libfuzzer-introspector-x86_64": 2026-07-05 11:03:04.849 INFO optimal_targets - iteratively_get_optimal_targets: - sorting by unreached complexity.
Step #6 - "compile-libfuzzer-introspector-x86_64": 2026-07-05 11:03:04.849 INFO optimal_targets - add_func_to_reached_and_clone: Creating a deepcopy
Step #6 - "compile-libfuzzer-introspector-x86_64": 2026-07-05 11:03:05.252 INFO optimal_targets - add_func_to_reached_and_clone: Updating hitcount
Step #6 - "compile-libfuzzer-introspector-x86_64": 2026-07-05 11:03:05.253 INFO optimal_targets - add_func_to_reached_and_clone: Updating hitcount-related data
Step #6 - "compile-libfuzzer-introspector-x86_64": 2026-07-05 11:03:05.279 INFO optimal_targets - analysis_get_optimal_targets: - in analysis_get_optimal_targets
Step #6 - "compile-libfuzzer-introspector-x86_64": 2026-07-05 11:03:05.279 INFO optimal_targets - analysis_get_optimal_targets: Filtering optimal functions from 4718 functions
Step #6 - "compile-libfuzzer-introspector-x86_64": 2026-07-05 11:03:05.281 INFO optimal_targets - analysis_get_optimal_targets: Found a total of 17 potential targets
Step #6 - "compile-libfuzzer-introspector-x86_64": 2026-07-05 11:03:05.281 INFO optimal_targets - iteratively_get_optimal_targets: - sorting by unreached complexity.
Step #6 - "compile-libfuzzer-introspector-x86_64": 2026-07-05 11:03:05.281 INFO optimal_targets - add_func_to_reached_and_clone: Creating a deepcopy
Step #6 - "compile-libfuzzer-introspector-x86_64": 2026-07-05 11:03:06.275 INFO optimal_targets - add_func_to_reached_and_clone: Updating hitcount
Step #6 - "compile-libfuzzer-introspector-x86_64": 2026-07-05 11:03:06.276 INFO optimal_targets - add_func_to_reached_and_clone: Updating hitcount-related data
Step #6 - "compile-libfuzzer-introspector-x86_64": 2026-07-05 11:03:06.300 INFO optimal_targets - analysis_get_optimal_targets: - in analysis_get_optimal_targets
Step #6 - "compile-libfuzzer-introspector-x86_64": 2026-07-05 11:03:06.301 INFO optimal_targets - analysis_get_optimal_targets: Filtering optimal functions from 4718 functions
Step #6 - "compile-libfuzzer-introspector-x86_64": 2026-07-05 11:03:06.305 INFO optimal_targets - analysis_get_optimal_targets: Found a total of 16 potential targets
Step #6 - "compile-libfuzzer-introspector-x86_64": 2026-07-05 11:03:06.305 INFO optimal_targets - iteratively_get_optimal_targets: - sorting by unreached complexity.
Step #6 - "compile-libfuzzer-introspector-x86_64": 2026-07-05 11:03:06.305 INFO optimal_targets - add_func_to_reached_and_clone: Creating a deepcopy
Step #6 - "compile-libfuzzer-introspector-x86_64": 2026-07-05 11:03:06.713 INFO optimal_targets - add_func_to_reached_and_clone: Updating hitcount
Step #6 - "compile-libfuzzer-introspector-x86_64": 2026-07-05 11:03:06.714 INFO optimal_targets - add_func_to_reached_and_clone: Updating hitcount-related data
Step #6 - "compile-libfuzzer-introspector-x86_64": 2026-07-05 11:03:06.741 INFO optimal_targets - analysis_get_optimal_targets: - in analysis_get_optimal_targets
Step #6 - "compile-libfuzzer-introspector-x86_64": 2026-07-05 11:03:06.742 INFO optimal_targets - analysis_get_optimal_targets: Filtering optimal functions from 4718 functions
Step #6 - "compile-libfuzzer-introspector-x86_64": 2026-07-05 11:03:06.745 INFO optimal_targets - analysis_get_optimal_targets: Found a total of 12 potential targets
Step #6 - "compile-libfuzzer-introspector-x86_64": 2026-07-05 11:03:06.745 INFO optimal_targets - iteratively_get_optimal_targets: - sorting by unreached complexity.
Step #6 - "compile-libfuzzer-introspector-x86_64": 2026-07-05 11:03:06.745 INFO optimal_targets - add_func_to_reached_and_clone: Creating a deepcopy
Step #6 - "compile-libfuzzer-introspector-x86_64": 2026-07-05 11:03:07.157 INFO optimal_targets - add_func_to_reached_and_clone: Updating hitcount
Step #6 - "compile-libfuzzer-introspector-x86_64": 2026-07-05 11:03:07.158 INFO optimal_targets - add_func_to_reached_and_clone: Updating hitcount-related data
Step #6 - "compile-libfuzzer-introspector-x86_64": 2026-07-05 11:03:07.184 INFO optimal_targets - analysis_get_optimal_targets: - in analysis_get_optimal_targets
Step #6 - "compile-libfuzzer-introspector-x86_64": 2026-07-05 11:03:07.185 INFO optimal_targets - analysis_get_optimal_targets: Filtering optimal functions from 4718 functions
Step #6 - "compile-libfuzzer-introspector-x86_64": 2026-07-05 11:03:07.189 INFO optimal_targets - analysis_get_optimal_targets: Found a total of 8 potential targets
Step #6 - "compile-libfuzzer-introspector-x86_64": 2026-07-05 11:03:07.189 INFO optimal_targets - iteratively_get_optimal_targets: - sorting by unreached complexity.
Step #6 - "compile-libfuzzer-introspector-x86_64": 2026-07-05 11:03:07.189 INFO optimal_targets - add_func_to_reached_and_clone: Creating a deepcopy
Step #6 - "compile-libfuzzer-introspector-x86_64": 2026-07-05 11:03:07.592 INFO optimal_targets - add_func_to_reached_and_clone: Updating hitcount
Step #6 - "compile-libfuzzer-introspector-x86_64": 2026-07-05 11:03:07.593 INFO optimal_targets - add_func_to_reached_and_clone: Updating hitcount-related data
Step #6 - "compile-libfuzzer-introspector-x86_64": 2026-07-05 11:03:07.621 INFO optimal_targets - analysis_get_optimal_targets: - in analysis_get_optimal_targets
Step #6 - "compile-libfuzzer-introspector-x86_64": 2026-07-05 11:03:07.622 INFO optimal_targets - analysis_get_optimal_targets: Filtering optimal functions from 4718 functions
Step #6 - "compile-libfuzzer-introspector-x86_64": 2026-07-05 11:03:07.625 INFO optimal_targets - analysis_get_optimal_targets: Found a total of 7 potential targets
Step #6 - "compile-libfuzzer-introspector-x86_64": 2026-07-05 11:03:07.625 INFO optimal_targets - iteratively_get_optimal_targets: - sorting by unreached complexity.
Step #6 - "compile-libfuzzer-introspector-x86_64": 2026-07-05 11:03:07.625 INFO optimal_targets - add_func_to_reached_and_clone: Creating a deepcopy
Step #6 - "compile-libfuzzer-introspector-x86_64": 2026-07-05 11:03:08.538 INFO optimal_targets - add_func_to_reached_and_clone: Updating hitcount
Step #6 - "compile-libfuzzer-introspector-x86_64": 2026-07-05 11:03:08.539 INFO optimal_targets - add_func_to_reached_and_clone: Updating hitcount-related data
Step #6 - "compile-libfuzzer-introspector-x86_64": 2026-07-05 11:03:08.564 INFO optimal_targets - analysis_get_optimal_targets: - in analysis_get_optimal_targets
Step #6 - "compile-libfuzzer-introspector-x86_64": 2026-07-05 11:03:08.565 INFO optimal_targets - analysis_get_optimal_targets: Filtering optimal functions from 4718 functions
Step #6 - "compile-libfuzzer-introspector-x86_64": 2026-07-05 11:03:08.568 INFO optimal_targets - analysis_get_optimal_targets: Found a total of 6 potential targets
Step #6 - "compile-libfuzzer-introspector-x86_64": 2026-07-05 11:03:08.568 INFO optimal_targets - iteratively_get_optimal_targets: - sorting by unreached complexity.
Step #6 - "compile-libfuzzer-introspector-x86_64": 2026-07-05 11:03:08.568 INFO optimal_targets - add_func_to_reached_and_clone: Creating a deepcopy
Step #6 - "compile-libfuzzer-introspector-x86_64": 2026-07-05 11:03:08.985 INFO optimal_targets - add_func_to_reached_and_clone: Updating hitcount
Step #6 - "compile-libfuzzer-introspector-x86_64": 2026-07-05 11:03:08.987 INFO optimal_targets - add_func_to_reached_and_clone: Updating hitcount-related data
Step #6 - "compile-libfuzzer-introspector-x86_64": 2026-07-05 11:03:09.016 INFO optimal_targets - iteratively_get_optimal_targets: Found the following optimal functions: { ['testing::ParseFlagsTest::TestParsingFlags', 'benchmark::GetCPUCyclesPerSecond', 'snappy::Verify', 'testing::internal::XmlUnitTestResultPrinter::PrintXmlUnitTest', 'DecompressAllTags', 'benchmark::RunSpecifiedBenchmarks', 'MeasureFile'] }
Step #6 - "compile-libfuzzer-introspector-x86_64": 2026-07-05 11:03:09.112 INFO html_report - create_all_function_table: Assembled a total of 4718 entries
Step #6 - "compile-libfuzzer-introspector-x86_64": 2026-07-05 11:03:09.176 INFO optimal_targets - analysis_func: - Completed analysis OptimalTargets
Step #6 - "compile-libfuzzer-introspector-x86_64": 2026-07-05 11:03:09.195 INFO engine_input - analysis_func: - Running analysis FuzzEngineInputAnalysis
Step #6 - "compile-libfuzzer-introspector-x86_64": 2026-07-05 11:03:09.195 INFO engine_input - analysis_func: Generating input for snappy_uncompress_fuzzer.cc
Step #6 - "compile-libfuzzer-introspector-x86_64": 2026-07-05 11:03:09.196 INFO calltree_analysis - __init__: Creating FuzzCalltreeAnalysis
Step #6 - "compile-libfuzzer-introspector-x86_64": 2026-07-05 11:03:09.196 INFO engine_input - analysis_func: Generating input for snappy_compress_fuzzer.cc
Step #6 - "compile-libfuzzer-introspector-x86_64": 2026-07-05 11:03:09.197 INFO calltree_analysis - __init__: Creating FuzzCalltreeAnalysis
Step #6 - "compile-libfuzzer-introspector-x86_64": 2026-07-05 11:03:09.197 INFO engine_input - analysis_func: - Completed analysis FuzzEngineInputAnalysis
Step #6 - "compile-libfuzzer-introspector-x86_64": 2026-07-05 11:03:09.197 INFO runtime_coverage_analysis - analysis_func: - Running analysis RuntimeCoverageAnalysis
Step #6 - "compile-libfuzzer-introspector-x86_64": 2026-07-05 11:03:09.197 INFO runtime_coverage_analysis - analysis_func: - Completed analysis RuntimeCoverageAnalysis
Step #6 - "compile-libfuzzer-introspector-x86_64": 2026-07-05 11:03:09.197 INFO driver_synthesizer - analysis_func: - Running analysis FuzzDriverSynthesizerAnalysis
Step #6 - "compile-libfuzzer-introspector-x86_64": 2026-07-05 11:03:09.197 INFO optimal_targets - iteratively_get_optimal_targets: - in iteratively_get_optimal_targets
Step #6 - "compile-libfuzzer-introspector-x86_64": 2026-07-05 11:03:09.640 INFO optimal_targets - analysis_get_optimal_targets: - in analysis_get_optimal_targets
Step #6 - "compile-libfuzzer-introspector-x86_64": 2026-07-05 11:03:09.640 INFO optimal_targets - analysis_get_optimal_targets: Filtering optimal functions from 4718 functions
Step #6 - "compile-libfuzzer-introspector-x86_64": 2026-07-05 11:03:09.643 INFO optimal_targets - analysis_get_optimal_targets: Found a total of 25 potential targets
Step #6 - "compile-libfuzzer-introspector-x86_64": 2026-07-05 11:03:09.644 INFO optimal_targets - iteratively_get_optimal_targets: Getting 7 optimal targets
Step #6 - "compile-libfuzzer-introspector-x86_64": 2026-07-05 11:03:09.644 INFO optimal_targets - iteratively_get_optimal_targets: - sorting by unreached complexity.
Step #6 - "compile-libfuzzer-introspector-x86_64": 2026-07-05 11:03:09.644 INFO optimal_targets - add_func_to_reached_and_clone: Creating a deepcopy
Step #6 - "compile-libfuzzer-introspector-x86_64": 2026-07-05 11:03:10.596 INFO optimal_targets - add_func_to_reached_and_clone: Updating hitcount
Step #6 - "compile-libfuzzer-introspector-x86_64": 2026-07-05 11:03:10.597 INFO optimal_targets - add_func_to_reached_and_clone: Updating hitcount-related data
Step #6 - "compile-libfuzzer-introspector-x86_64": 2026-07-05 11:03:10.624 INFO optimal_targets - analysis_get_optimal_targets: - in analysis_get_optimal_targets
Step #6 - "compile-libfuzzer-introspector-x86_64": 2026-07-05 11:03:10.624 INFO optimal_targets - analysis_get_optimal_targets: Filtering optimal functions from 4718 functions
Step #6 - "compile-libfuzzer-introspector-x86_64": 2026-07-05 11:03:10.627 INFO optimal_targets - analysis_get_optimal_targets: Found a total of 17 potential targets
Step #6 - "compile-libfuzzer-introspector-x86_64": 2026-07-05 11:03:10.627 INFO optimal_targets - iteratively_get_optimal_targets: - sorting by unreached complexity.
Step #6 - "compile-libfuzzer-introspector-x86_64": 2026-07-05 11:03:10.627 INFO optimal_targets - add_func_to_reached_and_clone: Creating a deepcopy
Step #6 - "compile-libfuzzer-introspector-x86_64": 2026-07-05 11:03:11.034 INFO optimal_targets - add_func_to_reached_and_clone: Updating hitcount
Step #6 - "compile-libfuzzer-introspector-x86_64": 2026-07-05 11:03:11.036 INFO optimal_targets - add_func_to_reached_and_clone: Updating hitcount-related data
Step #6 - "compile-libfuzzer-introspector-x86_64": 2026-07-05 11:03:11.061 INFO optimal_targets - analysis_get_optimal_targets: - in analysis_get_optimal_targets
Step #6 - "compile-libfuzzer-introspector-x86_64": 2026-07-05 11:03:11.062 INFO optimal_targets - analysis_get_optimal_targets: Filtering optimal functions from 4718 functions
Step #6 - "compile-libfuzzer-introspector-x86_64": 2026-07-05 11:03:11.066 INFO optimal_targets - analysis_get_optimal_targets: Found a total of 16 potential targets
Step #6 - "compile-libfuzzer-introspector-x86_64": 2026-07-05 11:03:11.066 INFO optimal_targets - iteratively_get_optimal_targets: - sorting by unreached complexity.
Step #6 - "compile-libfuzzer-introspector-x86_64": 2026-07-05 11:03:11.066 INFO optimal_targets - add_func_to_reached_and_clone: Creating a deepcopy
Step #6 - "compile-libfuzzer-introspector-x86_64": 2026-07-05 11:03:11.496 INFO optimal_targets - add_func_to_reached_and_clone: Updating hitcount
Step #6 - "compile-libfuzzer-introspector-x86_64": 2026-07-05 11:03:11.497 INFO optimal_targets - add_func_to_reached_and_clone: Updating hitcount-related data
Step #6 - "compile-libfuzzer-introspector-x86_64": 2026-07-05 11:03:11.526 INFO optimal_targets - analysis_get_optimal_targets: - in analysis_get_optimal_targets
Step #6 - "compile-libfuzzer-introspector-x86_64": 2026-07-05 11:03:11.527 INFO optimal_targets - analysis_get_optimal_targets: Filtering optimal functions from 4718 functions
Step #6 - "compile-libfuzzer-introspector-x86_64": 2026-07-05 11:03:11.530 INFO optimal_targets - analysis_get_optimal_targets: Found a total of 12 potential targets
Step #6 - "compile-libfuzzer-introspector-x86_64": 2026-07-05 11:03:11.530 INFO optimal_targets - iteratively_get_optimal_targets: - sorting by unreached complexity.
Step #6 - "compile-libfuzzer-introspector-x86_64": 2026-07-05 11:03:11.530 INFO optimal_targets - add_func_to_reached_and_clone: Creating a deepcopy
Step #6 - "compile-libfuzzer-introspector-x86_64": 2026-07-05 11:03:12.508 INFO optimal_targets - add_func_to_reached_and_clone: Updating hitcount
Step #6 - "compile-libfuzzer-introspector-x86_64": 2026-07-05 11:03:12.509 INFO optimal_targets - add_func_to_reached_and_clone: Updating hitcount-related data
Step #6 - "compile-libfuzzer-introspector-x86_64": 2026-07-05 11:03:12.534 INFO optimal_targets - analysis_get_optimal_targets: - in analysis_get_optimal_targets
Step #6 - "compile-libfuzzer-introspector-x86_64": 2026-07-05 11:03:12.535 INFO optimal_targets - analysis_get_optimal_targets: Filtering optimal functions from 4718 functions
Step #6 - "compile-libfuzzer-introspector-x86_64": 2026-07-05 11:03:12.538 INFO optimal_targets - analysis_get_optimal_targets: Found a total of 8 potential targets
Step #6 - "compile-libfuzzer-introspector-x86_64": 2026-07-05 11:03:12.538 INFO optimal_targets - iteratively_get_optimal_targets: - sorting by unreached complexity.
Step #6 - "compile-libfuzzer-introspector-x86_64": 2026-07-05 11:03:12.538 INFO optimal_targets - add_func_to_reached_and_clone: Creating a deepcopy
Step #6 - "compile-libfuzzer-introspector-x86_64": 2026-07-05 11:03:12.937 INFO optimal_targets - add_func_to_reached_and_clone: Updating hitcount
Step #6 - "compile-libfuzzer-introspector-x86_64": 2026-07-05 11:03:12.937 INFO optimal_targets - add_func_to_reached_and_clone: Updating hitcount-related data
Step #6 - "compile-libfuzzer-introspector-x86_64": 2026-07-05 11:03:12.966 INFO optimal_targets - analysis_get_optimal_targets: - in analysis_get_optimal_targets
Step #6 - "compile-libfuzzer-introspector-x86_64": 2026-07-05 11:03:12.966 INFO optimal_targets - analysis_get_optimal_targets: Filtering optimal functions from 4718 functions
Step #6 - "compile-libfuzzer-introspector-x86_64": 2026-07-05 11:03:12.969 INFO optimal_targets - analysis_get_optimal_targets: Found a total of 7 potential targets
Step #6 - "compile-libfuzzer-introspector-x86_64": 2026-07-05 11:03:12.969 INFO optimal_targets - iteratively_get_optimal_targets: - sorting by unreached complexity.
Step #6 - "compile-libfuzzer-introspector-x86_64": 2026-07-05 11:03:12.969 INFO optimal_targets - add_func_to_reached_and_clone: Creating a deepcopy
Step #6 - "compile-libfuzzer-introspector-x86_64": 2026-07-05 11:03:13.395 INFO optimal_targets - add_func_to_reached_and_clone: Updating hitcount
Step #6 - "compile-libfuzzer-introspector-x86_64": 2026-07-05 11:03:13.396 INFO optimal_targets - add_func_to_reached_and_clone: Updating hitcount-related data
Step #6 - "compile-libfuzzer-introspector-x86_64": 2026-07-05 11:03:13.422 INFO optimal_targets - analysis_get_optimal_targets: - in analysis_get_optimal_targets
Step #6 - "compile-libfuzzer-introspector-x86_64": 2026-07-05 11:03:13.422 INFO optimal_targets - analysis_get_optimal_targets: Filtering optimal functions from 4718 functions
Step #6 - "compile-libfuzzer-introspector-x86_64": 2026-07-05 11:03:13.426 INFO optimal_targets - analysis_get_optimal_targets: Found a total of 6 potential targets
Step #6 - "compile-libfuzzer-introspector-x86_64": 2026-07-05 11:03:13.426 INFO optimal_targets - iteratively_get_optimal_targets: - sorting by unreached complexity.
Step #6 - "compile-libfuzzer-introspector-x86_64": 2026-07-05 11:03:13.426 INFO optimal_targets - add_func_to_reached_and_clone: Creating a deepcopy
Step #6 - "compile-libfuzzer-introspector-x86_64": 2026-07-05 11:03:14.395 INFO optimal_targets - add_func_to_reached_and_clone: Updating hitcount
Step #6 - "compile-libfuzzer-introspector-x86_64": 2026-07-05 11:03:14.395 INFO optimal_targets - add_func_to_reached_and_clone: Updating hitcount-related data
Step #6 - "compile-libfuzzer-introspector-x86_64": 2026-07-05 11:03:14.425 INFO optimal_targets - iteratively_get_optimal_targets: Found the following optimal functions: { ['testing::ParseFlagsTest::TestParsingFlags', 'benchmark::GetCPUCyclesPerSecond', 'snappy::Verify', 'testing::internal::XmlUnitTestResultPrinter::PrintXmlUnitTest', 'DecompressAllTags', 'benchmark::RunSpecifiedBenchmarks', 'MeasureFile'] }
Step #6 - "compile-libfuzzer-introspector-x86_64": 2026-07-05 11:03:14.425 INFO driver_synthesizer - analysis_func: . Done
Step #6 - "compile-libfuzzer-introspector-x86_64": 2026-07-05 11:03:14.425 INFO driver_synthesizer - analysis_func: . Done
Step #6 - "compile-libfuzzer-introspector-x86_64": 2026-07-05 11:03:14.425 INFO driver_synthesizer - analysis_func: . Done
Step #6 - "compile-libfuzzer-introspector-x86_64": 2026-07-05 11:03:14.425 INFO driver_synthesizer - analysis_func: . Done
Step #6 - "compile-libfuzzer-introspector-x86_64": 2026-07-05 11:03:14.425 INFO driver_synthesizer - analysis_func: . Done
Step #6 - "compile-libfuzzer-introspector-x86_64": 2026-07-05 11:03:14.425 INFO driver_synthesizer - analysis_func: . Done
Step #6 - "compile-libfuzzer-introspector-x86_64": 2026-07-05 11:03:14.425 INFO driver_synthesizer - analysis_func: . Done
Step #6 - "compile-libfuzzer-introspector-x86_64": 2026-07-05 11:03:14.426 INFO driver_synthesizer - analysis_func: Synthesizing drivers for the following optimal functions: { ['testing::ParseFlagsTest::TestParsingFlags', 'benchmark::GetCPUCyclesPerSecond', 'snappy::Verify', 'testing::internal::XmlUnitTestResultPrinter::PrintXmlUnitTest', 'DecompressAllTags', 'benchmark::RunSpecifiedBenchmarks', 'MeasureFile'] }
Step #6 - "compile-libfuzzer-introspector-x86_64": 2026-07-05 11:03:14.426 INFO driver_synthesizer - analysis_func: - Completed analysis FuzzDriverSynthesizerAnalysis
Step #6 - "compile-libfuzzer-introspector-x86_64": 2026-07-05 11:03:14.443 INFO bug_digestor - analysis_func: - Running analysis BugDigestorAnalysis
Step #6 - "compile-libfuzzer-introspector-x86_64": 2026-07-05 11:03:14.443 INFO filepath_analyser - analysis_func: - Running analysis FilePathAnalyser
Step #6 - "compile-libfuzzer-introspector-x86_64": 2026-07-05 11:03:14.841 INFO function_call_analyser - analysis_func: - Running analysis ThirdPartyAPICoverageAnalyser
Step #6 - "compile-libfuzzer-introspector-x86_64": 2026-07-05 11:03:14.850 INFO metadata - analysis_func: - Running analysis MetadataAnalysis
Step #6 - "compile-libfuzzer-introspector-x86_64": 2026-07-05 11:03:14.851 INFO metadata - analysis_func: - Completed analysis MetadataAnalysis
Step #6 - "compile-libfuzzer-introspector-x86_64": 2026-07-05 11:03:14.852 INFO sinks_analyser - analysis_func: - Running analysis SinkCoverageAnalyser
Step #6 - "compile-libfuzzer-introspector-x86_64": 2026-07-05 11:03:15.223 INFO sinks_analyser - analysis_func: ['snappy_uncompress_fuzzer.cc', 'snappy_compress_fuzzer.cc']
Step #6 - "compile-libfuzzer-introspector-x86_64": 2026-07-05 11:03:15.223 INFO sinks_analyser - analysis_func: - Running analysis SinkCoverageAnalyser for CWE78
Step #6 - "compile-libfuzzer-introspector-x86_64": 2026-07-05 11:03:15.228 INFO sinks_analyser - analysis_func: - Running analysis SinkCoverageAnalyser for CWE79
Step #6 - "compile-libfuzzer-introspector-x86_64": 2026-07-05 11:03:15.233 INFO sinks_analyser - analysis_func: - Running analysis SinkCoverageAnalyser for CWE787
Step #6 - "compile-libfuzzer-introspector-x86_64": 2026-07-05 11:03:15.240 INFO sinks_analyser - analysis_func: - Running analysis SinkCoverageAnalyser for CWE89
Step #6 - "compile-libfuzzer-introspector-x86_64": 2026-07-05 11:03:15.243 INFO sinks_analyser - analysis_func: - Running analysis SinkCoverageAnalyser for CWE416
Step #6 - "compile-libfuzzer-introspector-x86_64": 2026-07-05 11:03:15.247 INFO sinks_analyser - analysis_func: - Running analysis SinkCoverageAnalyser for CWE20
Step #6 - "compile-libfuzzer-introspector-x86_64": 2026-07-05 11:03:15.254 INFO sinks_analyser - analysis_func: - Running analysis SinkCoverageAnalyser for CWE22
Step #6 - "compile-libfuzzer-introspector-x86_64": 2026-07-05 11:03:15.259 INFO sinks_analyser - analysis_func: - Running analysis SinkCoverageAnalyser for CWE352
Step #6 - "compile-libfuzzer-introspector-x86_64": 2026-07-05 11:03:15.263 INFO sinks_analyser - analysis_func: - Running analysis SinkCoverageAnalyser for CWE434
Step #6 - "compile-libfuzzer-introspector-x86_64": 2026-07-05 11:03:15.267 INFO sinks_analyser - analysis_func: - Finish running analysis SinkCoverageAnalyser
Step #6 - "compile-libfuzzer-introspector-x86_64": 2026-07-05 11:03:15.267 INFO annotated_cfg - __init__: Creating annotated CFG
Step #6 - "compile-libfuzzer-introspector-x86_64": 2026-07-05 11:03:15.267 INFO annotated_cfg - analysis_func: Creating annotated CFGs
Step #6 - "compile-libfuzzer-introspector-x86_64": 2026-07-05 11:03:15.267 INFO annotated_cfg - analysis_func: Analysing: snappy_uncompress_fuzzer.cc
Step #6 - "compile-libfuzzer-introspector-x86_64": 2026-07-05 11:03:15.267 INFO annotated_cfg - analysis_func: Analysing: snappy_compress_fuzzer.cc
Step #6 - "compile-libfuzzer-introspector-x86_64": 2026-07-05 11:03:15.268 INFO source_code_line_analyser - standalone_analysis: - Running analysis SourceCodeLineAnalyser
Step #6 - "compile-libfuzzer-introspector-x86_64": 2026-07-05 11:03:15.268 INFO far_reach_low_coverage_analyser - standalone_analysis: - Running analysis FarReachLowCoverageAnalyser
Step #6 - "compile-libfuzzer-introspector-x86_64": 2026-07-05 11:03:15.269 INFO far_reach_low_coverage_analyser - standalone_analysis: - Settings: exclude_static_functions: False, only_referenced_functions: False, only_header_functions: False, only_interesting_functions: False, only_easy_fuzz_params: False, min_complexity: 0, max_functions: 10
Step #6 - "compile-libfuzzer-introspector-x86_64": 2026-07-05 11:03:15.306 INFO far_reach_low_coverage_analyser - standalone_analysis: Found 10 function candidiates.
Step #6 - "compile-libfuzzer-introspector-x86_64": 2026-07-05 11:03:15.306 INFO far_reach_low_coverage_analyser - standalone_analysis: Dumping result to /src/inspector/result.json
Step #6 - "compile-libfuzzer-introspector-x86_64": 2026-07-05 11:03:15.307 INFO public_candidate_analyser - standalone_analysis: - Running analysis PublicCandidateAnalyser
Step #6 - "compile-libfuzzer-introspector-x86_64": 2026-07-05 11:03:15.328 INFO public_candidate_analyser - standalone_analysis: Found 1536 function candidiates.
Step #6 - "compile-libfuzzer-introspector-x86_64": 2026-07-05 11:03:15.328 INFO public_candidate_analyser - standalone_analysis: Dumping result to /src/inspector/result.json
Step #6 - "compile-libfuzzer-introspector-x86_64": 2026-07-05 11:03:15.389 INFO oss_fuzz - analyse_folder: Found 276 files to include in analysis
Step #6 - "compile-libfuzzer-introspector-x86_64": 2026-07-05 11:03:15.389 INFO oss_fuzz - analyse_folder: Going C/C++ route
Step #6 - "compile-libfuzzer-introspector-x86_64": 2026-07-05 11:03:15.389 INFO oss_fuzz - analyse_folder: Loading tree-sitter trees
Step #6 - "compile-libfuzzer-introspector-x86_64": 2026-07-05 11:03:15.409 INFO frontend_c_cpp - load_treesitter_trees: harness: /src/snappy/snappy_uncompress_fuzzer.cc
Step #6 - "compile-libfuzzer-introspector-x86_64": 2026-07-05 11:03:17.231 INFO frontend_c_cpp - load_treesitter_trees: harness: /src/snappy/snappy_compress_fuzzer.cc
Step #6 - "compile-libfuzzer-introspector-x86_64": 2026-07-05 11:11:42.596 INFO oss_fuzz - analyse_folder: Dump methods for snappy_uncompress_fuzzer
Step #6 - "compile-libfuzzer-introspector-x86_64": 2026-07-05 11:11:42.596 INFO datatypes - dump_module_logic: Generating report
Step #6 - "compile-libfuzzer-introspector-x86_64": 2026-07-05 12:00:50.860 INFO datatypes - dump_module_logic: Report generated
Step #6 - "compile-libfuzzer-introspector-x86_64": 2026-07-05 12:00:51.734 INFO datatypes - dump_module_logic: Dumping project-wide logic.
Step #6 - "compile-libfuzzer-introspector-x86_64": 2026-07-05 12:00:51.734 INFO datatypes - dump_module_logic: Using safe yaml safe C dumper.
Step #6 - "compile-libfuzzer-introspector-x86_64": 2026-07-05 12:01:05.262 INFO datatypes - dump_module_logic: Dumped
Step #6 - "compile-libfuzzer-introspector-x86_64": 2026-07-05 12:01:05.319 INFO oss_fuzz - analyse_folder: Extracting calltree for snappy_uncompress_fuzzer
Step #6 - "compile-libfuzzer-introspector-x86_64": 2026-07-05 12:01:05.564 INFO oss_fuzz - analyse_folder: Calltree extracted
Step #6 - "compile-libfuzzer-introspector-x86_64": 2026-07-05 12:01:05.565 INFO datatypes - dump_type_definition: Dumping custom type definitions.
Step #6 - "compile-libfuzzer-introspector-x86_64": 2026-07-05 12:01:05.574 INFO datatypes - dump_type_definition: Custom type definitions dumping completed.
Step #6 - "compile-libfuzzer-introspector-x86_64": 2026-07-05 12:01:05.574 INFO datatypes - dump_macro_block_info: Dumping macro blocks information.
Step #6 - "compile-libfuzzer-introspector-x86_64": 2026-07-05 12:01:05.589 INFO datatypes - dump_macro_block_info: Macro blocks information dumping completed.
Step #6 - "compile-libfuzzer-introspector-x86_64": 2026-07-05 12:01:05.589 INFO oss_fuzz - analyse_folder: Dump methods for snappy_compress_fuzzer
Step #6 - "compile-libfuzzer-introspector-x86_64": 2026-07-05 12:01:05.589 INFO datatypes - dump_module_logic: Generating report
Step #6 - "compile-libfuzzer-introspector-x86_64": 2026-07-05 12:01:06.440 INFO datatypes - dump_module_logic: Report generated
Step #6 - "compile-libfuzzer-introspector-x86_64": 2026-07-05 12:01:07.318 INFO datatypes - dump_module_logic: Dumping project-wide logic.
Step #6 - "compile-libfuzzer-introspector-x86_64": 2026-07-05 12:01:07.318 INFO datatypes - dump_module_logic: Using safe yaml safe C dumper.
Step #6 - "compile-libfuzzer-introspector-x86_64": 2026-07-05 12:01:18.318 INFO datatypes - dump_module_logic: Dumped
Step #6 - "compile-libfuzzer-introspector-x86_64": 2026-07-05 12:01:18.368 INFO oss_fuzz - analyse_folder: Extracting calltree for snappy_compress_fuzzer
Step #6 - "compile-libfuzzer-introspector-x86_64": 2026-07-05 12:01:19.273 INFO oss_fuzz - analyse_folder: Calltree extracted
Step #6 - "compile-libfuzzer-introspector-x86_64": 2026-07-05 12:01:19.274 INFO datatypes - dump_type_definition: Dumping custom type definitions.
Step #6 - "compile-libfuzzer-introspector-x86_64": 2026-07-05 12:01:19.287 INFO datatypes - dump_type_definition: Custom type definitions dumping completed.
Step #6 - "compile-libfuzzer-introspector-x86_64": 2026-07-05 12:01:19.287 INFO datatypes - dump_macro_block_info: Dumping macro blocks information.
Step #6 - "compile-libfuzzer-introspector-x86_64": 2026-07-05 12:01:19.304 INFO datatypes - dump_macro_block_info: Macro blocks information dumping completed.
Step #6 - "compile-libfuzzer-introspector-x86_64": 2026-07-05 12:01:19.391 INFO analysis - load_data_files: Loading profiles using files
Step #6 - "compile-libfuzzer-introspector-x86_64": 2026-07-05 12:01:19.391 INFO data_loader - load_all_profiles: Loading profiles from /src
Step #6 - "compile-libfuzzer-introspector-x86_64": 2026-07-05 12:01:19.421 INFO data_loader - load_all_profiles: []
Step #6 - "compile-libfuzzer-introspector-x86_64": 2026-07-05 12:01:19.421 INFO data_loader - load_all_profiles: - found 4 profiles to load
Step #6 - "compile-libfuzzer-introspector-x86_64": 2026-07-05 12:01:19.445 INFO data_loader - read_fuzzer_data_file_to_profile: - loading /src/inspector/fuzzerLogFile-snappy_compress_fuzzer.data
Step #6 - "compile-libfuzzer-introspector-x86_64": 2026-07-05 12:01:19.445 INFO data_loader - read_fuzzer_data_file_to_profile: target data f: /src/inspector/fuzzerLogFile-snappy_compress_fuzzer.data
Step #6 - "compile-libfuzzer-introspector-x86_64": 2026-07-05 12:01:19.445 INFO utils - data_file_read_yaml: Set base loader to use CSafeLoader
Step #6 - "compile-libfuzzer-introspector-x86_64": 2026-07-05 12:01:19.448 INFO data_loader - read_fuzzer_data_file_to_profile: - loading /src/inspector/fuzzerLogFile-snappy_uncompress_fuzzer.data
Step #6 - "compile-libfuzzer-introspector-x86_64": 2026-07-05 12:01:19.448 INFO data_loader - read_fuzzer_data_file_to_profile: target data f: /src/inspector/fuzzerLogFile-snappy_uncompress_fuzzer.data
Step #6 - "compile-libfuzzer-introspector-x86_64": 2026-07-05 12:01:19.449 INFO utils - data_file_read_yaml: Set base loader to use CSafeLoader
Step #6 - "compile-libfuzzer-introspector-x86_64": 2026-07-05 12:01:19.452 INFO data_loader - read_fuzzer_data_file_to_profile: - loading /src/inspector/second-frontend-run/fuzzerLogFile-snappy_compress_fuzzer.data
Step #6 - "compile-libfuzzer-introspector-x86_64": 2026-07-05 12:01:19.452 INFO data_loader - read_fuzzer_data_file_to_profile: target data f: /src/inspector/second-frontend-run/fuzzerLogFile-snappy_compress_fuzzer.data
Step #6 - "compile-libfuzzer-introspector-x86_64": 2026-07-05 12:01:19.452 INFO utils - data_file_read_yaml: Set base loader to use CSafeLoader
Step #6 - "compile-libfuzzer-introspector-x86_64": 2026-07-05 12:01:19.455 INFO data_loader - read_fuzzer_data_file_to_profile: - loading /src/inspector/second-frontend-run/fuzzerLogFile-snappy_uncompress_fuzzer.data
Step #6 - "compile-libfuzzer-introspector-x86_64": 2026-07-05 12:01:19.456 INFO data_loader - read_fuzzer_data_file_to_profile: target data f: /src/inspector/second-frontend-run/fuzzerLogFile-snappy_uncompress_fuzzer.data
Step #6 - "compile-libfuzzer-introspector-x86_64": 2026-07-05 12:01:19.456 INFO utils - data_file_read_yaml: Set base loader to use CSafeLoader
Step #6 - "compile-libfuzzer-introspector-x86_64": 2026-07-05 12:01:42.970 INFO utils - data_file_read_yaml: Loaded single yaml module
Step #6 - "compile-libfuzzer-introspector-x86_64": 2026-07-05 12:01:43.029 INFO utils - data_file_read_yaml: Loaded single yaml module
Step #6 - "compile-libfuzzer-introspector-x86_64": 2026-07-05 12:01:43.042 INFO utils - data_file_read_yaml: Loaded single yaml module
Step #6 - "compile-libfuzzer-introspector-x86_64": 2026-07-05 12:01:43.115 INFO utils - data_file_read_yaml: Loaded single yaml module
Step #6 - "compile-libfuzzer-introspector-x86_64": 2026-07-05 12:01:43.459 INFO data_loader - read_fuzzer_data_file_to_profile: Returning profile
Step #6 - "compile-libfuzzer-introspector-x86_64": 2026-07-05 12:01:43.513 INFO data_loader - read_fuzzer_data_file_to_profile: Returning profile
Step #6 - "compile-libfuzzer-introspector-x86_64": 2026-07-05 12:01:43.540 INFO data_loader - read_fuzzer_data_file_to_profile: Returning profile
Step #6 - "compile-libfuzzer-introspector-x86_64": 2026-07-05 12:01:43.608 INFO data_loader - read_fuzzer_data_file_to_profile: Returning profile
Step #6 - "compile-libfuzzer-introspector-x86_64": 2026-07-05 12:01:47.244 INFO analysis - load_data_files: Found 4 profiles
Step #6 - "compile-libfuzzer-introspector-x86_64": 2026-07-05 12:01:47.244 INFO analysis - load_data_files: [+] Accummulating profiles
Step #6 - "compile-libfuzzer-introspector-x86_64": 2026-07-05 12:01:47.244 INFO analysis - load_data_files: Accummulating using multiprocessing
Step #6 - "compile-libfuzzer-introspector-x86_64": 2026-07-05 12:01:47.278 INFO fuzzer_profile - accummulate_profile: /src/snappy/snappy_compress_fuzzer.cc: propagating functions reached
Step #6 - "compile-libfuzzer-introspector-x86_64": 2026-07-05 12:01:47.288 INFO fuzzer_profile - accummulate_profile: /src/snappy/snappy_uncompress_fuzzer.cc: propagating functions reached
Step #6 - "compile-libfuzzer-introspector-x86_64": 2026-07-05 12:01:47.298 INFO fuzzer_profile - accummulate_profile: /src/snappy/snappy_uncompress_fuzzer.cc: propagating functions reached
Step #6 - "compile-libfuzzer-introspector-x86_64": 2026-07-05 12:01:47.309 INFO fuzzer_profile - accummulate_profile: /src/snappy/snappy_compress_fuzzer.cc: propagating functions reached
Step #6 - "compile-libfuzzer-introspector-x86_64": 2026-07-05 12:01:47.326 INFO fuzzer_profile - accummulate_profile: /src/snappy/snappy_uncompress_fuzzer.cc: setting reached funcs
Step #6 - "compile-libfuzzer-introspector-x86_64": 2026-07-05 12:01:47.326 INFO fuzzer_profile - accummulate_profile: /src/snappy/snappy_uncompress_fuzzer.cc: setting unreached funcs
Step #6 - "compile-libfuzzer-introspector-x86_64": 2026-07-05 12:01:47.329 INFO fuzzer_profile - accummulate_profile: /src/snappy/snappy_uncompress_fuzzer.cc: loading coverage
Step #6 - "compile-libfuzzer-introspector-x86_64": 2026-07-05 12:01:47.329 INFO fuzzer_profile - _load_coverage: Loading coverage of type c-cpp
Step #6 - "compile-libfuzzer-introspector-x86_64": 2026-07-05 12:01:47.329 INFO code_coverage - load_llvm_coverage: Loading LLVM coverage for target /src/snappy/snappy_uncompress_fuzzer.cc
Step #6 - "compile-libfuzzer-introspector-x86_64": 2026-07-05 12:01:47.339 INFO code_coverage - load_llvm_coverage: Found 0 coverage reports
Step #6 - "compile-libfuzzer-introspector-x86_64": 2026-07-05 12:01:47.340 INFO code_coverage - load_llvm_coverage: Using the following coverages []
Step #6 - "compile-libfuzzer-introspector-x86_64": 2026-07-05 12:01:47.340 INFO fuzzer_profile - accummulate_profile: /src/snappy/snappy_uncompress_fuzzer.cc: setting file targets
Step #6 - "compile-libfuzzer-introspector-x86_64": 2026-07-05 12:01:47.340 INFO fuzzer_profile - accummulate_profile: /src/snappy/snappy_uncompress_fuzzer.cc: setting total basic blocks
Step #6 - "compile-libfuzzer-introspector-x86_64": 2026-07-05 12:01:47.340 INFO fuzzer_profile - accummulate_profile: /src/snappy/snappy_uncompress_fuzzer.cc: setting cyclomatic complexity
Step #6 - "compile-libfuzzer-introspector-x86_64": 2026-07-05 12:01:47.340 INFO fuzzer_profile - accummulate_profile: /src/snappy/snappy_uncompress_fuzzer.cc: setting fd cache
Step #6 - "compile-libfuzzer-introspector-x86_64": 2026-07-05 12:01:47.341 INFO fuzzer_profile - accummulate_profile: /src/snappy/snappy_compress_fuzzer.cc: setting reached funcs
Step #6 - "compile-libfuzzer-introspector-x86_64": 2026-07-05 12:01:47.342 INFO fuzzer_profile - accummulate_profile: /src/snappy/snappy_compress_fuzzer.cc: setting unreached funcs
Step #6 - "compile-libfuzzer-introspector-x86_64": 2026-07-05 12:01:47.346 INFO fuzzer_profile - accummulate_profile: /src/snappy/snappy_uncompress_fuzzer.cc: setting reached funcs
Step #6 - "compile-libfuzzer-introspector-x86_64": 2026-07-05 12:01:47.346 INFO fuzzer_profile - accummulate_profile: /src/snappy/snappy_uncompress_fuzzer.cc: setting unreached funcs
Step #6 - "compile-libfuzzer-introspector-x86_64": 2026-07-05 12:01:47.346 INFO fuzzer_profile - accummulate_profile: /src/snappy/snappy_compress_fuzzer.cc: loading coverage
Step #6 - "compile-libfuzzer-introspector-x86_64": 2026-07-05 12:01:47.346 INFO fuzzer_profile - _load_coverage: Loading coverage of type c-cpp
Step #6 - "compile-libfuzzer-introspector-x86_64": 2026-07-05 12:01:47.346 INFO code_coverage - load_llvm_coverage: Loading LLVM coverage for target /src/snappy/snappy_compress_fuzzer.cc
Step #6 - "compile-libfuzzer-introspector-x86_64": 2026-07-05 12:01:47.347 INFO fuzzer_profile - accummulate_profile: /src/snappy/snappy_compress_fuzzer.cc: setting reached funcs
Step #6 - "compile-libfuzzer-introspector-x86_64": 2026-07-05 12:01:47.347 INFO fuzzer_profile - accummulate_profile: /src/snappy/snappy_compress_fuzzer.cc: setting unreached funcs
Step #6 - "compile-libfuzzer-introspector-x86_64": 2026-07-05 12:01:47.348 INFO fuzzer_profile - accummulate_profile: /src/snappy/snappy_uncompress_fuzzer.cc: setting reached funcs in runtime
Step #6 - "compile-libfuzzer-introspector-x86_64": 2026-07-05 12:01:47.349 INFO fuzzer_profile - accummulate_profile: /src/snappy/snappy_uncompress_fuzzer.cc: finished accummulating profile
Step #6 - "compile-libfuzzer-introspector-x86_64": 2026-07-05 12:01:47.349 INFO fuzzer_profile - accummulate_profile: /src/snappy/snappy_uncompress_fuzzer.cc: loading coverage
Step #6 - "compile-libfuzzer-introspector-x86_64": 2026-07-05 12:01:47.349 INFO fuzzer_profile - _load_coverage: Loading coverage of type c-cpp
Step #6 - "compile-libfuzzer-introspector-x86_64": 2026-07-05 12:01:47.349 INFO code_coverage - load_llvm_coverage: Loading LLVM coverage for target /src/snappy/snappy_uncompress_fuzzer.cc
Step #6 - "compile-libfuzzer-introspector-x86_64": 2026-07-05 12:01:47.350 INFO fuzzer_profile - accummulate_profile: /src/snappy/snappy_compress_fuzzer.cc: loading coverage
Step #6 - "compile-libfuzzer-introspector-x86_64": 2026-07-05 12:01:47.350 INFO fuzzer_profile - _load_coverage: Loading coverage of type c-cpp
Step #6 - "compile-libfuzzer-introspector-x86_64": 2026-07-05 12:01:47.351 INFO code_coverage - load_llvm_coverage: Loading LLVM coverage for target /src/snappy/snappy_compress_fuzzer.cc
Step #6 - "compile-libfuzzer-introspector-x86_64": 2026-07-05 12:01:47.357 INFO code_coverage - load_llvm_coverage: Found 0 coverage reports
Step #6 - "compile-libfuzzer-introspector-x86_64": 2026-07-05 12:01:47.357 INFO code_coverage - load_llvm_coverage: Using the following coverages []
Step #6 - "compile-libfuzzer-introspector-x86_64": 2026-07-05 12:01:47.357 INFO fuzzer_profile - accummulate_profile: /src/snappy/snappy_compress_fuzzer.cc: setting file targets
Step #6 - "compile-libfuzzer-introspector-x86_64": 2026-07-05 12:01:47.358 INFO fuzzer_profile - accummulate_profile: /src/snappy/snappy_compress_fuzzer.cc: setting total basic blocks
Step #6 - "compile-libfuzzer-introspector-x86_64": 2026-07-05 12:01:47.358 INFO fuzzer_profile - accummulate_profile: /src/snappy/snappy_compress_fuzzer.cc: setting cyclomatic complexity
Step #6 - "compile-libfuzzer-introspector-x86_64": 2026-07-05 12:01:47.358 INFO fuzzer_profile - accummulate_profile: /src/snappy/snappy_compress_fuzzer.cc: setting fd cache
Step #6 - "compile-libfuzzer-introspector-x86_64": 2026-07-05 12:01:47.360 INFO code_coverage - load_llvm_coverage: Found 0 coverage reports
Step #6 - "compile-libfuzzer-introspector-x86_64": 2026-07-05 12:01:47.360 INFO code_coverage - load_llvm_coverage: Using the following coverages []
Step #6 - "compile-libfuzzer-introspector-x86_64": 2026-07-05 12:01:47.360 INFO fuzzer_profile - accummulate_profile: /src/snappy/snappy_uncompress_fuzzer.cc: setting file targets
Step #6 - "compile-libfuzzer-introspector-x86_64": 2026-07-05 12:01:47.360 INFO fuzzer_profile - accummulate_profile: /src/snappy/snappy_uncompress_fuzzer.cc: setting total basic blocks
Step #6 - "compile-libfuzzer-introspector-x86_64": 2026-07-05 12:01:47.360 INFO fuzzer_profile - accummulate_profile: /src/snappy/snappy_uncompress_fuzzer.cc: setting cyclomatic complexity
Step #6 - "compile-libfuzzer-introspector-x86_64": 2026-07-05 12:01:47.360 INFO fuzzer_profile - accummulate_profile: /src/snappy/snappy_uncompress_fuzzer.cc: setting fd cache
Step #6 - "compile-libfuzzer-introspector-x86_64": 2026-07-05 12:01:47.362 INFO code_coverage - load_llvm_coverage: Found 0 coverage reports
Step #6 - "compile-libfuzzer-introspector-x86_64": 2026-07-05 12:01:47.362 INFO code_coverage - load_llvm_coverage: Using the following coverages []
Step #6 - "compile-libfuzzer-introspector-x86_64": 2026-07-05 12:01:47.362 INFO fuzzer_profile - accummulate_profile: /src/snappy/snappy_compress_fuzzer.cc: setting file targets
Step #6 - "compile-libfuzzer-introspector-x86_64": 2026-07-05 12:01:47.362 INFO fuzzer_profile - accummulate_profile: /src/snappy/snappy_compress_fuzzer.cc: setting total basic blocks
Step #6 - "compile-libfuzzer-introspector-x86_64": 2026-07-05 12:01:47.362 INFO fuzzer_profile - accummulate_profile: /src/snappy/snappy_compress_fuzzer.cc: setting cyclomatic complexity
Step #6 - "compile-libfuzzer-introspector-x86_64": 2026-07-05 12:01:47.363 INFO fuzzer_profile - accummulate_profile: /src/snappy/snappy_compress_fuzzer.cc: setting fd cache
Step #6 - "compile-libfuzzer-introspector-x86_64": 2026-07-05 12:01:47.368 INFO fuzzer_profile - accummulate_profile: /src/snappy/snappy_compress_fuzzer.cc: setting reached funcs in runtime
Step #6 - "compile-libfuzzer-introspector-x86_64": 2026-07-05 12:01:47.368 INFO fuzzer_profile - accummulate_profile: /src/snappy/snappy_compress_fuzzer.cc: finished accummulating profile
Step #6 - "compile-libfuzzer-introspector-x86_64": 2026-07-05 12:01:47.370 INFO fuzzer_profile - accummulate_profile: /src/snappy/snappy_uncompress_fuzzer.cc: setting reached funcs in runtime
Step #6 - "compile-libfuzzer-introspector-x86_64": 2026-07-05 12:01:47.370 INFO fuzzer_profile - accummulate_profile: /src/snappy/snappy_uncompress_fuzzer.cc: finished accummulating profile
Step #6 - "compile-libfuzzer-introspector-x86_64": 2026-07-05 12:01:47.370 INFO fuzzer_profile - accummulate_profile: /src/snappy/snappy_compress_fuzzer.cc: setting reached funcs in runtime
Step #6 - "compile-libfuzzer-introspector-x86_64": 2026-07-05 12:01:47.370 INFO fuzzer_profile - accummulate_profile: /src/snappy/snappy_compress_fuzzer.cc: finished accummulating profile
Step #6 - "compile-libfuzzer-introspector-x86_64": 2026-07-05 12:01:48.234 INFO analysis - load_data_files: [+] Creating project profile
Step #6 - "compile-libfuzzer-introspector-x86_64": 2026-07-05 12:01:48.235 INFO project_profile - __init__: Creating merged profile of 4 profiles
Step #6 - "compile-libfuzzer-introspector-x86_64": 2026-07-05 12:01:48.235 INFO project_profile - __init__: Populating functions reached
Step #6 - "compile-libfuzzer-introspector-x86_64": 2026-07-05 12:01:48.235 INFO project_profile - __init__: Populating functions unreached
Step #6 - "compile-libfuzzer-introspector-x86_64": 2026-07-05 12:01:48.238 INFO project_profile - __init__: Creating all_functions dictionary
Step #6 - "compile-libfuzzer-introspector-x86_64": 2026-07-05 12:01:48.329 INFO project_profile - __init__: Gathering complexity and incoming references of each function
Step #6 - "compile-libfuzzer-introspector-x86_64": 2026-07-05 12:01:48.374 INFO project_profile - __init__: Completed creationg of merged profile
Step #6 - "compile-libfuzzer-introspector-x86_64": 2026-07-05 12:01:48.375 INFO analysis - load_data_files: [+] Refining profiles
Step #6 - "compile-libfuzzer-introspector-x86_64": 2026-07-05 12:01:48.385 INFO utils - get_target_coverage_url: Extracting coverage for /src/inspector/second-frontend-run -- snappy_uncompress_fuzzer.cc
Step #6 - "compile-libfuzzer-introspector-x86_64": 2026-07-05 12:01:48.385 INFO analysis - overlay_calltree_with_coverage: Using coverage url: /src/inspector/second-frontend-run
Step #6 - "compile-libfuzzer-introspector-x86_64": 2026-07-05 12:01:48.385 INFO analysis - get_node_coverage_hitcount: There is no coverage data (not even all negative).
Step #6 - "compile-libfuzzer-introspector-x86_64": 2026-07-05 12:01:48.385 INFO analysis - overlay_calltree_with_coverage: Overlaying 2
Step #6 - "compile-libfuzzer-introspector-x86_64": 2026-07-05 12:01:48.385 INFO analysis - overlay_calltree_with_coverage: Overlaying 3
Step #6 - "compile-libfuzzer-introspector-x86_64": 2026-07-05 12:01:48.385 INFO analysis - overlay_calltree_with_coverage: Updating branch complexities
Step #6 - "compile-libfuzzer-introspector-x86_64": 2026-07-05 12:01:48.387 INFO analysis - overlay_calltree_with_coverage: [+] found 0 branch blockers.
Step #6 - "compile-libfuzzer-introspector-x86_64": 2026-07-05 12:01:48.388 INFO utils - get_target_coverage_url: Extracting coverage for /src/inspector/second-frontend-run -- snappy_compress_fuzzer.cc
Step #6 - "compile-libfuzzer-introspector-x86_64": 2026-07-05 12:01:48.388 INFO analysis - overlay_calltree_with_coverage: Using coverage url: /src/inspector/second-frontend-run
Step #6 - "compile-libfuzzer-introspector-x86_64": 2026-07-05 12:01:48.388 INFO analysis - get_node_coverage_hitcount: There is no coverage data (not even all negative).
Step #6 - "compile-libfuzzer-introspector-x86_64": 2026-07-05 12:01:48.389 INFO analysis - overlay_calltree_with_coverage: Overlaying 2
Step #6 - "compile-libfuzzer-introspector-x86_64": 2026-07-05 12:01:48.389 INFO analysis - overlay_calltree_with_coverage: Overlaying 3
Step #6 - "compile-libfuzzer-introspector-x86_64": 2026-07-05 12:01:48.389 INFO analysis - overlay_calltree_with_coverage: Updating branch complexities
Step #6 - "compile-libfuzzer-introspector-x86_64": 2026-07-05 12:01:48.390 INFO analysis - overlay_calltree_with_coverage: [+] found 0 branch blockers.
Step #6 - "compile-libfuzzer-introspector-x86_64": 2026-07-05 12:01:48.390 INFO utils - get_target_coverage_url: Extracting coverage for /src/inspector/second-frontend-run -- snappy_compress_fuzzer.cc
Step #6 - "compile-libfuzzer-introspector-x86_64": 2026-07-05 12:01:48.390 INFO analysis - overlay_calltree_with_coverage: Using coverage url: /src/inspector/second-frontend-run
Step #6 - "compile-libfuzzer-introspector-x86_64": 2026-07-05 12:01:48.390 INFO analysis - get_node_coverage_hitcount: There is no coverage data (not even all negative).
Step #6 - "compile-libfuzzer-introspector-x86_64": 2026-07-05 12:01:48.391 INFO analysis - overlay_calltree_with_coverage: Overlaying 2
Step #6 - "compile-libfuzzer-introspector-x86_64": 2026-07-05 12:01:48.391 INFO analysis - overlay_calltree_with_coverage: Overlaying 3
Step #6 - "compile-libfuzzer-introspector-x86_64": 2026-07-05 12:01:48.391 INFO analysis - overlay_calltree_with_coverage: Updating branch complexities
Step #6 - "compile-libfuzzer-introspector-x86_64": 2026-07-05 12:01:48.391 INFO analysis - overlay_calltree_with_coverage: [+] found 0 branch blockers.
Step #6 - "compile-libfuzzer-introspector-x86_64": 2026-07-05 12:01:48.392 INFO utils - get_target_coverage_url: Extracting coverage for /src/inspector/second-frontend-run -- snappy_uncompress_fuzzer.cc
Step #6 - "compile-libfuzzer-introspector-x86_64": 2026-07-05 12:01:48.392 INFO analysis - overlay_calltree_with_coverage: Using coverage url: /src/inspector/second-frontend-run
Step #6 - "compile-libfuzzer-introspector-x86_64": 2026-07-05 12:01:48.392 INFO analysis - get_node_coverage_hitcount: There is no coverage data (not even all negative).
Step #6 - "compile-libfuzzer-introspector-x86_64": 2026-07-05 12:01:48.392 INFO analysis - overlay_calltree_with_coverage: Overlaying 2
Step #6 - "compile-libfuzzer-introspector-x86_64": 2026-07-05 12:01:48.392 INFO analysis - overlay_calltree_with_coverage: Overlaying 3
Step #6 - "compile-libfuzzer-introspector-x86_64": 2026-07-05 12:01:48.392 INFO analysis - overlay_calltree_with_coverage: Updating branch complexities
Step #6 - "compile-libfuzzer-introspector-x86_64": 2026-07-05 12:01:48.393 INFO analysis - overlay_calltree_with_coverage: [+] found 0 branch blockers.
Step #6 - "compile-libfuzzer-introspector-x86_64": 2026-07-05 12:01:48.599 INFO analysis - extract_tests_from_directories: All test files
Step #6 - "compile-libfuzzer-introspector-x86_64": 2026-07-05 12:01:48.599 INFO analysis - extract_tests_from_directories: /src/snappy/snappy_test_data.cc
Step #6 - "compile-libfuzzer-introspector-x86_64": 2026-07-05 12:01:48.599 INFO analysis - extract_tests_from_directories: /src/snappy/snappy_test_tool.cc
Step #6 - "compile-libfuzzer-introspector-x86_64": 2026-07-05 12:01:48.599 INFO analysis - extract_tests_from_directories: /src/snappy/snappy_unittest.cc
Step #6 - "compile-libfuzzer-introspector-x86_64": 2026-07-05 12:01:48.599 INFO analysis - extract_tests_from_directories: /src/snappy/snappy-test.cc
Step #6 - "compile-libfuzzer-introspector-x86_64": 2026-07-05 12:01:48.722 INFO utils - get_target_coverage_url: Extracting coverage for https://storage.googleapis.com/oss-fuzz-coverage/snappy/reports/20260705/linux -- snappy_uncompress_fuzzer.cc
Step #6 - "compile-libfuzzer-introspector-x86_64": 2026-07-05 12:01:48.723 INFO utils - get_target_coverage_url: Extracting coverage for https://storage.googleapis.com/oss-fuzz-coverage/snappy/reports/20260705/linux -- snappy_compress_fuzzer.cc
Step #6 - "compile-libfuzzer-introspector-x86_64": 2026-07-05 12:01:48.723 INFO debug_info - load_debug_all_yaml_files: Set base loader to use CSafeLoader
Step #6 - "compile-libfuzzer-introspector-x86_64": 2026-07-05 12:01:48.723 INFO debug_info - load_debug_all_yaml_files: Set base loader to use CSafeLoader
Step #6 - "compile-libfuzzer-introspector-x86_64": 2026-07-05 12:01:48.723 INFO debug_info - correlate_debugged_function_to_debug_types: Creating dictionary
Step #6 - "compile-libfuzzer-introspector-x86_64": 2026-07-05 12:01:48.723 INFO debug_info - create_friendly_debug_types: Have to create for 0 addresses
Step #6 - "compile-libfuzzer-introspector-x86_64": 2026-07-05 12:01:48.723 INFO debug_info - correlate_debugged_function_to_debug_types: Finished creating dictionary
Step #6 - "compile-libfuzzer-introspector-x86_64": 2026-07-05 12:01:48.736 INFO analysis - extract_tests_from_directories: All test files
Step #6 - "compile-libfuzzer-introspector-x86_64": 2026-07-05 12:01:48.958 INFO html_report - write_content_to_html_files: Dumping report
Step #6 - "compile-libfuzzer-introspector-x86_64": 2026-07-05 12:01:49.254 INFO cli - main: Ending fuzz introspector post-processing
Step #6 - "compile-libfuzzer-introspector-x86_64": sending incremental file list
Step #6 - "compile-libfuzzer-introspector-x86_64": created directory /workspace/out/libfuzzer-introspector-x86_64/inspector
Step #6 - "compile-libfuzzer-introspector-x86_64": ./
Step #6 - "compile-libfuzzer-introspector-x86_64": all-files.json
Step #6 - "compile-libfuzzer-introspector-x86_64": all-friendly-debug-types.json
Step #6 - "compile-libfuzzer-introspector-x86_64": all-fuzz-introspector-functions.json
Step #6 - "compile-libfuzzer-introspector-x86_64": all_debug_info.json
Step #6 - "compile-libfuzzer-introspector-x86_64": all_functions.js
Step #6 - "compile-libfuzzer-introspector-x86_64": all_tests.json
Step #6 - "compile-libfuzzer-introspector-x86_64": all_tests_with_xreference.json
Step #6 - "compile-libfuzzer-introspector-x86_64": analysis_1.js
Step #6 - "compile-libfuzzer-introspector-x86_64": branch-blockers.json
Step #6 - "compile-libfuzzer-introspector-x86_64": calltree.js
Step #6 - "compile-libfuzzer-introspector-x86_64": calltree_view_0.html
Step #6 - "compile-libfuzzer-introspector-x86_64": calltree_view_1.html
Step #6 - "compile-libfuzzer-introspector-x86_64": clike.js
Step #6 - "compile-libfuzzer-introspector-x86_64": custom.js
Step #6 - "compile-libfuzzer-introspector-x86_64": full_type_defs.json
Step #6 - "compile-libfuzzer-introspector-x86_64": fuzz_report.html
Step #6 - "compile-libfuzzer-introspector-x86_64": fuzzerLogFile-snappy_compress_fuzzer.data
Step #6 - "compile-libfuzzer-introspector-x86_64": fuzzerLogFile-snappy_compress_fuzzer.data.yaml
Step #6 - "compile-libfuzzer-introspector-x86_64": fuzzerLogFile-snappy_uncompress_fuzzer.data
Step #6 - "compile-libfuzzer-introspector-x86_64": fuzzerLogFile-snappy_uncompress_fuzzer.data.yaml
Step #6 - "compile-libfuzzer-introspector-x86_64": fuzzer_table_data.js
Step #6 - "compile-libfuzzer-introspector-x86_64": macro_block_info.json
Step #6 - "compile-libfuzzer-introspector-x86_64": prism.css
Step #6 - "compile-libfuzzer-introspector-x86_64": prism.js
Step #6 - "compile-libfuzzer-introspector-x86_64": result.json
Step #6 - "compile-libfuzzer-introspector-x86_64": snappy_compress_fuzzer.cc_colormap.png
Step #6 - "compile-libfuzzer-introspector-x86_64": snappy_uncompress_fuzzer.cc_colormap.png
Step #6 - "compile-libfuzzer-introspector-x86_64": styles.css
Step #6 - "compile-libfuzzer-introspector-x86_64": summary.json
Step #6 - "compile-libfuzzer-introspector-x86_64": test-files.json
Step #6 - "compile-libfuzzer-introspector-x86_64": light/
Step #6 - "compile-libfuzzer-introspector-x86_64": light/all_files.json
Step #6 - "compile-libfuzzer-introspector-x86_64": light/all_pairs.json
Step #6 - "compile-libfuzzer-introspector-x86_64": light/all_tests.json
Step #6 - "compile-libfuzzer-introspector-x86_64": light/source_files/
Step #6 - "compile-libfuzzer-introspector-x86_64": light/source_files/src/
Step #6 - "compile-libfuzzer-introspector-x86_64": light/source_files/src/snappy/
Step #6 - "compile-libfuzzer-introspector-x86_64": light/source_files/src/snappy/snappy-c.cc
Step #6 - "compile-libfuzzer-introspector-x86_64": light/source_files/src/snappy/snappy-c.h
Step #6 - "compile-libfuzzer-introspector-x86_64": light/source_files/src/snappy/snappy-internal.h
Step #6 - "compile-libfuzzer-introspector-x86_64": light/source_files/src/snappy/snappy-sinksource.cc
Step #6 - "compile-libfuzzer-introspector-x86_64": light/source_files/src/snappy/snappy-sinksource.h
Step #6 - "compile-libfuzzer-introspector-x86_64": light/source_files/src/snappy/snappy-stubs-internal.cc
Step #6 - "compile-libfuzzer-introspector-x86_64": light/source_files/src/snappy/snappy-stubs-internal.h
Step #6 - "compile-libfuzzer-introspector-x86_64": light/source_files/src/snappy/snappy-test.cc
Step #6 - "compile-libfuzzer-introspector-x86_64": light/source_files/src/snappy/snappy-test.h
Step #6 - "compile-libfuzzer-introspector-x86_64": light/source_files/src/snappy/snappy.cc
Step #6 - "compile-libfuzzer-introspector-x86_64": light/source_files/src/snappy/snappy.h
Step #6 - "compile-libfuzzer-introspector-x86_64": light/source_files/src/snappy/snappy_benchmark.cc
Step #6 - "compile-libfuzzer-introspector-x86_64": light/source_files/src/snappy/snappy_compress_fuzzer.cc
Step #6 - "compile-libfuzzer-introspector-x86_64": light/source_files/src/snappy/snappy_test_data.cc
Step #6 - "compile-libfuzzer-introspector-x86_64": light/source_files/src/snappy/snappy_test_data.h
Step #6 - "compile-libfuzzer-introspector-x86_64": light/source_files/src/snappy/snappy_test_tool.cc
Step #6 - "compile-libfuzzer-introspector-x86_64": light/source_files/src/snappy/snappy_uncompress_fuzzer.cc
Step #6 - "compile-libfuzzer-introspector-x86_64": light/source_files/src/snappy/snappy_unittest.cc
Step #6 - "compile-libfuzzer-introspector-x86_64": second-frontend-run/
Step #6 - "compile-libfuzzer-introspector-x86_64": second-frontend-run/full_type_defs.json
Step #6 - "compile-libfuzzer-introspector-x86_64": second-frontend-run/fuzzerLogFile-snappy_compress_fuzzer.data
Step #6 - "compile-libfuzzer-introspector-x86_64": second-frontend-run/fuzzerLogFile-snappy_compress_fuzzer.data.yaml
Step #6 - "compile-libfuzzer-introspector-x86_64": second-frontend-run/fuzzerLogFile-snappy_uncompress_fuzzer.data
Step #6 - "compile-libfuzzer-introspector-x86_64": second-frontend-run/fuzzerLogFile-snappy_uncompress_fuzzer.data.yaml
Step #6 - "compile-libfuzzer-introspector-x86_64": second-frontend-run/macro_block_info.json
Step #6 - "compile-libfuzzer-introspector-x86_64": source-code/
Step #6 - "compile-libfuzzer-introspector-x86_64": source-code/src/
Step #6 - "compile-libfuzzer-introspector-x86_64": source-code/src/snappy/
Step #6 - "compile-libfuzzer-introspector-x86_64": source-code/src/snappy/snappy-c.cc
Step #6 - "compile-libfuzzer-introspector-x86_64": source-code/src/snappy/snappy-c.h
Step #6 - "compile-libfuzzer-introspector-x86_64": source-code/src/snappy/snappy-internal.h
Step #6 - "compile-libfuzzer-introspector-x86_64": source-code/src/snappy/snappy-sinksource.cc
Step #6 - "compile-libfuzzer-introspector-x86_64": source-code/src/snappy/snappy-sinksource.h
Step #6 - "compile-libfuzzer-introspector-x86_64": source-code/src/snappy/snappy-stubs-internal.cc
Step #6 - "compile-libfuzzer-introspector-x86_64": source-code/src/snappy/snappy-stubs-internal.h
Step #6 - "compile-libfuzzer-introspector-x86_64": source-code/src/snappy/snappy-test.cc
Step #6 - "compile-libfuzzer-introspector-x86_64": source-code/src/snappy/snappy-test.h
Step #6 - "compile-libfuzzer-introspector-x86_64": source-code/src/snappy/snappy.cc
Step #6 - "compile-libfuzzer-introspector-x86_64": source-code/src/snappy/snappy.h
Step #6 - "compile-libfuzzer-introspector-x86_64": source-code/src/snappy/snappy_benchmark.cc
Step #6 - "compile-libfuzzer-introspector-x86_64": source-code/src/snappy/snappy_compress_fuzzer.cc
Step #6 - "compile-libfuzzer-introspector-x86_64": source-code/src/snappy/snappy_test_data.cc
Step #6 - "compile-libfuzzer-introspector-x86_64": source-code/src/snappy/snappy_test_data.h
Step #6 - "compile-libfuzzer-introspector-x86_64": source-code/src/snappy/snappy_test_tool.cc
Step #6 - "compile-libfuzzer-introspector-x86_64": source-code/src/snappy/snappy_uncompress_fuzzer.cc
Step #6 - "compile-libfuzzer-introspector-x86_64": source-code/src/snappy/snappy_unittest.cc
Step #6 - "compile-libfuzzer-introspector-x86_64":
Step #6 - "compile-libfuzzer-introspector-x86_64": sent 177,683,340 bytes received 1,569 bytes 355,369,818.00 bytes/sec
Step #6 - "compile-libfuzzer-introspector-x86_64": total size is 177,634,296 speedup is 1.00
Step #6 - "compile-libfuzzer-introspector-x86_64": ---------------------------------------------------------------
Step #6 - "compile-libfuzzer-introspector-x86_64": CC=clang
Step #6 - "compile-libfuzzer-introspector-x86_64": CXX=clang++
Step #6 - "compile-libfuzzer-introspector-x86_64": CFLAGS=-O1 -fno-omit-frame-pointer -gline-tables-only -Wno-error=incompatible-function-pointer-types -Wno-error=int-conversion -Wno-error=deprecated-declarations -Wno-error=implicit-function-declaration -Wno-error=implicit-int -Wno-error=unknown-warning-option -Wno-error=vla-cxx-extension -DFUZZING_BUILD_MODE_UNSAFE_FOR_PRODUCTION -O0 -flto -fno-inline-functions -fuse-ld=gold -Wno-unused-command-line-argument -fsanitize=fuzzer-no-link -g
Step #6 - "compile-libfuzzer-introspector-x86_64": CXXFLAGS=-O1 -fno-omit-frame-pointer -gline-tables-only -Wno-error=incompatible-function-pointer-types -Wno-error=int-conversion -Wno-error=deprecated-declarations -Wno-error=implicit-function-declaration -Wno-error=implicit-int -Wno-error=unknown-warning-option -Wno-error=vla-cxx-extension -DFUZZING_BUILD_MODE_UNSAFE_FOR_PRODUCTION -O0 -flto -fno-inline-functions -fuse-ld=gold -Wno-unused-command-line-argument -fsanitize=fuzzer-no-link -stdlib=libc++ -g
Step #6 - "compile-libfuzzer-introspector-x86_64": RUSTFLAGS=-Cdebuginfo=2 -Cforce-frame-pointers
Step #6 - "compile-libfuzzer-introspector-x86_64": ---------------------------------------------------------------
Step #6 - "compile-libfuzzer-introspector-x86_64": + cd /src/snappy
Step #6 - "compile-libfuzzer-introspector-x86_64": + mkdir -p build
Step #6 - "compile-libfuzzer-introspector-x86_64": + cd build
Step #6 - "compile-libfuzzer-introspector-x86_64": + cmake -DSNAPPY_FUZZING_BUILD=ON -DSNAPPY_BUILD_TESTS=1 -DSNAPPY_BUILD_BENCHMARKS=0 ../
Step #6 - "compile-libfuzzer-introspector-x86_64": -- The C compiler identification is Clang 22.0.0
Step #6 - "compile-libfuzzer-introspector-x86_64": -- The CXX compiler identification is Clang 22.0.0
Step #6 - "compile-libfuzzer-introspector-x86_64": -- Detecting C compiler ABI info
Step #6 - "compile-libfuzzer-introspector-x86_64": -- Detecting C compiler ABI info - done
Step #6 - "compile-libfuzzer-introspector-x86_64": -- Check for working C compiler: /usr/local/bin/clang - skipped
Step #6 - "compile-libfuzzer-introspector-x86_64": -- Detecting C compile features
Step #6 - "compile-libfuzzer-introspector-x86_64": -- Detecting C compile features - done
Step #6 - "compile-libfuzzer-introspector-x86_64": -- Detecting CXX compiler ABI info
Step #6 - "compile-libfuzzer-introspector-x86_64": -- Detecting CXX compiler ABI info - done
Step #6 - "compile-libfuzzer-introspector-x86_64": -- Check for working CXX compiler: /usr/local/bin/clang++ - skipped
Step #6 - "compile-libfuzzer-introspector-x86_64": -- Detecting CXX compile features
Step #6 - "compile-libfuzzer-introspector-x86_64": -- Detecting CXX compile features - done
Step #6 - "compile-libfuzzer-introspector-x86_64": -- Looking for sys/mman.h
Step #6 - "compile-libfuzzer-introspector-x86_64": -- Looking for sys/mman.h - found
Step #6 - "compile-libfuzzer-introspector-x86_64": -- Looking for sys/resource.h
Step #6 - "compile-libfuzzer-introspector-x86_64": -- Looking for sys/resource.h - found
Step #6 - "compile-libfuzzer-introspector-x86_64": -- Looking for sys/time.h
Step #6 - "compile-libfuzzer-introspector-x86_64": -- Looking for sys/time.h - found
Step #6 - "compile-libfuzzer-introspector-x86_64": -- Looking for sys/uio.h
Step #6 - "compile-libfuzzer-introspector-x86_64": -- Looking for sys/uio.h - found
Step #6 - "compile-libfuzzer-introspector-x86_64": -- Looking for unistd.h
Step #6 - "compile-libfuzzer-introspector-x86_64": -- Looking for unistd.h - found
Step #6 - "compile-libfuzzer-introspector-x86_64": -- Looking for windows.h
Step #6 - "compile-libfuzzer-introspector-x86_64": -- Looking for windows.h - not found
Step #6 - "compile-libfuzzer-introspector-x86_64": -- Looking for zlibVersion in z
Step #6 - "compile-libfuzzer-introspector-x86_64": -- Looking for zlibVersion in z - found
Step #6 - "compile-libfuzzer-introspector-x86_64": -- Looking for lzo1x_1_15_compress in lzo2
Step #6 - "compile-libfuzzer-introspector-x86_64": -- Looking for lzo1x_1_15_compress in lzo2 - not found
Step #6 - "compile-libfuzzer-introspector-x86_64": -- Looking for LZ4_compress_default in lz4
Step #6 - "compile-libfuzzer-introspector-x86_64": -- Looking for LZ4_compress_default in lz4 - not found
Step #6 - "compile-libfuzzer-introspector-x86_64": -- Performing Test HAVE_VISUAL_STUDIO_ARCH_AVX
Step #6 - "compile-libfuzzer-introspector-x86_64": -- Performing Test HAVE_VISUAL_STUDIO_ARCH_AVX - Failed
Step #6 - "compile-libfuzzer-introspector-x86_64": -- Performing Test HAVE_VISUAL_STUDIO_ARCH_AVX2
Step #6 - "compile-libfuzzer-introspector-x86_64": -- Performing Test HAVE_VISUAL_STUDIO_ARCH_AVX2 - Failed
Step #6 - "compile-libfuzzer-introspector-x86_64": -- Performing Test HAVE_CLANG_MAVX
Step #6 - "compile-libfuzzer-introspector-x86_64": -- Performing Test HAVE_CLANG_MAVX - Success
Step #6 - "compile-libfuzzer-introspector-x86_64": -- Performing Test HAVE_CLANG_MBMI2
Step #6 - "compile-libfuzzer-introspector-x86_64": -- Performing Test HAVE_CLANG_MBMI2 - Success
Step #6 - "compile-libfuzzer-introspector-x86_64": -- Performing Test SNAPPY_HAVE_NO_MISSING_FIELD_INITIALIZERS
Step #6 - "compile-libfuzzer-introspector-x86_64": -- Performing Test SNAPPY_HAVE_NO_MISSING_FIELD_INITIALIZERS - Success
Step #6 - "compile-libfuzzer-introspector-x86_64": -- Performing Test SNAPPY_HAVE_NO_IMPLICIT_INT_FLOAT_CONVERSION
Step #6 - "compile-libfuzzer-introspector-x86_64": -- Performing Test SNAPPY_HAVE_NO_IMPLICIT_INT_FLOAT_CONVERSION - Success
Step #6 - "compile-libfuzzer-introspector-x86_64": -- Performing Test HAVE_BUILTIN_EXPECT
Step #6 - "compile-libfuzzer-introspector-x86_64": -- Performing Test HAVE_BUILTIN_EXPECT - Success
Step #6 - "compile-libfuzzer-introspector-x86_64": -- Performing Test HAVE_BUILTIN_CTZ
Step #6 - "compile-libfuzzer-introspector-x86_64": -- Performing Test HAVE_BUILTIN_CTZ - Success
Step #6 - "compile-libfuzzer-introspector-x86_64": -- Performing Test HAVE_BUILTIN_PREFETCH
Step #6 - "compile-libfuzzer-introspector-x86_64": -- Performing Test HAVE_BUILTIN_PREFETCH - Success
Step #6 - "compile-libfuzzer-introspector-x86_64": -- Performing Test HAVE_ATTRIBUTE_ALWAYS_INLINE
Step #6 - "compile-libfuzzer-introspector-x86_64": -- Performing Test HAVE_ATTRIBUTE_ALWAYS_INLINE - Success
Step #6 - "compile-libfuzzer-introspector-x86_64": -- Performing Test SNAPPY_HAVE_SSSE3
Step #6 - "compile-libfuzzer-introspector-x86_64": -- Performing Test SNAPPY_HAVE_SSSE3 - Failed
Step #6 - "compile-libfuzzer-introspector-x86_64": -- Performing Test SNAPPY_HAVE_X86_CRC32
Step #6 - "compile-libfuzzer-introspector-x86_64": -- Performing Test SNAPPY_HAVE_X86_CRC32 - Failed
Step #6 - "compile-libfuzzer-introspector-x86_64": -- Performing Test SNAPPY_HAVE_NEON_CRC32
Step #6 - "compile-libfuzzer-introspector-x86_64": -- Performing Test SNAPPY_HAVE_NEON_CRC32 - Failed
Step #6 - "compile-libfuzzer-introspector-x86_64": -- Performing Test SNAPPY_HAVE_BMI2
Step #6 - "compile-libfuzzer-introspector-x86_64": -- Performing Test SNAPPY_HAVE_BMI2 - Failed
Step #6 - "compile-libfuzzer-introspector-x86_64": -- Performing Test SNAPPY_HAVE_NEON
Step #6 - "compile-libfuzzer-introspector-x86_64": -- Performing Test SNAPPY_HAVE_NEON - Failed
Step #6 - "compile-libfuzzer-introspector-x86_64": -- Performing Test SNAPPY_RVV_1
Step #6 - "compile-libfuzzer-introspector-x86_64": -- Performing Test SNAPPY_RVV_1 - Failed
Step #6 - "compile-libfuzzer-introspector-x86_64": -- Performing Test SNAPPY_RVV_0_7
Step #6 - "compile-libfuzzer-introspector-x86_64": -- Performing Test SNAPPY_RVV_0_7 - Failed
Step #6 - "compile-libfuzzer-introspector-x86_64": -- Looking for mmap
Step #6 - "compile-libfuzzer-introspector-x86_64": -- Looking for mmap - found
Step #6 - "compile-libfuzzer-introspector-x86_64": -- Looking for sysconf
Step #6 - "compile-libfuzzer-introspector-x86_64": -- Looking for sysconf - found
Step #6 - "compile-libfuzzer-introspector-x86_64": -- Performing Test CMAKE_HAVE_LIBC_PTHREAD
Step #6 - "compile-libfuzzer-introspector-x86_64": -- Performing Test CMAKE_HAVE_LIBC_PTHREAD - Success
Step #6 - "compile-libfuzzer-introspector-x86_64": -- Found Threads: TRUE
Step #6 - "compile-libfuzzer-introspector-x86_64": -- Configuring done (3.6s)
Step #6 - "compile-libfuzzer-introspector-x86_64": -- Generating done (0.0s)
Step #6 - "compile-libfuzzer-introspector-x86_64": -- Build files have been written to: /src/snappy/build
Step #6 - "compile-libfuzzer-introspector-x86_64": + cmake --build .
Step #6 - "compile-libfuzzer-introspector-x86_64": [ 4%] [32mBuilding CXX object CMakeFiles/snappy.dir/snappy-c.cc.o[0m
Step #6 - "compile-libfuzzer-introspector-x86_64": [ 8%] [32mBuilding CXX object CMakeFiles/snappy.dir/snappy-sinksource.cc.o[0m
Step #6 - "compile-libfuzzer-introspector-x86_64": [ 12%] [32mBuilding CXX object CMakeFiles/snappy.dir/snappy-stubs-internal.cc.o[0m
Step #6 - "compile-libfuzzer-introspector-x86_64": [ 16%] [32mBuilding CXX object CMakeFiles/snappy.dir/snappy.cc.o[0m
Step #6 - "compile-libfuzzer-introspector-x86_64": [ 20%] [32m[1mLinking CXX static library libsnappy.a[0m
Step #6 - "compile-libfuzzer-introspector-x86_64": [ 20%] Built target snappy
Step #6 - "compile-libfuzzer-introspector-x86_64": [ 25%] [32mBuilding CXX object CMakeFiles/snappy_test_support.dir/snappy-test.cc.o[0m
Step #6 - "compile-libfuzzer-introspector-x86_64": [1m/src/snappy/snappy-test.cc:469:52: [0m[0;1;31merror: [0m[1mvariable 'dummyin' is uninitialized when passed as a const pointer argument here [-Werror,-Wuninitialized-const-pointer][0m
Step #6 - "compile-libfuzzer-introspector-x86_64": 469 | [0;34mif[0m ( UncompressChunkOrAll(&dummyout, &dummylen, &dummyin, [0;32m0[0m, Z_FINISH)[0m
Step #6 - "compile-libfuzzer-introspector-x86_64": | [0;1;32m ^~~~~~~
Step #6 - "compile-libfuzzer-introspector-x86_64": [0m1 error generated.
Step #6 - "compile-libfuzzer-introspector-x86_64": make[2]: *** [CMakeFiles/snappy_test_support.dir/build.make:76: CMakeFiles/snappy_test_support.dir/snappy-test.cc.o] Error 1
Step #6 - "compile-libfuzzer-introspector-x86_64": make[1]: *** [CMakeFiles/Makefile2:172: CMakeFiles/snappy_test_support.dir/all] Error 2
Step #6 - "compile-libfuzzer-introspector-x86_64": make: *** [Makefile:146: all] Error 2
Step #6 - "compile-libfuzzer-introspector-x86_64": ********************************************************************************\nFailed to build.\nTo reproduce, run:\npython infra/helper.py build_image snappy\npython infra/helper.py build_fuzzers --sanitizer introspector --engine libfuzzer --architecture x86_64 snappy\n********************************************************************************
Finished Step #6 - "compile-libfuzzer-introspector-x86_64"
ERROR: step exited with non-zero status: 1
Starting Step #7
Step #7: Already have image (with digest): gcr.io/cloud-builders/gsutil
Step #7: CommandException: 1 files/objects could not be removed.
Finished Step #7
Starting Step #8
Step #8: Already have image (with digest): gcr.io/cloud-builders/gsutil
Step #8: Copying file:///workspace/out/libfuzzer-introspector-x86_64/inspector/summary.json [Content-Type=application/json]...
Step #8: / [0/75 files][ 0.0 B/169.4 MiB] 0% Done
Copying file:///workspace/out/libfuzzer-introspector-x86_64/inspector/prism.js [Content-Type=text/javascript]...
Step #8: / [0/75 files][ 0.0 B/169.4 MiB] 0% Done
Copying file:///workspace/out/libfuzzer-introspector-x86_64/inspector/all_tests.json [Content-Type=application/json]...
Step #8: / [0/75 files][ 60.9 KiB/169.4 MiB] 0% Done
Copying file:///workspace/out/libfuzzer-introspector-x86_64/inspector/custom.js [Content-Type=text/javascript]...
Step #8: / [0/75 files][ 60.9 KiB/169.4 MiB] 0% Done
Copying file:///workspace/out/libfuzzer-introspector-x86_64/inspector/fuzzerLogFile-snappy_compress_fuzzer.data [Content-Type=application/octet-stream]...
Step #8: / [0/75 files][ 61.0 KiB/169.4 MiB] 0% Done
/ [1/75 files][ 70.8 KiB/169.4 MiB] 0% Done
/ [2/75 files][ 70.8 KiB/169.4 MiB] 0% Done
Copying file:///workspace/out/libfuzzer-introspector-x86_64/inspector/result.json [Content-Type=application/json]...
Step #8: / [2/75 files][ 70.8 KiB/169.4 MiB] 0% Done
Copying file:///workspace/out/libfuzzer-introspector-x86_64/inspector/fuzzerLogFile-snappy_uncompress_fuzzer.data [Content-Type=application/octet-stream]...
Step #8: / [3/75 files][ 70.8 KiB/169.4 MiB] 0% Done
/ [3/75 files][ 70.8 KiB/169.4 MiB] 0% Done
Copying file:///workspace/out/libfuzzer-introspector-x86_64/inspector/snappy_uncompress_fuzzer.cc_colormap.png [Content-Type=image/png]...
Step #8: / [3/75 files][ 70.8 KiB/169.4 MiB] 0% Done
/ [4/75 files][ 70.8 KiB/169.4 MiB] 0% Done
Copying file:///workspace/out/libfuzzer-introspector-x86_64/inspector/fuzz_report.html [Content-Type=text/html]...
Step #8: / [5/75 files][ 70.8 KiB/169.4 MiB] 0% Done
/ [5/75 files][ 70.8 KiB/169.4 MiB] 0% Done
Copying file:///workspace/out/libfuzzer-introspector-x86_64/inspector/all-files.json [Content-Type=application/json]...
Step #8: / [5/75 files][ 70.8 KiB/169.4 MiB] 0% Done
Copying file:///workspace/out/libfuzzer-introspector-x86_64/inspector/all_functions.js [Content-Type=text/javascript]...
Step #8: / [5/75 files][ 1.3 MiB/169.4 MiB] 0% Done
Copying file:///workspace/out/libfuzzer-introspector-x86_64/inspector/calltree_view_1.html [Content-Type=text/html]...
Step #8: / [5/75 files][ 1.3 MiB/169.4 MiB] 0% Done
Copying file:///workspace/out/libfuzzer-introspector-x86_64/inspector/branch-blockers.json [Content-Type=application/json]...
Step #8: / [5/75 files][ 1.3 MiB/169.4 MiB] 0% Done
Copying file:///workspace/out/libfuzzer-introspector-x86_64/inspector/calltree.js [Content-Type=text/javascript]...
Step #8: / [5/75 files][ 1.3 MiB/169.4 MiB] 0% Done
Copying file:///workspace/out/libfuzzer-introspector-x86_64/inspector/fuzzer_table_data.js [Content-Type=text/javascript]...
Step #8: / [5/75 files][ 1.3 MiB/169.4 MiB] 0% Done
Copying file:///workspace/out/libfuzzer-introspector-x86_64/inspector/all_tests_with_xreference.json [Content-Type=application/json]...
Step #8: / [5/75 files][ 1.3 MiB/169.4 MiB] 0% Done
Copying file:///workspace/out/libfuzzer-introspector-x86_64/inspector/macro_block_info.json [Content-Type=application/json]...
Step #8: / [5/75 files][ 1.3 MiB/169.4 MiB] 0% Done
Copying file:///workspace/out/libfuzzer-introspector-x86_64/inspector/snappy_compress_fuzzer.cc_colormap.png [Content-Type=image/png]...
Step #8: / [5/75 files][ 1.3 MiB/169.4 MiB] 0% Done
Copying file:///workspace/out/libfuzzer-introspector-x86_64/inspector/clike.js [Content-Type=text/javascript]...
Step #8: / [5/75 files][ 1.3 MiB/169.4 MiB] 0% Done
Copying file:///workspace/out/libfuzzer-introspector-x86_64/inspector/all-friendly-debug-types.json [Content-Type=application/json]...
Step #8: / [5/75 files][ 1.3 MiB/169.4 MiB] 0% Done
Copying file:///workspace/out/libfuzzer-introspector-x86_64/inspector/analysis_1.js [Content-Type=text/javascript]...
Step #8: / [5/75 files][ 1.3 MiB/169.4 MiB] 0% Done
Copying file:///workspace/out/libfuzzer-introspector-x86_64/inspector/full_type_defs.json [Content-Type=application/json]...
Step #8: / [5/75 files][ 1.3 MiB/169.4 MiB] 0% Done
Copying file:///workspace/out/libfuzzer-introspector-x86_64/inspector/fuzzerLogFile-snappy_uncompress_fuzzer.data.yaml [Content-Type=application/yaml]...
Step #8: / [5/75 files][ 1.3 MiB/169.4 MiB] 0% Done
Copying file:///workspace/out/libfuzzer-introspector-x86_64/inspector/prism.css [Content-Type=text/css]...
Step #8: / [5/75 files][ 1.3 MiB/169.4 MiB] 0% Done
/ [6/75 files][ 1.3 MiB/169.4 MiB] 0% Done
Copying file:///workspace/out/libfuzzer-introspector-x86_64/inspector/calltree_view_0.html [Content-Type=text/html]...
Step #8: / [6/75 files][ 1.3 MiB/169.4 MiB] 0% Done
/ [7/75 files][ 1.3 MiB/169.4 MiB] 0% Done
/ [8/75 files][ 1.3 MiB/169.4 MiB] 0% Done
Copying file:///workspace/out/libfuzzer-introspector-x86_64/inspector/all-fuzz-introspector-functions.json [Content-Type=application/json]...
Step #8: / [8/75 files][ 1.4 MiB/169.4 MiB] 0% Done
Copying file:///workspace/out/libfuzzer-introspector-x86_64/inspector/test-files.json [Content-Type=application/json]...
Step #8: / [9/75 files][ 1.4 MiB/169.4 MiB] 0% Done
/ [9/75 files][ 1.4 MiB/169.4 MiB] 0% Done
Copying file:///workspace/out/libfuzzer-introspector-x86_64/inspector/fuzzerLogFile-snappy_compress_fuzzer.data.yaml [Content-Type=application/yaml]...
Step #8: / [9/75 files][ 1.4 MiB/169.4 MiB] 0% Done
Copying file:///workspace/out/libfuzzer-introspector-x86_64/inspector/all_debug_info.json [Content-Type=application/json]...
Step #8: / [9/75 files][ 1.9 MiB/169.4 MiB] 1% Done
/ [10/75 files][ 1.9 MiB/169.4 MiB] 1% Done
Copying file:///workspace/out/libfuzzer-introspector-x86_64/inspector/styles.css [Content-Type=text/css]...
Step #8: / [10/75 files][ 2.1 MiB/169.4 MiB] 1% Done
Copying file:///workspace/out/libfuzzer-introspector-x86_64/inspector/source-code/src/snappy/snappy_uncompress_fuzzer.cc [Content-Type=text/x-c++src]...
Step #8: / [10/75 files][ 5.5 MiB/169.4 MiB] 3% Done
Copying file:///workspace/out/libfuzzer-introspector-x86_64/inspector/source-code/src/snappy/snappy-sinksource.h [Content-Type=text/x-chdr]...
Step #8: / [10/75 files][ 7.3 MiB/169.4 MiB] 4% Done
Copying file:///workspace/out/libfuzzer-introspector-x86_64/inspector/source-code/src/snappy/snappy-sinksource.cc [Content-Type=text/x-c++src]...
Step #8: / [10/75 files][ 8.6 MiB/169.4 MiB] 5% Done
Copying file:///workspace/out/libfuzzer-introspector-x86_64/inspector/source-code/src/snappy/snappy-internal.h [Content-Type=text/x-chdr]...
Step #8: / [10/75 files][ 8.6 MiB/169.4 MiB] 5% Done
Copying file:///workspace/out/libfuzzer-introspector-x86_64/inspector/source-code/src/snappy/snappy-stubs-internal.cc [Content-Type=text/x-c++src]...
Step #8: / [10/75 files][ 8.7 MiB/169.4 MiB] 5% Done
Copying file:///workspace/out/libfuzzer-introspector-x86_64/inspector/source-code/src/snappy/snappy_compress_fuzzer.cc [Content-Type=text/x-c++src]...
Step #8: / [10/75 files][ 8.7 MiB/169.4 MiB] 5% Done
Copying file:///workspace/out/libfuzzer-introspector-x86_64/inspector/source-code/src/snappy/snappy-test.cc [Content-Type=text/x-c++src]...
Step #8: / [10/75 files][ 8.7 MiB/169.4 MiB] 5% Done
Copying file:///workspace/out/libfuzzer-introspector-x86_64/inspector/source-code/src/snappy/snappy-c.cc [Content-Type=text/x-c++src]...
Step #8: / [10/75 files][ 8.7 MiB/169.4 MiB] 5% Done
Copying file:///workspace/out/libfuzzer-introspector-x86_64/inspector/source-code/src/snappy/snappy.h [Content-Type=text/x-chdr]...
Step #8: / [10/75 files][ 8.7 MiB/169.4 MiB] 5% Done
Copying file:///workspace/out/libfuzzer-introspector-x86_64/inspector/source-code/src/snappy/snappy_benchmark.cc [Content-Type=text/x-c++src]...
Step #8: / [10/75 files][ 8.8 MiB/169.4 MiB] 5% Done
Copying file:///workspace/out/libfuzzer-introspector-x86_64/inspector/source-code/src/snappy/snappy.cc [Content-Type=text/x-c++src]...
Step #8: / [10/75 files][ 8.8 MiB/169.4 MiB] 5% Done
Copying file:///workspace/out/libfuzzer-introspector-x86_64/inspector/source-code/src/snappy/snappy_test_data.h [Content-Type=text/x-chdr]...
Step #8: / [10/75 files][ 8.8 MiB/169.4 MiB] 5% Done
Copying file:///workspace/out/libfuzzer-introspector-x86_64/inspector/source-code/src/snappy/snappy-c.h [Content-Type=text/x-chdr]...
Step #8: / [10/75 files][ 8.8 MiB/169.4 MiB] 5% Done
Copying file:///workspace/out/libfuzzer-introspector-x86_64/inspector/source-code/src/snappy/snappy_unittest.cc [Content-Type=text/x-c++src]...
Step #8: / [10/75 files][ 8.8 MiB/169.4 MiB] 5% Done
Copying file:///workspace/out/libfuzzer-introspector-x86_64/inspector/source-code/src/snappy/snappy-test.h [Content-Type=text/x-chdr]...
Step #8: / [10/75 files][ 8.8 MiB/169.4 MiB] 5% Done
/ [11/75 files][ 8.8 MiB/169.4 MiB] 5% Done
/ [12/75 files][ 8.8 MiB/169.4 MiB] 5% Done
/ [13/75 files][ 8.9 MiB/169.4 MiB] 5% Done
/ [14/75 files][ 8.9 MiB/169.4 MiB] 5% Done
/ [15/75 files][ 8.9 MiB/169.4 MiB] 5% Done
Copying file:///workspace/out/libfuzzer-introspector-x86_64/inspector/source-code/src/snappy/snappy_test_tool.cc [Content-Type=text/x-c++src]...
Step #8: / [15/75 files][ 8.9 MiB/169.4 MiB] 5% Done
Copying file:///workspace/out/libfuzzer-introspector-x86_64/inspector/source-code/src/snappy/snappy_test_data.cc [Content-Type=text/x-c++src]...
Step #8: / [15/75 files][ 8.9 MiB/169.4 MiB] 5% Done
-
Copying file:///workspace/out/libfuzzer-introspector-x86_64/inspector/source-code/src/snappy/snappy-stubs-internal.h [Content-Type=text/x-chdr]...
Step #8: - [15/75 files][ 8.9 MiB/169.4 MiB] 5% Done
- [16/75 files][ 8.9 MiB/169.4 MiB] 5% Done
Copying file:///workspace/out/libfuzzer-introspector-x86_64/inspector/light/all_tests.json [Content-Type=application/json]...
Step #8: - [16/75 files][ 8.9 MiB/169.4 MiB] 5% Done
Copying file:///workspace/out/libfuzzer-introspector-x86_64/inspector/light/all_files.json [Content-Type=application/json]...
Step #8: - [16/75 files][ 8.9 MiB/169.4 MiB] 5% Done
Copying file:///workspace/out/libfuzzer-introspector-x86_64/inspector/light/all_pairs.json [Content-Type=application/json]...
Step #8: - [16/75 files][ 8.9 MiB/169.4 MiB] 5% Done
Copying file:///workspace/out/libfuzzer-introspector-x86_64/inspector/light/source_files/src/snappy/snappy_uncompress_fuzzer.cc [Content-Type=text/x-c++src]...
Step #8: - [16/75 files][ 8.9 MiB/169.4 MiB] 5% Done
Copying file:///workspace/out/libfuzzer-introspector-x86_64/inspector/light/source_files/src/snappy/snappy-sinksource.h [Content-Type=text/x-chdr]...
Step #8: - [16/75 files][ 8.9 MiB/169.4 MiB] 5% Done
Copying file:///workspace/out/libfuzzer-introspector-x86_64/inspector/light/source_files/src/snappy/snappy-internal.h [Content-Type=text/x-chdr]...
Step #8: - [16/75 files][ 8.9 MiB/169.4 MiB] 5% Done
Copying file:///workspace/out/libfuzzer-introspector-x86_64/inspector/light/source_files/src/snappy/snappy-sinksource.cc [Content-Type=text/x-c++src]...
Step #8: - [16/75 files][ 8.9 MiB/169.4 MiB] 5% Done
Copying file:///workspace/out/libfuzzer-introspector-x86_64/inspector/light/source_files/src/snappy/snappy_compress_fuzzer.cc [Content-Type=text/x-c++src]...
Step #8: - [17/75 files][ 9.0 MiB/169.4 MiB] 5% Done
- [17/75 files][ 9.0 MiB/169.4 MiB] 5% Done
Copying file:///workspace/out/libfuzzer-introspector-x86_64/inspector/light/source_files/src/snappy/snappy-stubs-internal.cc [Content-Type=text/x-c++src]...
Step #8: - [17/75 files][ 9.0 MiB/169.4 MiB] 5% Done
- [18/75 files][ 9.0 MiB/169.4 MiB] 5% Done
Copying file:///workspace/out/libfuzzer-introspector-x86_64/inspector/light/source_files/src/snappy/snappy-c.cc [Content-Type=text/x-c++src]...
Step #8: - [18/75 files][ 9.0 MiB/169.4 MiB] 5% Done
Copying file:///workspace/out/libfuzzer-introspector-x86_64/inspector/light/source_files/src/snappy/snappy-test.cc [Content-Type=text/x-c++src]...
Step #8: - [18/75 files][ 9.0 MiB/169.4 MiB] 5% Done
Copying file:///workspace/out/libfuzzer-introspector-x86_64/inspector/light/source_files/src/snappy/snappy.h [Content-Type=text/x-chdr]...
Step #8: - [18/75 files][ 9.0 MiB/169.4 MiB] 5% Done
Copying file:///workspace/out/libfuzzer-introspector-x86_64/inspector/light/source_files/src/snappy/snappy_test_data.h [Content-Type=text/x-chdr]...
Step #8: - [18/75 files][ 9.0 MiB/169.4 MiB] 5% Done
Copying file:///workspace/out/libfuzzer-introspector-x86_64/inspector/light/source_files/src/snappy/snappy_benchmark.cc [Content-Type=text/x-c++src]...
Step #8: - [18/75 files][ 9.0 MiB/169.4 MiB] 5% Done
Copying file:///workspace/out/libfuzzer-introspector-x86_64/inspector/light/source_files/src/snappy/snappy.cc [Content-Type=text/x-c++src]...
Step #8: - [18/75 files][ 9.0 MiB/169.4 MiB] 5% Done
Copying file:///workspace/out/libfuzzer-introspector-x86_64/inspector/light/source_files/src/snappy/snappy-c.h [Content-Type=text/x-chdr]...
Step #8: - [18/75 files][ 9.0 MiB/169.4 MiB] 5% Done
Copying file:///workspace/out/libfuzzer-introspector-x86_64/inspector/light/source_files/src/snappy/snappy_unittest.cc [Content-Type=text/x-c++src]...
Step #8: - [19/75 files][ 9.0 MiB/169.4 MiB] 5% Done
- [19/75 files][ 9.0 MiB/169.4 MiB] 5% Done
- [20/75 files][ 9.0 MiB/169.4 MiB] 5% Done
Copying file:///workspace/out/libfuzzer-introspector-x86_64/inspector/second-frontend-run/fuzzerLogFile-snappy_uncompress_fuzzer.data [Content-Type=application/octet-stream]...
Step #8: - [20/75 files][ 9.0 MiB/169.4 MiB] 5% Done
Copying file:///workspace/out/libfuzzer-introspector-x86_64/inspector/light/source_files/src/snappy/snappy-test.h [Content-Type=text/x-chdr]...
Step #8: - [20/75 files][ 9.0 MiB/169.4 MiB] 5% Done
Copying file:///workspace/out/libfuzzer-introspector-x86_64/inspector/light/source_files/src/snappy/snappy_test_tool.cc [Content-Type=text/x-c++src]...
Step #8: - [20/75 files][ 9.0 MiB/169.4 MiB] 5% Done
Copying file:///workspace/out/libfuzzer-introspector-x86_64/inspector/second-frontend-run/macro_block_info.json [Content-Type=application/json]...
Step #8: - [20/75 files][ 9.0 MiB/169.4 MiB] 5% Done
Copying file:///workspace/out/libfuzzer-introspector-x86_64/inspector/second-frontend-run/full_type_defs.json [Content-Type=application/json]...
Step #8: - [20/75 files][ 9.0 MiB/169.4 MiB] 5% Done
Copying file:///workspace/out/libfuzzer-introspector-x86_64/inspector/second-frontend-run/fuzzerLogFile-snappy_uncompress_fuzzer.data.yaml [Content-Type=application/yaml]...
Step #8: Copying file:///workspace/out/libfuzzer-introspector-x86_64/inspector/light/source_files/src/snappy/snappy-stubs-internal.h [Content-Type=text/x-chdr]...
Step #8: - [20/75 files][ 9.0 MiB/169.4 MiB] 5% Done
Copying file:///workspace/out/libfuzzer-introspector-x86_64/inspector/light/source_files/src/snappy/snappy_test_data.cc [Content-Type=text/x-c++src]...
Step #8: - [21/75 files][ 9.0 MiB/169.4 MiB] 5% Done
- [21/75 files][ 9.0 MiB/169.4 MiB] 5% Done
- [22/75 files][ 9.0 MiB/169.4 MiB] 5% Done
- [22/75 files][ 9.0 MiB/169.4 MiB] 5% Done
Copying file:///workspace/out/libfuzzer-introspector-x86_64/inspector/second-frontend-run/fuzzerLogFile-snappy_compress_fuzzer.data.yaml [Content-Type=application/yaml]...
Step #8: - [23/75 files][ 9.0 MiB/169.4 MiB] 5% Done
- [23/75 files][ 9.0 MiB/169.4 MiB] 5% Done
Copying file:///workspace/out/libfuzzer-introspector-x86_64/inspector/second-frontend-run/fuzzerLogFile-snappy_compress_fuzzer.data [Content-Type=application/octet-stream]...
Step #8: - [23/75 files][ 9.0 MiB/169.4 MiB] 5% Done
- [24/75 files][ 9.0 MiB/169.4 MiB] 5% Done
- [25/75 files][ 9.0 MiB/169.4 MiB] 5% Done
- [26/75 files][ 9.0 MiB/169.4 MiB] 5% Done
- [27/75 files][ 9.0 MiB/169.4 MiB] 5% Done
- [28/75 files][ 9.0 MiB/169.4 MiB] 5% Done
- [29/75 files][ 9.0 MiB/169.4 MiB] 5% Done
- [30/75 files][ 9.3 MiB/169.4 MiB] 5% Done
- [31/75 files][ 10.9 MiB/169.4 MiB] 6% Done
- [32/75 files][ 15.2 MiB/169.4 MiB] 8% Done
- [33/75 files][ 17.6 MiB/169.4 MiB] 10% Done
- [34/75 files][ 17.6 MiB/169.4 MiB] 10% Done
- [35/75 files][ 17.7 MiB/169.4 MiB] 10% Done
- [36/75 files][ 17.7 MiB/169.4 MiB] 10% Done
- [37/75 files][ 17.7 MiB/169.4 MiB] 10% Done
- [38/75 files][ 17.7 MiB/169.4 MiB] 10% Done
- [39/75 files][ 17.7 MiB/169.4 MiB] 10% Done
- [40/75 files][ 17.7 MiB/169.4 MiB] 10% Done
- [41/75 files][ 17.7 MiB/169.4 MiB] 10% Done
- [42/75 files][ 17.7 MiB/169.4 MiB] 10% Done
- [43/75 files][ 17.7 MiB/169.4 MiB] 10% Done
- [44/75 files][ 17.7 MiB/169.4 MiB] 10% Done
- [45/75 files][ 17.7 MiB/169.4 MiB] 10% Done
- [46/75 files][ 17.7 MiB/169.4 MiB] 10% Done
- [47/75 files][ 17.7 MiB/169.4 MiB] 10% Done
- [48/75 files][ 18.2 MiB/169.4 MiB] 10% Done
- [49/75 files][ 18.2 MiB/169.4 MiB] 10% Done
- [50/75 files][ 19.3 MiB/169.4 MiB] 11% Done
- [51/75 files][ 21.3 MiB/169.4 MiB] 12% Done
- [52/75 files][ 21.3 MiB/169.4 MiB] 12% Done
- [53/75 files][ 24.4 MiB/169.4 MiB] 14% Done
- [54/75 files][ 28.8 MiB/169.4 MiB] 17% Done
- [55/75 files][ 37.1 MiB/169.4 MiB] 21% Done
- [56/75 files][ 37.4 MiB/169.4 MiB] 22% Done
- [57/75 files][ 40.4 MiB/169.4 MiB] 23% Done
- [58/75 files][ 45.4 MiB/169.4 MiB] 26% Done
- [59/75 files][ 54.1 MiB/169.4 MiB] 31% Done
- [60/75 files][ 55.7 MiB/169.4 MiB] 32% Done
- [61/75 files][ 58.0 MiB/169.4 MiB] 34% Done
- [62/75 files][ 59.0 MiB/169.4 MiB] 34% Done
\
\ [63/75 files][106.9 MiB/169.4 MiB] 63% Done
\ [64/75 files][116.2 MiB/169.4 MiB] 68% Done
\ [65/75 files][129.1 MiB/169.4 MiB] 76% Done
\ [66/75 files][139.4 MiB/169.4 MiB] 82% Done
\ [67/75 files][140.2 MiB/169.4 MiB] 82% Done
\ [68/75 files][142.5 MiB/169.4 MiB] 84% Done
\ [69/75 files][150.1 MiB/169.4 MiB] 88% Done
\ [70/75 files][151.4 MiB/169.4 MiB] 89% Done
\ [71/75 files][153.9 MiB/169.4 MiB] 90% Done
\ [72/75 files][169.4 MiB/169.4 MiB] 99% Done
\ [73/75 files][169.4 MiB/169.4 MiB] 99% Done
\ [74/75 files][169.4 MiB/169.4 MiB] 99% Done
\ [75/75 files][169.4 MiB/169.4 MiB] 100% Done
Step #8: Operation completed over 75 objects/169.4 MiB.
Finished Step #8
PUSH
DONE