starting build "cb8eff36-7a24-474d-885a-8f6cc59ceca9"
FETCHSOURCE
BUILD
Starting Step #0
Step #0: Pulling image: gcr.io/oss-fuzz-base/base-runner
Step #0: Using default tag: latest
Step #0: latest: Pulling from oss-fuzz-base/base-runner
Step #0: b549f31133a9: Pulling fs layer
Step #0: 7e783fa1d768: Pulling fs layer
Step #0: dccb20f57e48: Pulling fs layer
Step #0: 2dcd69a82473: Pulling fs layer
Step #0: c9941d5b53dc: Pulling fs layer
Step #0: e89cdda2adb8: Pulling fs layer
Step #0: 544a236cc2df: Pulling fs layer
Step #0: c88e3b2f920d: Pulling fs layer
Step #0: 1af7baa48f90: Pulling fs layer
Step #0: 2e04d1219cdb: Pulling fs layer
Step #0: 999c686a0fbd: Pulling fs layer
Step #0: c3a76b8041f7: Pulling fs layer
Step #0: 0c105c78781a: Pulling fs layer
Step #0: 3a2fba26564e: Pulling fs layer
Step #0: e7aa17ca6459: Pulling fs layer
Step #0: 7556efabcf46: Pulling fs layer
Step #0: 6f68fac3dd20: Pulling fs layer
Step #0: 9403817d52c6: Pulling fs layer
Step #0: a85759bed276: Pulling fs layer
Step #0: 0f41dafea62c: Pulling fs layer
Step #0: 9375569908a4: Pulling fs layer
Step #0: 496cbc70d26a: Pulling fs layer
Step #0: a3e8923ddc0d: Pulling fs layer
Step #0: 58938f63fe2e: Pulling fs layer
Step #0: 28be54f8b3f2: Pulling fs layer
Step #0: 0ab4e5fd3974: Pulling fs layer
Step #0: e585942f66e5: Pulling fs layer
Step #0: c3a76b8041f7: Waiting
Step #0: b0fc6ef86566: Pulling fs layer
Step #0: 0c105c78781a: Waiting
Step #0: 3a2fba26564e: Waiting
Step #0: a3e8923ddc0d: Waiting
Step #0: e7aa17ca6459: Waiting
Step #0: 7556efabcf46: Waiting
Step #0: 58938f63fe2e: Waiting
Step #0: 9375569908a4: Waiting
Step #0: 28be54f8b3f2: Waiting
Step #0: 496cbc70d26a: Waiting
Step #0: 9403817d52c6: Waiting
Step #0: 999c686a0fbd: Waiting
Step #0: 1af7baa48f90: Waiting
Step #0: 0f41dafea62c: Waiting
Step #0: b0fc6ef86566: Waiting
Step #0: 0ab4e5fd3974: Waiting
Step #0: a85759bed276: Waiting
Step #0: 6f68fac3dd20: Waiting
Step #0: c88e3b2f920d: Waiting
Step #0: 544a236cc2df: Waiting
Step #0: 2e04d1219cdb: Waiting
Step #0: dccb20f57e48: Verifying Checksum
Step #0: dccb20f57e48: Download complete
Step #0: e89cdda2adb8: Verifying Checksum
Step #0: 2dcd69a82473: Verifying Checksum
Step #0: 2dcd69a82473: Download complete
Step #0: c9941d5b53dc: Verifying Checksum
Step #0: c9941d5b53dc: Download complete
Step #0: c88e3b2f920d: Verifying Checksum
Step #0: c88e3b2f920d: Download complete
Step #0: 544a236cc2df: Verifying Checksum
Step #0: 544a236cc2df: Download complete
Step #0: 2e04d1219cdb: Verifying Checksum
Step #0: 2e04d1219cdb: Download complete
Step #0: 999c686a0fbd: Verifying Checksum
Step #0: 999c686a0fbd: Download complete
Step #0: b549f31133a9: Verifying Checksum
Step #0: b549f31133a9: Download complete
Step #0: c3a76b8041f7: Verifying Checksum
Step #0: c3a76b8041f7: Download complete
Step #0: e7aa17ca6459: Download complete
Step #0: 7556efabcf46: Verifying Checksum
Step #0: 7556efabcf46: Download complete
Step #0: 3a2fba26564e: Verifying Checksum
Step #0: 3a2fba26564e: Download complete
Step #0: 9403817d52c6: Verifying Checksum
Step #0: 9403817d52c6: Download complete
Step #0: 1af7baa48f90: Verifying Checksum
Step #0: 1af7baa48f90: Download complete
Step #0: 0f41dafea62c: Verifying Checksum
Step #0: 0f41dafea62c: Download complete
Step #0: 9375569908a4: Verifying Checksum
Step #0: 9375569908a4: Download complete
Step #0: 7e783fa1d768: Verifying Checksum
Step #0: 7e783fa1d768: Download complete
Step #0: 0c105c78781a: Verifying Checksum
Step #0: 0c105c78781a: Download complete
Step #0: a3e8923ddc0d: Verifying Checksum
Step #0: a3e8923ddc0d: Download complete
Step #0: 58938f63fe2e: Verifying Checksum
Step #0: 58938f63fe2e: Download complete
Step #0: 0ab4e5fd3974: Verifying Checksum
Step #0: 0ab4e5fd3974: Download complete
Step #0: 28be54f8b3f2: Verifying Checksum
Step #0: 28be54f8b3f2: Download complete
Step #0: b0fc6ef86566: Verifying Checksum
Step #0: b0fc6ef86566: Download complete
Step #0: b549f31133a9: Pull complete
Step #0: 6f68fac3dd20: Verifying Checksum
Step #0: 6f68fac3dd20: Download complete
Step #0: e585942f66e5: Verifying Checksum
Step #0: e585942f66e5: Download complete
Step #0: 496cbc70d26a: Verifying Checksum
Step #0: 496cbc70d26a: Download complete
Step #0: a85759bed276: Verifying Checksum
Step #0: a85759bed276: Download complete
Step #0: 7e783fa1d768: Pull complete
Step #0: dccb20f57e48: Pull complete
Step #0: 2dcd69a82473: Pull complete
Step #0: c9941d5b53dc: Pull complete
Step #0: e89cdda2adb8: Pull complete
Step #0: 544a236cc2df: Pull complete
Step #0: c88e3b2f920d: Pull complete
Step #0: 1af7baa48f90: Pull complete
Step #0: 2e04d1219cdb: Pull complete
Step #0: 999c686a0fbd: Pull complete
Step #0: c3a76b8041f7: Pull complete
Step #0: 0c105c78781a: Pull complete
Step #0: 3a2fba26564e: Pull complete
Step #0: e7aa17ca6459: Pull complete
Step #0: 7556efabcf46: Pull complete
Step #0: 6f68fac3dd20: Pull complete
Step #0: 9403817d52c6: Pull complete
Step #0: a85759bed276: Pull complete
Step #0: 0f41dafea62c: Pull complete
Step #0: 9375569908a4: Pull complete
Step #0: 496cbc70d26a: Pull complete
Step #0: a3e8923ddc0d: Pull complete
Step #0: 58938f63fe2e: Pull complete
Step #0: 28be54f8b3f2: Pull complete
Step #0: 0ab4e5fd3974: Pull complete
Step #0: e585942f66e5: Pull complete
Step #0: b0fc6ef86566: Pull complete
Step #0: Digest: sha256:49e4d603d5f7e1f02355eba362cc873fb0dd3fc76ca000a96ecc100fe72a88db
Step #0: Status: Downloaded newer image for gcr.io/oss-fuzz-base/base-runner:latest
Step #0: gcr.io/oss-fuzz-base/base-runner:latest
Finished Step #0
Starting Step #1
Step #1: Pulling image: gcr.io/cloud-builders/gsutil
Step #1: Using default tag: latest
Step #1: latest: Pulling from cloud-builders/gsutil
Step #1: 97e1ee089ace: Already exists
Step #1: 2e1064aa40b3: Already exists
Step #1: 3072d04458fe: Already exists
Step #1: b3a94ad6a5e4: Already exists
Step #1: c47562f5cdff: Already exists
Step #1: 49452530e4c9: Already exists
Step #1: 01385efcf241: Pulling fs layer
Step #1: d2adbea0f083: Pulling fs layer
Step #1: d2adbea0f083: Verifying Checksum
Step #1: d2adbea0f083: Download complete
Step #1: 01385efcf241: Verifying Checksum
Step #1: 01385efcf241: Download complete
Step #1: 01385efcf241: Pull complete
Step #1: d2adbea0f083: Pull complete
Step #1: Digest: sha256:181af05511b3114d99a177f88c70e3ad9bca1d503776c507e37ee2450cd00f90
Step #1: Status: Downloaded newer image for gcr.io/cloud-builders/gsutil:latest
Step #1: gcr.io/cloud-builders/gsutil:latest
Step #1: CommandException: No URLs matched: gs://oss-fuzz-coverage/snappy/textcov_reports/20260615/*
Step #1: CommandException: 1 file/object could not be transferred.
Finished Step #1
ERROR: step exited with non-zero status: 1
Starting Step #2
Step #2: Already have image (with digest): gcr.io/oss-fuzz-base/base-runner
Step #2: total 0
Finished Step #2
Starting Step #3
Step #3: Already have image (with digest): gcr.io/cloud-builders/git
Step #3: Cloning into 'oss-fuzz'...
Finished Step #3
Starting Step #4 - "build-ca8b31b1-c331-49eb-9130-d4c818c15381"
Step #4 - "build-ca8b31b1-c331-49eb-9130-d4c818c15381": Already have image (with digest): gcr.io/cloud-builders/docker
Step #4 - "build-ca8b31b1-c331-49eb-9130-d4c818c15381": Sending build context to Docker daemon 7.168kB
Step #4 - "build-ca8b31b1-c331-49eb-9130-d4c818c15381": Step 1/6 : FROM gcr.io/oss-fuzz-base/base-builder
Step #4 - "build-ca8b31b1-c331-49eb-9130-d4c818c15381": latest: Pulling from oss-fuzz-base/base-builder
Step #4 - "build-ca8b31b1-c331-49eb-9130-d4c818c15381": b549f31133a9: Already exists
Step #4 - "build-ca8b31b1-c331-49eb-9130-d4c818c15381": 7e783fa1d768: Already exists
Step #4 - "build-ca8b31b1-c331-49eb-9130-d4c818c15381": dccb20f57e48: Already exists
Step #4 - "build-ca8b31b1-c331-49eb-9130-d4c818c15381": 2126ba32b6e6: Pulling fs layer
Step #4 - "build-ca8b31b1-c331-49eb-9130-d4c818c15381": 120136251f1a: Pulling fs layer
Step #4 - "build-ca8b31b1-c331-49eb-9130-d4c818c15381": ca85765f9edf: Pulling fs layer
Step #4 - "build-ca8b31b1-c331-49eb-9130-d4c818c15381": 746946402dbe: Pulling fs layer
Step #4 - "build-ca8b31b1-c331-49eb-9130-d4c818c15381": d8301bcd629d: Pulling fs layer
Step #4 - "build-ca8b31b1-c331-49eb-9130-d4c818c15381": 29a63ae8a81a: Pulling fs layer
Step #4 - "build-ca8b31b1-c331-49eb-9130-d4c818c15381": a3f9a1e139a3: Pulling fs layer
Step #4 - "build-ca8b31b1-c331-49eb-9130-d4c818c15381": d26dfd8e7fa3: Pulling fs layer
Step #4 - "build-ca8b31b1-c331-49eb-9130-d4c818c15381": f85ee0de9626: Pulling fs layer
Step #4 - "build-ca8b31b1-c331-49eb-9130-d4c818c15381": 62a2655c7291: Pulling fs layer
Step #4 - "build-ca8b31b1-c331-49eb-9130-d4c818c15381": e7cfecc7dc4f: Pulling fs layer
Step #4 - "build-ca8b31b1-c331-49eb-9130-d4c818c15381": 6ec6354fd7aa: Pulling fs layer
Step #4 - "build-ca8b31b1-c331-49eb-9130-d4c818c15381": aa64f69e9108: Pulling fs layer
Step #4 - "build-ca8b31b1-c331-49eb-9130-d4c818c15381": 917a0cf7a407: Pulling fs layer
Step #4 - "build-ca8b31b1-c331-49eb-9130-d4c818c15381": f9c35c64a06d: Pulling fs layer
Step #4 - "build-ca8b31b1-c331-49eb-9130-d4c818c15381": d69fcaf21948: Pulling fs layer
Step #4 - "build-ca8b31b1-c331-49eb-9130-d4c818c15381": e4449023a44a: Pulling fs layer
Step #4 - "build-ca8b31b1-c331-49eb-9130-d4c818c15381": c02e8359b610: Pulling fs layer
Step #4 - "build-ca8b31b1-c331-49eb-9130-d4c818c15381": 526fcc714905: Pulling fs layer
Step #4 - "build-ca8b31b1-c331-49eb-9130-d4c818c15381": 1ef6d2816d4e: Pulling fs layer
Step #4 - "build-ca8b31b1-c331-49eb-9130-d4c818c15381": be053e986af0: Pulling fs layer
Step #4 - "build-ca8b31b1-c331-49eb-9130-d4c818c15381": 221b9b483f7d: Pulling fs layer
Step #4 - "build-ca8b31b1-c331-49eb-9130-d4c818c15381": d54661257f2c: Pulling fs layer
Step #4 - "build-ca8b31b1-c331-49eb-9130-d4c818c15381": f45e454718f4: Pulling fs layer
Step #4 - "build-ca8b31b1-c331-49eb-9130-d4c818c15381": 299f4c331622: Pulling fs layer
Step #4 - "build-ca8b31b1-c331-49eb-9130-d4c818c15381": 6b8ae7cbd31c: Pulling fs layer
Step #4 - "build-ca8b31b1-c331-49eb-9130-d4c818c15381": 8e5bf736d257: Pulling fs layer
Step #4 - "build-ca8b31b1-c331-49eb-9130-d4c818c15381": 3b1f7a5b3cba: Pulling fs layer
Step #4 - "build-ca8b31b1-c331-49eb-9130-d4c818c15381": 0024688c5ba0: Pulling fs layer
Step #4 - "build-ca8b31b1-c331-49eb-9130-d4c818c15381": d76632a86b42: Pulling fs layer
Step #4 - "build-ca8b31b1-c331-49eb-9130-d4c818c15381": 74665030181e: Pulling fs layer
Step #4 - "build-ca8b31b1-c331-49eb-9130-d4c818c15381": a740c2fbe373: Pulling fs layer
Step #4 - "build-ca8b31b1-c331-49eb-9130-d4c818c15381": d8fe0e160898: Pulling fs layer
Step #4 - "build-ca8b31b1-c331-49eb-9130-d4c818c15381": e7cfecc7dc4f: Waiting
Step #4 - "build-ca8b31b1-c331-49eb-9130-d4c818c15381": a3f9a1e139a3: Waiting
Step #4 - "build-ca8b31b1-c331-49eb-9130-d4c818c15381": 62a2655c7291: Waiting
Step #4 - "build-ca8b31b1-c331-49eb-9130-d4c818c15381": 6ec6354fd7aa: Waiting
Step #4 - "build-ca8b31b1-c331-49eb-9130-d4c818c15381": 0bd60890109d: Pulling fs layer
Step #4 - "build-ca8b31b1-c331-49eb-9130-d4c818c15381": 0c9face825f5: Pulling fs layer
Step #4 - "build-ca8b31b1-c331-49eb-9130-d4c818c15381": be053e986af0: Waiting
Step #4 - "build-ca8b31b1-c331-49eb-9130-d4c818c15381": f9c35c64a06d: Waiting
Step #4 - "build-ca8b31b1-c331-49eb-9130-d4c818c15381": 221b9b483f7d: Waiting
Step #4 - "build-ca8b31b1-c331-49eb-9130-d4c818c15381": d54661257f2c: Waiting
Step #4 - "build-ca8b31b1-c331-49eb-9130-d4c818c15381": f45e454718f4: Waiting
Step #4 - "build-ca8b31b1-c331-49eb-9130-d4c818c15381": f85ee0de9626: Waiting
Step #4 - "build-ca8b31b1-c331-49eb-9130-d4c818c15381": 299f4c331622: Waiting
Step #4 - "build-ca8b31b1-c331-49eb-9130-d4c818c15381": d69fcaf21948: Waiting
Step #4 - "build-ca8b31b1-c331-49eb-9130-d4c818c15381": d76632a86b42: Waiting
Step #4 - "build-ca8b31b1-c331-49eb-9130-d4c818c15381": 74665030181e: Waiting
Step #4 - "build-ca8b31b1-c331-49eb-9130-d4c818c15381": c02e8359b610: Waiting
Step #4 - "build-ca8b31b1-c331-49eb-9130-d4c818c15381": 1ef6d2816d4e: Waiting
Step #4 - "build-ca8b31b1-c331-49eb-9130-d4c818c15381": 917a0cf7a407: Waiting
Step #4 - "build-ca8b31b1-c331-49eb-9130-d4c818c15381": e4449023a44a: Waiting
Step #4 - "build-ca8b31b1-c331-49eb-9130-d4c818c15381": 6b8ae7cbd31c: Waiting
Step #4 - "build-ca8b31b1-c331-49eb-9130-d4c818c15381": 8e5bf736d257: Waiting
Step #4 - "build-ca8b31b1-c331-49eb-9130-d4c818c15381": d8fe0e160898: Waiting
Step #4 - "build-ca8b31b1-c331-49eb-9130-d4c818c15381": 3b1f7a5b3cba: Waiting
Step #4 - "build-ca8b31b1-c331-49eb-9130-d4c818c15381": d26dfd8e7fa3: Waiting
Step #4 - "build-ca8b31b1-c331-49eb-9130-d4c818c15381": 0bd60890109d: Waiting
Step #4 - "build-ca8b31b1-c331-49eb-9130-d4c818c15381": 0c9face825f5: Waiting
Step #4 - "build-ca8b31b1-c331-49eb-9130-d4c818c15381": 526fcc714905: Waiting
Step #4 - "build-ca8b31b1-c331-49eb-9130-d4c818c15381": d8301bcd629d: Verifying Checksum
Step #4 - "build-ca8b31b1-c331-49eb-9130-d4c818c15381": d8301bcd629d: Download complete
Step #4 - "build-ca8b31b1-c331-49eb-9130-d4c818c15381": 746946402dbe: Download complete
Step #4 - "build-ca8b31b1-c331-49eb-9130-d4c818c15381": 120136251f1a: Verifying Checksum
Step #4 - "build-ca8b31b1-c331-49eb-9130-d4c818c15381": 120136251f1a: Download complete
Step #4 - "build-ca8b31b1-c331-49eb-9130-d4c818c15381": f85ee0de9626: Verifying Checksum
Step #4 - "build-ca8b31b1-c331-49eb-9130-d4c818c15381": f85ee0de9626: Download complete
Step #4 - "build-ca8b31b1-c331-49eb-9130-d4c818c15381": d26dfd8e7fa3: Verifying Checksum
Step #4 - "build-ca8b31b1-c331-49eb-9130-d4c818c15381": d26dfd8e7fa3: Download complete
Step #4 - "build-ca8b31b1-c331-49eb-9130-d4c818c15381": 62a2655c7291: Verifying Checksum
Step #4 - "build-ca8b31b1-c331-49eb-9130-d4c818c15381": 62a2655c7291: Download complete
Step #4 - "build-ca8b31b1-c331-49eb-9130-d4c818c15381": 2126ba32b6e6: Verifying Checksum
Step #4 - "build-ca8b31b1-c331-49eb-9130-d4c818c15381": 2126ba32b6e6: Download complete
Step #4 - "build-ca8b31b1-c331-49eb-9130-d4c818c15381": e7cfecc7dc4f: Verifying Checksum
Step #4 - "build-ca8b31b1-c331-49eb-9130-d4c818c15381": e7cfecc7dc4f: Download complete
Step #4 - "build-ca8b31b1-c331-49eb-9130-d4c818c15381": aa64f69e9108: Download complete
Step #4 - "build-ca8b31b1-c331-49eb-9130-d4c818c15381": 6ec6354fd7aa: Verifying Checksum
Step #4 - "build-ca8b31b1-c331-49eb-9130-d4c818c15381": 6ec6354fd7aa: Download complete
Step #4 - "build-ca8b31b1-c331-49eb-9130-d4c818c15381": a3f9a1e139a3: Verifying Checksum
Step #4 - "build-ca8b31b1-c331-49eb-9130-d4c818c15381": a3f9a1e139a3: Download complete
Step #4 - "build-ca8b31b1-c331-49eb-9130-d4c818c15381": 917a0cf7a407: Verifying Checksum
Step #4 - "build-ca8b31b1-c331-49eb-9130-d4c818c15381": 917a0cf7a407: Download complete
Step #4 - "build-ca8b31b1-c331-49eb-9130-d4c818c15381": d69fcaf21948: Verifying Checksum
Step #4 - "build-ca8b31b1-c331-49eb-9130-d4c818c15381": d69fcaf21948: Download complete
Step #4 - "build-ca8b31b1-c331-49eb-9130-d4c818c15381": f9c35c64a06d: Download complete
Step #4 - "build-ca8b31b1-c331-49eb-9130-d4c818c15381": c02e8359b610: Verifying Checksum
Step #4 - "build-ca8b31b1-c331-49eb-9130-d4c818c15381": c02e8359b610: Download complete
Step #4 - "build-ca8b31b1-c331-49eb-9130-d4c818c15381": 526fcc714905: Verifying Checksum
Step #4 - "build-ca8b31b1-c331-49eb-9130-d4c818c15381": 526fcc714905: Download complete
Step #4 - "build-ca8b31b1-c331-49eb-9130-d4c818c15381": e4449023a44a: Verifying Checksum
Step #4 - "build-ca8b31b1-c331-49eb-9130-d4c818c15381": e4449023a44a: Download complete
Step #4 - "build-ca8b31b1-c331-49eb-9130-d4c818c15381": 1ef6d2816d4e: Verifying Checksum
Step #4 - "build-ca8b31b1-c331-49eb-9130-d4c818c15381": 1ef6d2816d4e: Download complete
Step #4 - "build-ca8b31b1-c331-49eb-9130-d4c818c15381": be053e986af0: Verifying Checksum
Step #4 - "build-ca8b31b1-c331-49eb-9130-d4c818c15381": be053e986af0: Download complete
Step #4 - "build-ca8b31b1-c331-49eb-9130-d4c818c15381": d54661257f2c: Download complete
Step #4 - "build-ca8b31b1-c331-49eb-9130-d4c818c15381": 221b9b483f7d: Verifying Checksum
Step #4 - "build-ca8b31b1-c331-49eb-9130-d4c818c15381": 221b9b483f7d: Download complete
Step #4 - "build-ca8b31b1-c331-49eb-9130-d4c818c15381": 299f4c331622: Verifying Checksum
Step #4 - "build-ca8b31b1-c331-49eb-9130-d4c818c15381": 299f4c331622: Download complete
Step #4 - "build-ca8b31b1-c331-49eb-9130-d4c818c15381": 3b1f7a5b3cba: Verifying Checksum
Step #4 - "build-ca8b31b1-c331-49eb-9130-d4c818c15381": 3b1f7a5b3cba: Download complete
Step #4 - "build-ca8b31b1-c331-49eb-9130-d4c818c15381": 6b8ae7cbd31c: Verifying Checksum
Step #4 - "build-ca8b31b1-c331-49eb-9130-d4c818c15381": 6b8ae7cbd31c: Download complete
Step #4 - "build-ca8b31b1-c331-49eb-9130-d4c818c15381": 8e5bf736d257: Verifying Checksum
Step #4 - "build-ca8b31b1-c331-49eb-9130-d4c818c15381": 8e5bf736d257: Download complete
Step #4 - "build-ca8b31b1-c331-49eb-9130-d4c818c15381": 0024688c5ba0: Verifying Checksum
Step #4 - "build-ca8b31b1-c331-49eb-9130-d4c818c15381": 0024688c5ba0: Download complete
Step #4 - "build-ca8b31b1-c331-49eb-9130-d4c818c15381": d76632a86b42: Verifying Checksum
Step #4 - "build-ca8b31b1-c331-49eb-9130-d4c818c15381": d76632a86b42: Download complete
Step #4 - "build-ca8b31b1-c331-49eb-9130-d4c818c15381": 74665030181e: Download complete
Step #4 - "build-ca8b31b1-c331-49eb-9130-d4c818c15381": d8fe0e160898: Download complete
Step #4 - "build-ca8b31b1-c331-49eb-9130-d4c818c15381": a740c2fbe373: Download complete
Step #4 - "build-ca8b31b1-c331-49eb-9130-d4c818c15381": 2126ba32b6e6: Pull complete
Step #4 - "build-ca8b31b1-c331-49eb-9130-d4c818c15381": 0bd60890109d: Verifying Checksum
Step #4 - "build-ca8b31b1-c331-49eb-9130-d4c818c15381": 0bd60890109d: Download complete
Step #4 - "build-ca8b31b1-c331-49eb-9130-d4c818c15381": 29a63ae8a81a: Verifying Checksum
Step #4 - "build-ca8b31b1-c331-49eb-9130-d4c818c15381": 29a63ae8a81a: Download complete
Step #4 - "build-ca8b31b1-c331-49eb-9130-d4c818c15381": 120136251f1a: Pull complete
Step #4 - "build-ca8b31b1-c331-49eb-9130-d4c818c15381": 0c9face825f5: Verifying Checksum
Step #4 - "build-ca8b31b1-c331-49eb-9130-d4c818c15381": 0c9face825f5: Download complete
Step #4 - "build-ca8b31b1-c331-49eb-9130-d4c818c15381": ca85765f9edf: Verifying Checksum
Step #4 - "build-ca8b31b1-c331-49eb-9130-d4c818c15381": ca85765f9edf: Download complete
Step #4 - "build-ca8b31b1-c331-49eb-9130-d4c818c15381": ca85765f9edf: Pull complete
Step #4 - "build-ca8b31b1-c331-49eb-9130-d4c818c15381": 746946402dbe: Pull complete
Step #4 - "build-ca8b31b1-c331-49eb-9130-d4c818c15381": d8301bcd629d: Pull complete
Step #4 - "build-ca8b31b1-c331-49eb-9130-d4c818c15381": 29a63ae8a81a: Pull complete
Step #4 - "build-ca8b31b1-c331-49eb-9130-d4c818c15381": a3f9a1e139a3: Pull complete
Step #4 - "build-ca8b31b1-c331-49eb-9130-d4c818c15381": d26dfd8e7fa3: Pull complete
Step #4 - "build-ca8b31b1-c331-49eb-9130-d4c818c15381": f85ee0de9626: Pull complete
Step #4 - "build-ca8b31b1-c331-49eb-9130-d4c818c15381": 62a2655c7291: Pull complete
Step #4 - "build-ca8b31b1-c331-49eb-9130-d4c818c15381": e7cfecc7dc4f: Pull complete
Step #4 - "build-ca8b31b1-c331-49eb-9130-d4c818c15381": 6ec6354fd7aa: Pull complete
Step #4 - "build-ca8b31b1-c331-49eb-9130-d4c818c15381": aa64f69e9108: Pull complete
Step #4 - "build-ca8b31b1-c331-49eb-9130-d4c818c15381": 917a0cf7a407: Pull complete
Step #4 - "build-ca8b31b1-c331-49eb-9130-d4c818c15381": f9c35c64a06d: Pull complete
Step #4 - "build-ca8b31b1-c331-49eb-9130-d4c818c15381": d69fcaf21948: Pull complete
Step #4 - "build-ca8b31b1-c331-49eb-9130-d4c818c15381": e4449023a44a: Pull complete
Step #4 - "build-ca8b31b1-c331-49eb-9130-d4c818c15381": c02e8359b610: Pull complete
Step #4 - "build-ca8b31b1-c331-49eb-9130-d4c818c15381": 526fcc714905: Pull complete
Step #4 - "build-ca8b31b1-c331-49eb-9130-d4c818c15381": 1ef6d2816d4e: Pull complete
Step #4 - "build-ca8b31b1-c331-49eb-9130-d4c818c15381": be053e986af0: Pull complete
Step #4 - "build-ca8b31b1-c331-49eb-9130-d4c818c15381": 221b9b483f7d: Pull complete
Step #4 - "build-ca8b31b1-c331-49eb-9130-d4c818c15381": d54661257f2c: Pull complete
Step #4 - "build-ca8b31b1-c331-49eb-9130-d4c818c15381": f45e454718f4: Pull complete
Step #4 - "build-ca8b31b1-c331-49eb-9130-d4c818c15381": 299f4c331622: Pull complete
Step #4 - "build-ca8b31b1-c331-49eb-9130-d4c818c15381": 6b8ae7cbd31c: Pull complete
Step #4 - "build-ca8b31b1-c331-49eb-9130-d4c818c15381": 8e5bf736d257: Pull complete
Step #4 - "build-ca8b31b1-c331-49eb-9130-d4c818c15381": 3b1f7a5b3cba: Pull complete
Step #4 - "build-ca8b31b1-c331-49eb-9130-d4c818c15381": 0024688c5ba0: Pull complete
Step #4 - "build-ca8b31b1-c331-49eb-9130-d4c818c15381": d76632a86b42: Pull complete
Step #4 - "build-ca8b31b1-c331-49eb-9130-d4c818c15381": 74665030181e: Pull complete
Step #4 - "build-ca8b31b1-c331-49eb-9130-d4c818c15381": a740c2fbe373: Pull complete
Step #4 - "build-ca8b31b1-c331-49eb-9130-d4c818c15381": d8fe0e160898: Pull complete
Step #4 - "build-ca8b31b1-c331-49eb-9130-d4c818c15381": 0bd60890109d: Pull complete
Step #4 - "build-ca8b31b1-c331-49eb-9130-d4c818c15381": 0c9face825f5: Pull complete
Step #4 - "build-ca8b31b1-c331-49eb-9130-d4c818c15381": Digest: sha256:a69161327496d5c147fdb102570a7b9baba6d6858757864ddb130051f255771a
Step #4 - "build-ca8b31b1-c331-49eb-9130-d4c818c15381": Status: Downloaded newer image for gcr.io/oss-fuzz-base/base-builder:latest
Step #4 - "build-ca8b31b1-c331-49eb-9130-d4c818c15381": ---> 801c33152a37
Step #4 - "build-ca8b31b1-c331-49eb-9130-d4c818c15381": Step 2/6 : RUN apt-get update && apt-get install -y make autoconf automake libtool gettext pkg-config build-essential
Step #4 - "build-ca8b31b1-c331-49eb-9130-d4c818c15381": ---> Running in 9206d6633939
Step #4 - "build-ca8b31b1-c331-49eb-9130-d4c818c15381": Hit:1 http://archive.ubuntu.com/ubuntu focal InRelease
Step #4 - "build-ca8b31b1-c331-49eb-9130-d4c818c15381": Hit:2 http://security.ubuntu.com/ubuntu focal-security InRelease
Step #4 - "build-ca8b31b1-c331-49eb-9130-d4c818c15381": Hit:3 http://archive.ubuntu.com/ubuntu focal-updates InRelease
Step #4 - "build-ca8b31b1-c331-49eb-9130-d4c818c15381": Hit:4 http://archive.ubuntu.com/ubuntu focal-backports InRelease
Step #4 - "build-ca8b31b1-c331-49eb-9130-d4c818c15381": Reading package lists...
Step #4 - "build-ca8b31b1-c331-49eb-9130-d4c818c15381": Reading package lists...
Step #4 - "build-ca8b31b1-c331-49eb-9130-d4c818c15381": Building dependency tree...
Step #4 - "build-ca8b31b1-c331-49eb-9130-d4c818c15381": Reading state information...
Step #4 - "build-ca8b31b1-c331-49eb-9130-d4c818c15381": make is already the newest version (4.2.1-1.2).
Step #4 - "build-ca8b31b1-c331-49eb-9130-d4c818c15381": make set to manually installed.
Step #4 - "build-ca8b31b1-c331-49eb-9130-d4c818c15381": build-essential is already the newest version (12.8ubuntu1.1).
Step #4 - "build-ca8b31b1-c331-49eb-9130-d4c818c15381": The following additional packages will be installed:
Step #4 - "build-ca8b31b1-c331-49eb-9130-d4c818c15381": file gettext-base libcroco3 libglib2.0-0 libglib2.0-data libicu66
Step #4 - "build-ca8b31b1-c331-49eb-9130-d4c818c15381": libltdl-dev libltdl7 libmagic-mgc libmagic1 libxml2 shared-mime-info
Step #4 - "build-ca8b31b1-c331-49eb-9130-d4c818c15381": xdg-user-dirs
Step #4 - "build-ca8b31b1-c331-49eb-9130-d4c818c15381": Suggested packages:
Step #4 - "build-ca8b31b1-c331-49eb-9130-d4c818c15381": autoconf-archive gnu-standards autoconf-doc gettext-doc autopoint
Step #4 - "build-ca8b31b1-c331-49eb-9130-d4c818c15381": libasprintf-dev libgettextpo-dev libtool-doc gfortran | fortran95-compiler
Step #4 - "build-ca8b31b1-c331-49eb-9130-d4c818c15381": gcj-jdk
Step #4 - "build-ca8b31b1-c331-49eb-9130-d4c818c15381": The following NEW packages will be installed:
Step #4 - "build-ca8b31b1-c331-49eb-9130-d4c818c15381": autoconf automake file gettext gettext-base libcroco3 libglib2.0-0
Step #4 - "build-ca8b31b1-c331-49eb-9130-d4c818c15381": libglib2.0-data libicu66 libltdl-dev libltdl7 libmagic-mgc libmagic1 libtool
Step #4 - "build-ca8b31b1-c331-49eb-9130-d4c818c15381": libxml2 pkg-config shared-mime-info xdg-user-dirs
Step #4 - "build-ca8b31b1-c331-49eb-9130-d4c818c15381": 0 upgraded, 18 newly installed, 0 to remove and 0 not upgraded.
Step #4 - "build-ca8b31b1-c331-49eb-9130-d4c818c15381": Need to get 13.5 MB of archives.
Step #4 - "build-ca8b31b1-c331-49eb-9130-d4c818c15381": After this operation, 60.0 MB of additional disk space will be used.
Step #4 - "build-ca8b31b1-c331-49eb-9130-d4c818c15381": Get:1 http://archive.ubuntu.com/ubuntu focal/main amd64 libmagic-mgc amd64 1:5.38-4 [218 kB]
Step #4 - "build-ca8b31b1-c331-49eb-9130-d4c818c15381": Get:2 http://archive.ubuntu.com/ubuntu focal/main amd64 libmagic1 amd64 1:5.38-4 [75.9 kB]
Step #4 - "build-ca8b31b1-c331-49eb-9130-d4c818c15381": Get:3 http://archive.ubuntu.com/ubuntu focal/main amd64 file amd64 1:5.38-4 [23.3 kB]
Step #4 - "build-ca8b31b1-c331-49eb-9130-d4c818c15381": Get:4 http://archive.ubuntu.com/ubuntu focal-updates/main amd64 libglib2.0-0 amd64 2.64.6-1~ubuntu20.04.9 [1290 kB]
Step #4 - "build-ca8b31b1-c331-49eb-9130-d4c818c15381": Get:5 http://archive.ubuntu.com/ubuntu focal-updates/main amd64 libglib2.0-data all 2.64.6-1~ubuntu20.04.9 [5836 B]
Step #4 - "build-ca8b31b1-c331-49eb-9130-d4c818c15381": Get:6 http://archive.ubuntu.com/ubuntu focal-updates/main amd64 libicu66 amd64 66.1-2ubuntu2.1 [8515 kB]
Step #4 - "build-ca8b31b1-c331-49eb-9130-d4c818c15381": Get:7 http://archive.ubuntu.com/ubuntu focal-updates/main amd64 libxml2 amd64 2.9.10+dfsg-5ubuntu0.20.04.10 [640 kB]
Step #4 - "build-ca8b31b1-c331-49eb-9130-d4c818c15381": Get:8 http://archive.ubuntu.com/ubuntu focal/main amd64 shared-mime-info amd64 1.15-1 [430 kB]
Step #4 - "build-ca8b31b1-c331-49eb-9130-d4c818c15381": Get:9 http://archive.ubuntu.com/ubuntu focal/main amd64 xdg-user-dirs amd64 0.17-2ubuntu1 [48.3 kB]
Step #4 - "build-ca8b31b1-c331-49eb-9130-d4c818c15381": Get:10 http://archive.ubuntu.com/ubuntu focal/main amd64 gettext-base amd64 0.19.8.1-10build1 [50.2 kB]
Step #4 - "build-ca8b31b1-c331-49eb-9130-d4c818c15381": Get:11 http://archive.ubuntu.com/ubuntu focal/main amd64 autoconf all 2.69-11.1 [321 kB]
Step #4 - "build-ca8b31b1-c331-49eb-9130-d4c818c15381": Get:12 http://archive.ubuntu.com/ubuntu focal/main amd64 automake all 1:1.16.1-4ubuntu6 [522 kB]
Step #4 - "build-ca8b31b1-c331-49eb-9130-d4c818c15381": Get:13 http://archive.ubuntu.com/ubuntu focal-updates/main amd64 libcroco3 amd64 0.6.13-1ubuntu0.1 [82.4 kB]
Step #4 - "build-ca8b31b1-c331-49eb-9130-d4c818c15381": Get:14 http://archive.ubuntu.com/ubuntu focal/main amd64 gettext amd64 0.19.8.1-10build1 [895 kB]
Step #4 - "build-ca8b31b1-c331-49eb-9130-d4c818c15381": Get:15 http://archive.ubuntu.com/ubuntu focal/main amd64 libltdl7 amd64 2.4.6-14 [38.5 kB]
Step #4 - "build-ca8b31b1-c331-49eb-9130-d4c818c15381": Get:16 http://archive.ubuntu.com/ubuntu focal/main amd64 libltdl-dev amd64 2.4.6-14 [162 kB]
Step #4 - "build-ca8b31b1-c331-49eb-9130-d4c818c15381": Get:17 http://archive.ubuntu.com/ubuntu focal/main amd64 libtool all 2.4.6-14 [161 kB]
Step #4 - "build-ca8b31b1-c331-49eb-9130-d4c818c15381": Get:18 http://archive.ubuntu.com/ubuntu focal/main amd64 pkg-config amd64 0.29.1-0ubuntu4 [45.5 kB]
Step #4 - "build-ca8b31b1-c331-49eb-9130-d4c818c15381": [91mdebconf: delaying package configuration, since apt-utils is not installed
Step #4 - "build-ca8b31b1-c331-49eb-9130-d4c818c15381": [0mFetched 13.5 MB in 0s (33.0 MB/s)
Step #4 - "build-ca8b31b1-c331-49eb-9130-d4c818c15381": Selecting previously unselected package libmagic-mgc.
Step #4 - "build-ca8b31b1-c331-49eb-9130-d4c818c15381": (Reading database ...
(Reading database ... 5%
(Reading database ... 10%
(Reading database ... 15%
(Reading database ... 20%
(Reading database ... 25%
(Reading database ... 30%
(Reading database ... 35%
(Reading database ... 40%
(Reading database ... 45%
(Reading database ... 50%
(Reading database ... 55%
(Reading database ... 60%
(Reading database ... 65%
(Reading database ... 70%
(Reading database ... 75%
(Reading database ... 80%
(Reading database ... 85%
(Reading database ... 90%
(Reading database ... 95%
(Reading database ... 100%
(Reading database ... 17483 files and directories currently installed.)
Step #4 - "build-ca8b31b1-c331-49eb-9130-d4c818c15381": Preparing to unpack .../00-libmagic-mgc_1%3a5.38-4_amd64.deb ...
Step #4 - "build-ca8b31b1-c331-49eb-9130-d4c818c15381": Unpacking libmagic-mgc (1:5.38-4) ...
Step #4 - "build-ca8b31b1-c331-49eb-9130-d4c818c15381": Selecting previously unselected package libmagic1:amd64.
Step #4 - "build-ca8b31b1-c331-49eb-9130-d4c818c15381": Preparing to unpack .../01-libmagic1_1%3a5.38-4_amd64.deb ...
Step #4 - "build-ca8b31b1-c331-49eb-9130-d4c818c15381": Unpacking libmagic1:amd64 (1:5.38-4) ...
Step #4 - "build-ca8b31b1-c331-49eb-9130-d4c818c15381": Selecting previously unselected package file.
Step #4 - "build-ca8b31b1-c331-49eb-9130-d4c818c15381": Preparing to unpack .../02-file_1%3a5.38-4_amd64.deb ...
Step #4 - "build-ca8b31b1-c331-49eb-9130-d4c818c15381": Unpacking file (1:5.38-4) ...
Step #4 - "build-ca8b31b1-c331-49eb-9130-d4c818c15381": Selecting previously unselected package libglib2.0-0:amd64.
Step #4 - "build-ca8b31b1-c331-49eb-9130-d4c818c15381": Preparing to unpack .../03-libglib2.0-0_2.64.6-1~ubuntu20.04.9_amd64.deb ...
Step #4 - "build-ca8b31b1-c331-49eb-9130-d4c818c15381": Unpacking libglib2.0-0:amd64 (2.64.6-1~ubuntu20.04.9) ...
Step #4 - "build-ca8b31b1-c331-49eb-9130-d4c818c15381": Selecting previously unselected package libglib2.0-data.
Step #4 - "build-ca8b31b1-c331-49eb-9130-d4c818c15381": Preparing to unpack .../04-libglib2.0-data_2.64.6-1~ubuntu20.04.9_all.deb ...
Step #4 - "build-ca8b31b1-c331-49eb-9130-d4c818c15381": Unpacking libglib2.0-data (2.64.6-1~ubuntu20.04.9) ...
Step #4 - "build-ca8b31b1-c331-49eb-9130-d4c818c15381": Selecting previously unselected package libicu66:amd64.
Step #4 - "build-ca8b31b1-c331-49eb-9130-d4c818c15381": Preparing to unpack .../05-libicu66_66.1-2ubuntu2.1_amd64.deb ...
Step #4 - "build-ca8b31b1-c331-49eb-9130-d4c818c15381": Unpacking libicu66:amd64 (66.1-2ubuntu2.1) ...
Step #4 - "build-ca8b31b1-c331-49eb-9130-d4c818c15381": Selecting previously unselected package libxml2:amd64.
Step #4 - "build-ca8b31b1-c331-49eb-9130-d4c818c15381": Preparing to unpack .../06-libxml2_2.9.10+dfsg-5ubuntu0.20.04.10_amd64.deb ...
Step #4 - "build-ca8b31b1-c331-49eb-9130-d4c818c15381": Unpacking libxml2:amd64 (2.9.10+dfsg-5ubuntu0.20.04.10) ...
Step #4 - "build-ca8b31b1-c331-49eb-9130-d4c818c15381": Selecting previously unselected package shared-mime-info.
Step #4 - "build-ca8b31b1-c331-49eb-9130-d4c818c15381": Preparing to unpack .../07-shared-mime-info_1.15-1_amd64.deb ...
Step #4 - "build-ca8b31b1-c331-49eb-9130-d4c818c15381": Unpacking shared-mime-info (1.15-1) ...
Step #4 - "build-ca8b31b1-c331-49eb-9130-d4c818c15381": Selecting previously unselected package xdg-user-dirs.
Step #4 - "build-ca8b31b1-c331-49eb-9130-d4c818c15381": Preparing to unpack .../08-xdg-user-dirs_0.17-2ubuntu1_amd64.deb ...
Step #4 - "build-ca8b31b1-c331-49eb-9130-d4c818c15381": Unpacking xdg-user-dirs (0.17-2ubuntu1) ...
Step #4 - "build-ca8b31b1-c331-49eb-9130-d4c818c15381": Selecting previously unselected package gettext-base.
Step #4 - "build-ca8b31b1-c331-49eb-9130-d4c818c15381": Preparing to unpack .../09-gettext-base_0.19.8.1-10build1_amd64.deb ...
Step #4 - "build-ca8b31b1-c331-49eb-9130-d4c818c15381": Unpacking gettext-base (0.19.8.1-10build1) ...
Step #4 - "build-ca8b31b1-c331-49eb-9130-d4c818c15381": Selecting previously unselected package autoconf.
Step #4 - "build-ca8b31b1-c331-49eb-9130-d4c818c15381": Preparing to unpack .../10-autoconf_2.69-11.1_all.deb ...
Step #4 - "build-ca8b31b1-c331-49eb-9130-d4c818c15381": Unpacking autoconf (2.69-11.1) ...
Step #4 - "build-ca8b31b1-c331-49eb-9130-d4c818c15381": Selecting previously unselected package automake.
Step #4 - "build-ca8b31b1-c331-49eb-9130-d4c818c15381": Preparing to unpack .../11-automake_1%3a1.16.1-4ubuntu6_all.deb ...
Step #4 - "build-ca8b31b1-c331-49eb-9130-d4c818c15381": Unpacking automake (1:1.16.1-4ubuntu6) ...
Step #4 - "build-ca8b31b1-c331-49eb-9130-d4c818c15381": Selecting previously unselected package libcroco3:amd64.
Step #4 - "build-ca8b31b1-c331-49eb-9130-d4c818c15381": Preparing to unpack .../12-libcroco3_0.6.13-1ubuntu0.1_amd64.deb ...
Step #4 - "build-ca8b31b1-c331-49eb-9130-d4c818c15381": Unpacking libcroco3:amd64 (0.6.13-1ubuntu0.1) ...
Step #4 - "build-ca8b31b1-c331-49eb-9130-d4c818c15381": Selecting previously unselected package gettext.
Step #4 - "build-ca8b31b1-c331-49eb-9130-d4c818c15381": Preparing to unpack .../13-gettext_0.19.8.1-10build1_amd64.deb ...
Step #4 - "build-ca8b31b1-c331-49eb-9130-d4c818c15381": Unpacking gettext (0.19.8.1-10build1) ...
Step #4 - "build-ca8b31b1-c331-49eb-9130-d4c818c15381": Selecting previously unselected package libltdl7:amd64.
Step #4 - "build-ca8b31b1-c331-49eb-9130-d4c818c15381": Preparing to unpack .../14-libltdl7_2.4.6-14_amd64.deb ...
Step #4 - "build-ca8b31b1-c331-49eb-9130-d4c818c15381": Unpacking libltdl7:amd64 (2.4.6-14) ...
Step #4 - "build-ca8b31b1-c331-49eb-9130-d4c818c15381": Selecting previously unselected package libltdl-dev:amd64.
Step #4 - "build-ca8b31b1-c331-49eb-9130-d4c818c15381": Preparing to unpack .../15-libltdl-dev_2.4.6-14_amd64.deb ...
Step #4 - "build-ca8b31b1-c331-49eb-9130-d4c818c15381": Unpacking libltdl-dev:amd64 (2.4.6-14) ...
Step #4 - "build-ca8b31b1-c331-49eb-9130-d4c818c15381": Selecting previously unselected package libtool.
Step #4 - "build-ca8b31b1-c331-49eb-9130-d4c818c15381": Preparing to unpack .../16-libtool_2.4.6-14_all.deb ...
Step #4 - "build-ca8b31b1-c331-49eb-9130-d4c818c15381": Unpacking libtool (2.4.6-14) ...
Step #4 - "build-ca8b31b1-c331-49eb-9130-d4c818c15381": Selecting previously unselected package pkg-config.
Step #4 - "build-ca8b31b1-c331-49eb-9130-d4c818c15381": Preparing to unpack .../17-pkg-config_0.29.1-0ubuntu4_amd64.deb ...
Step #4 - "build-ca8b31b1-c331-49eb-9130-d4c818c15381": Unpacking pkg-config (0.29.1-0ubuntu4) ...
Step #4 - "build-ca8b31b1-c331-49eb-9130-d4c818c15381": Setting up xdg-user-dirs (0.17-2ubuntu1) ...
Step #4 - "build-ca8b31b1-c331-49eb-9130-d4c818c15381": Setting up libmagic-mgc (1:5.38-4) ...
Step #4 - "build-ca8b31b1-c331-49eb-9130-d4c818c15381": Setting up libglib2.0-0:amd64 (2.64.6-1~ubuntu20.04.9) ...
Step #4 - "build-ca8b31b1-c331-49eb-9130-d4c818c15381": No schema files found: doing nothing.
Step #4 - "build-ca8b31b1-c331-49eb-9130-d4c818c15381": Setting up libicu66:amd64 (66.1-2ubuntu2.1) ...
Step #4 - "build-ca8b31b1-c331-49eb-9130-d4c818c15381": Setting up libmagic1:amd64 (1:5.38-4) ...
Step #4 - "build-ca8b31b1-c331-49eb-9130-d4c818c15381": Setting up gettext-base (0.19.8.1-10build1) ...
Step #4 - "build-ca8b31b1-c331-49eb-9130-d4c818c15381": Setting up file (1:5.38-4) ...
Step #4 - "build-ca8b31b1-c331-49eb-9130-d4c818c15381": Setting up libglib2.0-data (2.64.6-1~ubuntu20.04.9) ...
Step #4 - "build-ca8b31b1-c331-49eb-9130-d4c818c15381": Setting up pkg-config (0.29.1-0ubuntu4) ...
Step #4 - "build-ca8b31b1-c331-49eb-9130-d4c818c15381": Setting up libltdl7:amd64 (2.4.6-14) ...
Step #4 - "build-ca8b31b1-c331-49eb-9130-d4c818c15381": Setting up autoconf (2.69-11.1) ...
Step #4 - "build-ca8b31b1-c331-49eb-9130-d4c818c15381": Setting up libxml2:amd64 (2.9.10+dfsg-5ubuntu0.20.04.10) ...
Step #4 - "build-ca8b31b1-c331-49eb-9130-d4c818c15381": Setting up automake (1:1.16.1-4ubuntu6) ...
Step #4 - "build-ca8b31b1-c331-49eb-9130-d4c818c15381": update-alternatives: using /usr/bin/automake-1.16 to provide /usr/bin/automake (automake) in auto mode
Step #4 - "build-ca8b31b1-c331-49eb-9130-d4c818c15381": update-alternatives: warning: skip creation of /usr/share/man/man1/automake.1.gz because associated file /usr/share/man/man1/automake-1.16.1.gz (of link group automake) doesn't exist
Step #4 - "build-ca8b31b1-c331-49eb-9130-d4c818c15381": update-alternatives: warning: skip creation of /usr/share/man/man1/aclocal.1.gz because associated file /usr/share/man/man1/aclocal-1.16.1.gz (of link group automake) doesn't exist
Step #4 - "build-ca8b31b1-c331-49eb-9130-d4c818c15381": Setting up libtool (2.4.6-14) ...
Step #4 - "build-ca8b31b1-c331-49eb-9130-d4c818c15381": Setting up libltdl-dev:amd64 (2.4.6-14) ...
Step #4 - "build-ca8b31b1-c331-49eb-9130-d4c818c15381": Setting up shared-mime-info (1.15-1) ...
Step #4 - "build-ca8b31b1-c331-49eb-9130-d4c818c15381": Setting up libcroco3:amd64 (0.6.13-1ubuntu0.1) ...
Step #4 - "build-ca8b31b1-c331-49eb-9130-d4c818c15381": Setting up gettext (0.19.8.1-10build1) ...
Step #4 - "build-ca8b31b1-c331-49eb-9130-d4c818c15381": Processing triggers for libc-bin (2.31-0ubuntu9.18) ...
Step #4 - "build-ca8b31b1-c331-49eb-9130-d4c818c15381": Removing intermediate container 9206d6633939
Step #4 - "build-ca8b31b1-c331-49eb-9130-d4c818c15381": ---> b4be7fa0b2e3
Step #4 - "build-ca8b31b1-c331-49eb-9130-d4c818c15381": Step 3/6 : RUN git clone --recurse-submodules https://github.com/google/snappy
Step #4 - "build-ca8b31b1-c331-49eb-9130-d4c818c15381": ---> Running in fb097d82c0b7
Step #4 - "build-ca8b31b1-c331-49eb-9130-d4c818c15381": [91mCloning into 'snappy'...
Step #4 - "build-ca8b31b1-c331-49eb-9130-d4c818c15381": [0m[91mSubmodule 'third_party/benchmark' (https://github.com/google/benchmark.git) registered for path 'third_party/benchmark'
Step #4 - "build-ca8b31b1-c331-49eb-9130-d4c818c15381": [0m[91mSubmodule 'third_party/googletest' (https://github.com/google/googletest.git) registered for path 'third_party/googletest'
Step #4 - "build-ca8b31b1-c331-49eb-9130-d4c818c15381": [0m[91mCloning into '/src/snappy/third_party/benchmark'...
Step #4 - "build-ca8b31b1-c331-49eb-9130-d4c818c15381": [0m[91mCloning into '/src/snappy/third_party/googletest'...
Step #4 - "build-ca8b31b1-c331-49eb-9130-d4c818c15381": [0mSubmodule path 'third_party/benchmark': checked out 'b20cea674170b2ba45da0dfaf03953cdea473d0d'
Step #4 - "build-ca8b31b1-c331-49eb-9130-d4c818c15381": Submodule path 'third_party/googletest': checked out 'b796f7d44681514f58a683a3a71ff17c94edb0c1'
Step #4 - "build-ca8b31b1-c331-49eb-9130-d4c818c15381": Removing intermediate container fb097d82c0b7
Step #4 - "build-ca8b31b1-c331-49eb-9130-d4c818c15381": ---> 8cc9e0405773
Step #4 - "build-ca8b31b1-c331-49eb-9130-d4c818c15381": Step 4/6 : RUN rm -rf $SRC/snappy/third_party/googletest && git clone --depth 1 https://github.com/google/googletest $SRC/snappy/third_party/googletest
Step #4 - "build-ca8b31b1-c331-49eb-9130-d4c818c15381": ---> Running in 754d7a1912d4
Step #4 - "build-ca8b31b1-c331-49eb-9130-d4c818c15381": [91mCloning into '/src/snappy/third_party/googletest'...
Step #4 - "build-ca8b31b1-c331-49eb-9130-d4c818c15381": [0mRemoving intermediate container 754d7a1912d4
Step #4 - "build-ca8b31b1-c331-49eb-9130-d4c818c15381": ---> 7bfe9a7459e1
Step #4 - "build-ca8b31b1-c331-49eb-9130-d4c818c15381": Step 5/6 : WORKDIR $SRC/
Step #4 - "build-ca8b31b1-c331-49eb-9130-d4c818c15381": ---> Running in 4e3550f32195
Step #4 - "build-ca8b31b1-c331-49eb-9130-d4c818c15381": Removing intermediate container 4e3550f32195
Step #4 - "build-ca8b31b1-c331-49eb-9130-d4c818c15381": ---> f446a0563876
Step #4 - "build-ca8b31b1-c331-49eb-9130-d4c818c15381": Step 6/6 : COPY run_tests.sh build.sh $SRC/
Step #4 - "build-ca8b31b1-c331-49eb-9130-d4c818c15381": ---> 2f08f99c3b1e
Step #4 - "build-ca8b31b1-c331-49eb-9130-d4c818c15381": Successfully built 2f08f99c3b1e
Step #4 - "build-ca8b31b1-c331-49eb-9130-d4c818c15381": Successfully tagged gcr.io/oss-fuzz/snappy:latest
Step #4 - "build-ca8b31b1-c331-49eb-9130-d4c818c15381": Successfully tagged us-central1-docker.pkg.dev/oss-fuzz/unsafe/snappy:latest
Finished Step #4 - "build-ca8b31b1-c331-49eb-9130-d4c818c15381"
Starting Step #5 - "srcmap"
Step #5 - "srcmap": Already have image: gcr.io/oss-fuzz/snappy
Step #5 - "srcmap": ++ tempfile
Step #5 - "srcmap": + SRCMAP=/tmp/fileyqAd3M
Step #5 - "srcmap": + echo '{}'
Step #5 - "srcmap": + PATHS_TO_SCAN=/src
Step #5 - "srcmap": + [[ c++ == \g\o ]]
Step #5 - "srcmap": ++ find /src -name .git -type d
Step #5 - "srcmap": + for DOT_GIT_DIR in $(find $PATHS_TO_SCAN -name ".git" -type d)
Step #5 - "srcmap": ++ dirname /src/snappy/.git
Step #5 - "srcmap": + GIT_DIR=/src/snappy
Step #5 - "srcmap": + cd /src/snappy
Step #5 - "srcmap": ++ git config --get remote.origin.url
Step #5 - "srcmap": + GIT_URL=https://github.com/google/snappy
Step #5 - "srcmap": ++ git rev-parse HEAD
Step #5 - "srcmap": + GIT_REV=27ab5f7f518430a021239bc26a5b2fd64affbc7b
Step #5 - "srcmap": + jq_inplace /tmp/fileyqAd3M '."/src/snappy" = { type: "git", url: "https://github.com/google/snappy", rev: "27ab5f7f518430a021239bc26a5b2fd64affbc7b" }'
Step #5 - "srcmap": ++ tempfile
Step #5 - "srcmap": + F=/tmp/file6NM2Kd
Step #5 - "srcmap": + cat /tmp/fileyqAd3M
Step #5 - "srcmap": + jq '."/src/snappy" = { type: "git", url: "https://github.com/google/snappy", rev: "27ab5f7f518430a021239bc26a5b2fd64affbc7b" }'
Step #5 - "srcmap": + mv /tmp/file6NM2Kd /tmp/fileyqAd3M
Step #5 - "srcmap": + for DOT_GIT_DIR in $(find $PATHS_TO_SCAN -name ".git" -type d)
Step #5 - "srcmap": ++ dirname /src/snappy/third_party/googletest/.git
Step #5 - "srcmap": + GIT_DIR=/src/snappy/third_party/googletest
Step #5 - "srcmap": + cd /src/snappy/third_party/googletest
Step #5 - "srcmap": ++ git config --get remote.origin.url
Step #5 - "srcmap": + GIT_URL=https://github.com/google/googletest
Step #5 - "srcmap": ++ git rev-parse HEAD
Step #5 - "srcmap": + GIT_REV=7140cd416cecd7462a8aae488024abeee55598e4
Step #5 - "srcmap": + jq_inplace /tmp/fileyqAd3M '."/src/snappy/third_party/googletest" = { type: "git", url: "https://github.com/google/googletest", rev: "7140cd416cecd7462a8aae488024abeee55598e4" }'
Step #5 - "srcmap": ++ tempfile
Step #5 - "srcmap": + F=/tmp/fileMYoIvJ
Step #5 - "srcmap": + cat /tmp/fileyqAd3M
Step #5 - "srcmap": + jq '."/src/snappy/third_party/googletest" = { type: "git", url: "https://github.com/google/googletest", rev: "7140cd416cecd7462a8aae488024abeee55598e4" }'
Step #5 - "srcmap": + mv /tmp/fileMYoIvJ /tmp/fileyqAd3M
Step #5 - "srcmap": ++ find /src -name .svn -type d
Step #5 - "srcmap": ++ find /src -name .hg -type d
Step #5 - "srcmap": + '[' '' '!=' '' ']'
Step #5 - "srcmap": + cat /tmp/fileyqAd3M
Step #5 - "srcmap": + rm /tmp/fileyqAd3M
Step #5 - "srcmap": {
Step #5 - "srcmap": "/src/snappy": {
Step #5 - "srcmap": "type": "git",
Step #5 - "srcmap": "url": "https://github.com/google/snappy",
Step #5 - "srcmap": "rev": "27ab5f7f518430a021239bc26a5b2fd64affbc7b"
Step #5 - "srcmap": },
Step #5 - "srcmap": "/src/snappy/third_party/googletest": {
Step #5 - "srcmap": "type": "git",
Step #5 - "srcmap": "url": "https://github.com/google/googletest",
Step #5 - "srcmap": "rev": "7140cd416cecd7462a8aae488024abeee55598e4"
Step #5 - "srcmap": }
Step #5 - "srcmap": }
Finished Step #5 - "srcmap"
Starting Step #6 - "compile-libfuzzer-introspector-x86_64"
Step #6 - "compile-libfuzzer-introspector-x86_64": Already have image (with digest): gcr.io/cloud-builders/docker
Step #6 - "compile-libfuzzer-introspector-x86_64": ---------------------------------------------------------------
Step #6 - "compile-libfuzzer-introspector-x86_64": vm.mmap_rnd_bits = 28
Step #6 - "compile-libfuzzer-introspector-x86_64": Compiling libFuzzer to /usr/lib/libFuzzingEngine.a... done.
Step #6 - "compile-libfuzzer-introspector-x86_64":
Reading package lists... 0%
Reading package lists... 0%
Reading package lists... 0%
Reading package lists... 2%
Reading package lists... 2%
Reading package lists... 4%
Reading package lists... 4%
Reading package lists... 4%
Reading package lists... 4%
Reading package lists... 4%
Reading package lists... 4%
Reading package lists... 28%
Reading package lists... 28%
Reading package lists... 31%
Reading package lists... 41%
Reading package lists... 41%
Reading package lists... 41%
Reading package lists... 41%
Reading package lists... 42%
Reading package lists... 42%
Reading package lists... 52%
Reading package lists... 52%
Reading package lists... 55%
Reading package lists... 55%
Reading package lists... 66%
Reading package lists... 66%
Reading package lists... 66%
Reading package lists... 66%
Reading package lists... 69%
Reading package lists... 69%
Reading package lists... 72%
Reading package lists... 72%
Reading package lists... 72%
Reading package lists... 72%
Reading package lists... 72%
Reading package lists... 72%
Reading package lists... 72%
Reading package lists... 72%
Reading package lists... 72%
Reading package lists... 72%
Reading package lists... 72%
Reading package lists... 72%
Reading package lists... 72%
Reading package lists... 72%
Reading package lists... 72%
Reading package lists... 82%
Reading package lists... 82%
Reading package lists... 84%
Reading package lists... 84%
Reading package lists... 94%
Reading package lists... 94%
Reading package lists... 94%
Reading package lists... 94%
Reading package lists... 97%
Reading package lists... 97%
Reading package lists... 99%
Reading package lists... 99%
Reading package lists... 99%
Reading package lists... 99%
Reading package lists... 99%
Reading package lists... 99%
Reading package lists... Done
Step #6 - "compile-libfuzzer-introspector-x86_64":
Building dependency tree... 0%
Building dependency tree... 0%
Building dependency tree... 50%
Building dependency tree... 50%
Building dependency tree
Step #6 - "compile-libfuzzer-introspector-x86_64":
Reading state information... 0%
Reading state information... 0%
Reading state information... Done
Step #6 - "compile-libfuzzer-introspector-x86_64": The following additional packages will be installed:
Step #6 - "compile-libfuzzer-introspector-x86_64": libjpeg-turbo8 libjpeg-turbo8-dev libjpeg8 libjpeg8-dev libyaml-0-2
Step #6 - "compile-libfuzzer-introspector-x86_64": Suggested packages:
Step #6 - "compile-libfuzzer-introspector-x86_64": libyaml-doc
Step #6 - "compile-libfuzzer-introspector-x86_64": The following NEW packages will be installed:
Step #6 - "compile-libfuzzer-introspector-x86_64": libjpeg-dev libjpeg-turbo8 libjpeg-turbo8-dev libjpeg8 libjpeg8-dev
Step #6 - "compile-libfuzzer-introspector-x86_64": libyaml-0-2 libyaml-dev zlib1g-dev
Step #6 - "compile-libfuzzer-introspector-x86_64": 0 upgraded, 8 newly installed, 0 to remove and 0 not upgraded.
Step #6 - "compile-libfuzzer-introspector-x86_64": Need to get 624 kB of archives.
Step #6 - "compile-libfuzzer-introspector-x86_64": After this operation, 2657 kB of additional disk space will be used.
Step #6 - "compile-libfuzzer-introspector-x86_64":
0% [Working]
Get:1 http://archive.ubuntu.com/ubuntu focal/main amd64 libyaml-0-2 amd64 0.2.2-1 [48.9 kB]
Step #6 - "compile-libfuzzer-introspector-x86_64":
3% [1 libyaml-0-2 25.6 kB/48.9 kB 52%]
9% [Working]
Get:2 http://archive.ubuntu.com/ubuntu focal-updates/main amd64 libjpeg-turbo8 amd64 2.0.3-0ubuntu1.20.04.3 [118 kB]
Step #6 - "compile-libfuzzer-introspector-x86_64":
11% [2 libjpeg-turbo8 15.2 kB/118 kB 13%]
26% [Waiting for headers]
Get:3 http://archive.ubuntu.com/ubuntu focal-updates/main amd64 libjpeg-turbo8-dev amd64 2.0.3-0ubuntu1.20.04.3 [238 kB]
Step #6 - "compile-libfuzzer-introspector-x86_64":
27% [3 libjpeg-turbo8-dev 5688 B/238 kB 2%]
59% [Waiting for headers]
Get:4 http://archive.ubuntu.com/ubuntu focal/main amd64 libjpeg8 amd64 8c-2ubuntu8 [2194 B]
Step #6 - "compile-libfuzzer-introspector-x86_64":
60% [4 libjpeg8 2194 B/2194 B 100%]
62% [Waiting for headers]
Get:5 http://archive.ubuntu.com/ubuntu focal/main amd64 libjpeg8-dev amd64 8c-2ubuntu8 [1552 B]
Step #6 - "compile-libfuzzer-introspector-x86_64":
62% [5 libjpeg8-dev 1552 B/1552 B 100%]
65% [Working]
Get:6 http://archive.ubuntu.com/ubuntu focal/main amd64 libjpeg-dev amd64 8c-2ubuntu8 [1546 B]
Step #6 - "compile-libfuzzer-introspector-x86_64":
65% [6 libjpeg-dev 1546 B/1546 B 100%]
68% [Working]
Get:7 http://archive.ubuntu.com/ubuntu focal-updates/main amd64 zlib1g-dev amd64 1:1.2.11.dfsg-2ubuntu1.5 [155 kB]
Step #6 - "compile-libfuzzer-introspector-x86_64":
73% [7 zlib1g-dev 43.2 kB/155 kB 28%]
90% [Waiting for headers]
Get:8 http://archive.ubuntu.com/ubuntu focal/main amd64 libyaml-dev amd64 0.2.2-1 [58.2 kB]
Step #6 - "compile-libfuzzer-introspector-x86_64":
92% [8 libyaml-dev 18.1 kB/58.2 kB 31%]
100% [Working]
Fetched 624 kB in 0s (5367 kB/s)
Step #6 - "compile-libfuzzer-introspector-x86_64": debconf: delaying package configuration, since apt-utils is not installed
Step #6 - "compile-libfuzzer-introspector-x86_64": Selecting previously unselected package libyaml-0-2:amd64.
Step #6 - "compile-libfuzzer-introspector-x86_64": (Reading database ...
(Reading database ... 5%
(Reading database ... 10%
(Reading database ... 15%
(Reading database ... 20%
(Reading database ... 25%
(Reading database ... 30%
(Reading database ... 35%
(Reading database ... 40%
(Reading database ... 45%
(Reading database ... 50%
(Reading database ... 55%
(Reading database ... 60%
(Reading database ... 65%
(Reading database ... 70%
(Reading database ... 75%
(Reading database ... 80%
(Reading database ... 85%
(Reading database ... 90%
(Reading database ... 95%
(Reading database ... 100%
(Reading database ... 18398 files and directories currently installed.)
Step #6 - "compile-libfuzzer-introspector-x86_64": Preparing to unpack .../0-libyaml-0-2_0.2.2-1_amd64.deb ...
Step #6 - "compile-libfuzzer-introspector-x86_64": Unpacking libyaml-0-2:amd64 (0.2.2-1) ...
Step #6 - "compile-libfuzzer-introspector-x86_64": Selecting previously unselected package libjpeg-turbo8:amd64.
Step #6 - "compile-libfuzzer-introspector-x86_64": Preparing to unpack .../1-libjpeg-turbo8_2.0.3-0ubuntu1.20.04.3_amd64.deb ...
Step #6 - "compile-libfuzzer-introspector-x86_64": Unpacking libjpeg-turbo8:amd64 (2.0.3-0ubuntu1.20.04.3) ...
Step #6 - "compile-libfuzzer-introspector-x86_64": Selecting previously unselected package libjpeg-turbo8-dev:amd64.
Step #6 - "compile-libfuzzer-introspector-x86_64": Preparing to unpack .../2-libjpeg-turbo8-dev_2.0.3-0ubuntu1.20.04.3_amd64.deb ...
Step #6 - "compile-libfuzzer-introspector-x86_64": Unpacking libjpeg-turbo8-dev:amd64 (2.0.3-0ubuntu1.20.04.3) ...
Step #6 - "compile-libfuzzer-introspector-x86_64": Selecting previously unselected package libjpeg8:amd64.
Step #6 - "compile-libfuzzer-introspector-x86_64": Preparing to unpack .../3-libjpeg8_8c-2ubuntu8_amd64.deb ...
Step #6 - "compile-libfuzzer-introspector-x86_64": Unpacking libjpeg8:amd64 (8c-2ubuntu8) ...
Step #6 - "compile-libfuzzer-introspector-x86_64": Selecting previously unselected package libjpeg8-dev:amd64.
Step #6 - "compile-libfuzzer-introspector-x86_64": Preparing to unpack .../4-libjpeg8-dev_8c-2ubuntu8_amd64.deb ...
Step #6 - "compile-libfuzzer-introspector-x86_64": Unpacking libjpeg8-dev:amd64 (8c-2ubuntu8) ...
Step #6 - "compile-libfuzzer-introspector-x86_64": Selecting previously unselected package libjpeg-dev:amd64.
Step #6 - "compile-libfuzzer-introspector-x86_64": Preparing to unpack .../5-libjpeg-dev_8c-2ubuntu8_amd64.deb ...
Step #6 - "compile-libfuzzer-introspector-x86_64": Unpacking libjpeg-dev:amd64 (8c-2ubuntu8) ...
Step #6 - "compile-libfuzzer-introspector-x86_64": Selecting previously unselected package zlib1g-dev:amd64.
Step #6 - "compile-libfuzzer-introspector-x86_64": Preparing to unpack .../6-zlib1g-dev_1%3a1.2.11.dfsg-2ubuntu1.5_amd64.deb ...
Step #6 - "compile-libfuzzer-introspector-x86_64": Unpacking zlib1g-dev:amd64 (1:1.2.11.dfsg-2ubuntu1.5) ...
Step #6 - "compile-libfuzzer-introspector-x86_64": Selecting previously unselected package libyaml-dev:amd64.
Step #6 - "compile-libfuzzer-introspector-x86_64": Preparing to unpack .../7-libyaml-dev_0.2.2-1_amd64.deb ...
Step #6 - "compile-libfuzzer-introspector-x86_64": Unpacking libyaml-dev:amd64 (0.2.2-1) ...
Step #6 - "compile-libfuzzer-introspector-x86_64": Setting up libyaml-0-2:amd64 (0.2.2-1) ...
Step #6 - "compile-libfuzzer-introspector-x86_64": Setting up libjpeg-turbo8:amd64 (2.0.3-0ubuntu1.20.04.3) ...
Step #6 - "compile-libfuzzer-introspector-x86_64": Setting up zlib1g-dev:amd64 (1:1.2.11.dfsg-2ubuntu1.5) ...
Step #6 - "compile-libfuzzer-introspector-x86_64": Setting up libjpeg8:amd64 (8c-2ubuntu8) ...
Step #6 - "compile-libfuzzer-introspector-x86_64": Setting up libjpeg-turbo8-dev:amd64 (2.0.3-0ubuntu1.20.04.3) ...
Step #6 - "compile-libfuzzer-introspector-x86_64": Setting up libyaml-dev:amd64 (0.2.2-1) ...
Step #6 - "compile-libfuzzer-introspector-x86_64": Setting up libjpeg8-dev:amd64 (8c-2ubuntu8) ...
Step #6 - "compile-libfuzzer-introspector-x86_64": Setting up libjpeg-dev:amd64 (8c-2ubuntu8) ...
Step #6 - "compile-libfuzzer-introspector-x86_64": Processing triggers for libc-bin (2.31-0ubuntu9.18) ...
Step #6 - "compile-libfuzzer-introspector-x86_64": Requirement already satisfied: pip in /usr/local/lib/python3.11/site-packages (26.1.2)
Step #6 - "compile-libfuzzer-introspector-x86_64": Requirement already satisfied: setuptools in /usr/local/lib/python3.11/site-packages (65.5.0)
Step #6 - "compile-libfuzzer-introspector-x86_64": Collecting setuptools
Step #6 - "compile-libfuzzer-introspector-x86_64": Downloading setuptools-82.0.1-py3-none-any.whl.metadata (6.5 kB)
Step #6 - "compile-libfuzzer-introspector-x86_64": Downloading setuptools-82.0.1-py3-none-any.whl (1.0 MB)
Step #6 - "compile-libfuzzer-introspector-x86_64": [?25l [90m━━━━━━━━━━━━━━━━━━━━━━━━━━━━━━━━━━━━━━━━[0m [32m0.0/1.0 MB[0m [31m?[0m eta [36m-:--:--[0m
[2K [90m━━━━━━━━━━━━━━━━━━━━━━━━━━━━━━━━━━━━━━━━[0m [32m1.0/1.0 MB[0m [31m26.8 MB/s[0m [33m0:00:00[0m
Step #6 - "compile-libfuzzer-introspector-x86_64": [?25hInstalling collected packages: setuptools
Step #6 - "compile-libfuzzer-introspector-x86_64": Attempting uninstall: setuptools
Step #6 - "compile-libfuzzer-introspector-x86_64": Found existing installation: setuptools 65.5.0
Step #6 - "compile-libfuzzer-introspector-x86_64": Uninstalling setuptools-65.5.0:
Step #6 - "compile-libfuzzer-introspector-x86_64": Successfully uninstalled setuptools-65.5.0
Step #6 - "compile-libfuzzer-introspector-x86_64": Successfully installed setuptools-82.0.1
Step #6 - "compile-libfuzzer-introspector-x86_64": [33mWARNING: Running pip as the 'root' user can result in broken permissions and conflicting behaviour with the system package manager, possibly rendering your system unusable. It is recommended to use a virtual environment instead: https://pip.pypa.io/warnings/venv. Use the --root-user-action option if you know what you are doing and want to suppress this warning.[0m[33m
Step #6 - "compile-libfuzzer-introspector-x86_64": [0mCollecting cxxfilt
Step #6 - "compile-libfuzzer-introspector-x86_64": Downloading cxxfilt-0.3.0-py2.py3-none-any.whl.metadata (3.5 kB)
Step #6 - "compile-libfuzzer-introspector-x86_64": Collecting pyyaml
Step #6 - "compile-libfuzzer-introspector-x86_64": Downloading pyyaml-6.0.3-cp311-cp311-manylinux2014_x86_64.manylinux_2_17_x86_64.manylinux_2_28_x86_64.whl.metadata (2.4 kB)
Step #6 - "compile-libfuzzer-introspector-x86_64": Collecting beautifulsoup4
Step #6 - "compile-libfuzzer-introspector-x86_64": Downloading beautifulsoup4-4.15.0-py3-none-any.whl.metadata (3.8 kB)
Step #6 - "compile-libfuzzer-introspector-x86_64": Collecting lxml
Step #6 - "compile-libfuzzer-introspector-x86_64": Downloading lxml-6.1.1-cp311-cp311-manylinux_2_26_x86_64.manylinux_2_28_x86_64.whl.metadata (3.5 kB)
Step #6 - "compile-libfuzzer-introspector-x86_64": Collecting soupsieve
Step #6 - "compile-libfuzzer-introspector-x86_64": Downloading soupsieve-2.8.4-py3-none-any.whl.metadata (4.6 kB)
Step #6 - "compile-libfuzzer-introspector-x86_64": Collecting rust-demangler
Step #6 - "compile-libfuzzer-introspector-x86_64": Downloading rust_demangler-1.0-py3-none-any.whl.metadata (866 bytes)
Step #6 - "compile-libfuzzer-introspector-x86_64": Collecting typing-extensions>=4.0.0 (from beautifulsoup4)
Step #6 - "compile-libfuzzer-introspector-x86_64": Downloading typing_extensions-4.15.0-py3-none-any.whl.metadata (3.3 kB)
Step #6 - "compile-libfuzzer-introspector-x86_64": Downloading cxxfilt-0.3.0-py2.py3-none-any.whl (4.6 kB)
Step #6 - "compile-libfuzzer-introspector-x86_64": Downloading pyyaml-6.0.3-cp311-cp311-manylinux2014_x86_64.manylinux_2_17_x86_64.manylinux_2_28_x86_64.whl (806 kB)
Step #6 - "compile-libfuzzer-introspector-x86_64": [?25l [90m━━━━━━━━━━━━━━━━━━━━━━━━━━━━━━━━━━━━━━━━[0m [32m0.0/806.6 kB[0m [31m?[0m eta [36m-:--:--[0m
[2K [90m━━━━━━━━━━━━━━━━━━━━━━━━━━━━━━━━━━━━━━━━[0m [32m806.6/806.6 kB[0m [31m23.1 MB/s[0m [33m0:00:00[0m
Step #6 - "compile-libfuzzer-introspector-x86_64": [?25hDownloading beautifulsoup4-4.15.0-py3-none-any.whl (109 kB)
Step #6 - "compile-libfuzzer-introspector-x86_64": Downloading lxml-6.1.1-cp311-cp311-manylinux_2_26_x86_64.manylinux_2_28_x86_64.whl (5.2 MB)
Step #6 - "compile-libfuzzer-introspector-x86_64": [?25l [90m━━━━━━━━━━━━━━━━━━━━━━━━━━━━━━━━━━━━━━━━[0m [32m0.0/5.2 MB[0m [31m?[0m eta [36m-:--:--[0m
[2K [90m━━━━━━━━━━━━━━━━━━━━━━━━━━━━━━━━━━━━━━━━[0m [32m5.2/5.2 MB[0m [31m101.5 MB/s[0m [33m0:00:00[0m
Step #6 - "compile-libfuzzer-introspector-x86_64": [?25hDownloading soupsieve-2.8.4-py3-none-any.whl (37 kB)
Step #6 - "compile-libfuzzer-introspector-x86_64": Downloading rust_demangler-1.0-py3-none-any.whl (8.3 kB)
Step #6 - "compile-libfuzzer-introspector-x86_64": Downloading typing_extensions-4.15.0-py3-none-any.whl (44 kB)
Step #6 - "compile-libfuzzer-introspector-x86_64": Installing collected packages: rust-demangler, cxxfilt, typing-extensions, soupsieve, pyyaml, lxml, beautifulsoup4
Step #6 - "compile-libfuzzer-introspector-x86_64": [?25l
[2K [91m━━━━━━━━━━━━━━━━━━━━━━[0m[91m╸[0m[90m━━━━━━━━━━━━━━━━━[0m [32m4/7[0m [pyyaml]
[2K [91m━━━━━━━━━━━━━━━━━━━━━━━━━━━━[0m[91m╸[0m[90m━━━━━━━━━━━[0m [32m5/7[0m [lxml]
[2K [90m━━━━━━━━━━━━━━━━━━━━━━━━━━━━━━━━━━━━━━━━[0m [32m7/7[0m [beautifulsoup4]
Step #6 - "compile-libfuzzer-introspector-x86_64": [?25h
[1A[2KSuccessfully installed beautifulsoup4-4.15.0 cxxfilt-0.3.0 lxml-6.1.1 pyyaml-6.0.3 rust-demangler-1.0 soupsieve-2.8.4 typing-extensions-4.15.0
Step #6 - "compile-libfuzzer-introspector-x86_64": [33mWARNING: Running pip as the 'root' user can result in broken permissions and conflicting behaviour with the system package manager, possibly rendering your system unusable. It is recommended to use a virtual environment instead: https://pip.pypa.io/warnings/venv. Use the --root-user-action option if you know what you are doing and want to suppress this warning.[0m[33m
Step #6 - "compile-libfuzzer-introspector-x86_64": [0mCollecting matplotlib
Step #6 - "compile-libfuzzer-introspector-x86_64": Downloading matplotlib-3.11.0-cp311-cp311-manylinux2014_x86_64.manylinux_2_17_x86_64.whl.metadata (80 kB)
Step #6 - "compile-libfuzzer-introspector-x86_64": Collecting contourpy>=1.0.1 (from matplotlib)
Step #6 - "compile-libfuzzer-introspector-x86_64": Downloading contourpy-1.3.3-cp311-cp311-manylinux_2_27_x86_64.manylinux_2_28_x86_64.whl.metadata (5.5 kB)
Step #6 - "compile-libfuzzer-introspector-x86_64": Collecting cycler>=0.10 (from matplotlib)
Step #6 - "compile-libfuzzer-introspector-x86_64": Downloading cycler-0.12.1-py3-none-any.whl.metadata (3.8 kB)
Step #6 - "compile-libfuzzer-introspector-x86_64": Collecting fonttools>=4.22.0 (from matplotlib)
Step #6 - "compile-libfuzzer-introspector-x86_64": Downloading fonttools-4.63.0-cp311-cp311-manylinux2014_x86_64.manylinux_2_17_x86_64.whl.metadata (118 kB)
Step #6 - "compile-libfuzzer-introspector-x86_64": Collecting kiwisolver>=1.3.1 (from matplotlib)
Step #6 - "compile-libfuzzer-introspector-x86_64": Downloading kiwisolver-1.5.0-cp311-cp311-manylinux2014_x86_64.manylinux_2_17_x86_64.whl.metadata (5.1 kB)
Step #6 - "compile-libfuzzer-introspector-x86_64": Collecting numpy>=1.25 (from matplotlib)
Step #6 - "compile-libfuzzer-introspector-x86_64": Downloading numpy-2.4.6-cp311-cp311-manylinux_2_27_x86_64.manylinux_2_28_x86_64.whl.metadata (6.6 kB)
Step #6 - "compile-libfuzzer-introspector-x86_64": Collecting packaging>=20.0 (from matplotlib)
Step #6 - "compile-libfuzzer-introspector-x86_64": Downloading packaging-26.2-py3-none-any.whl.metadata (3.5 kB)
Step #6 - "compile-libfuzzer-introspector-x86_64": Collecting pillow>=9 (from matplotlib)
Step #6 - "compile-libfuzzer-introspector-x86_64": Downloading pillow-12.2.0-cp311-cp311-manylinux_2_27_x86_64.manylinux_2_28_x86_64.whl.metadata (8.8 kB)
Step #6 - "compile-libfuzzer-introspector-x86_64": Collecting pyparsing>=3 (from matplotlib)
Step #6 - "compile-libfuzzer-introspector-x86_64": Downloading pyparsing-3.3.2-py3-none-any.whl.metadata (5.8 kB)
Step #6 - "compile-libfuzzer-introspector-x86_64": Collecting python-dateutil>=2.7 (from matplotlib)
Step #6 - "compile-libfuzzer-introspector-x86_64": Downloading python_dateutil-2.9.0.post0-py2.py3-none-any.whl.metadata (8.4 kB)
Step #6 - "compile-libfuzzer-introspector-x86_64": Requirement already satisfied: six>=1.5 in /usr/local/lib/python3.11/site-packages (from python-dateutil>=2.7->matplotlib) (1.15.0)
Step #6 - "compile-libfuzzer-introspector-x86_64": Downloading matplotlib-3.11.0-cp311-cp311-manylinux2014_x86_64.manylinux_2_17_x86_64.whl (10.0 MB)
Step #6 - "compile-libfuzzer-introspector-x86_64": [?25l [90m━━━━━━━━━━━━━━━━━━━━━━━━━━━━━━━━━━━━━━━━[0m [32m0.0/10.0 MB[0m [31m?[0m eta [36m-:--:--[0m
[2K [90m━━━━━━━━━━━━━━━━━━━━━━━━━━━━━━━━━━━━━━━━[0m [32m10.0/10.0 MB[0m [31m120.1 MB/s[0m [33m0:00:00[0m
Step #6 - "compile-libfuzzer-introspector-x86_64": [?25hDownloading contourpy-1.3.3-cp311-cp311-manylinux_2_27_x86_64.manylinux_2_28_x86_64.whl (355 kB)
Step #6 - "compile-libfuzzer-introspector-x86_64": Downloading cycler-0.12.1-py3-none-any.whl (8.3 kB)
Step #6 - "compile-libfuzzer-introspector-x86_64": Downloading fonttools-4.63.0-cp311-cp311-manylinux2014_x86_64.manylinux_2_17_x86_64.whl (5.1 MB)
Step #6 - "compile-libfuzzer-introspector-x86_64": [?25l [90m━━━━━━━━━━━━━━━━━━━━━━━━━━━━━━━━━━━━━━━━[0m [32m0.0/5.1 MB[0m [31m?[0m eta [36m-:--:--[0m
[2K [90m━━━━━━━━━━━━━━━━━━━━━━━━━━━━━━━━━━━━━━━━[0m [32m5.1/5.1 MB[0m [31m106.5 MB/s[0m [33m0:00:00[0m
Step #6 - "compile-libfuzzer-introspector-x86_64": [?25hDownloading kiwisolver-1.5.0-cp311-cp311-manylinux2014_x86_64.manylinux_2_17_x86_64.whl (1.4 MB)
Step #6 - "compile-libfuzzer-introspector-x86_64": [?25l [90m━━━━━━━━━━━━━━━━━━━━━━━━━━━━━━━━━━━━━━━━[0m [32m0.0/1.4 MB[0m [31m?[0m eta [36m-:--:--[0m
[2K [90m━━━━━━━━━━━━━━━━━━━━━━━━━━━━━━━━━━━━━━━━[0m [32m1.4/1.4 MB[0m [31m85.8 MB/s[0m [33m0:00:00[0m
Step #6 - "compile-libfuzzer-introspector-x86_64": [?25hDownloading numpy-2.4.6-cp311-cp311-manylinux_2_27_x86_64.manylinux_2_28_x86_64.whl (16.9 MB)
Step #6 - "compile-libfuzzer-introspector-x86_64": [?25l [90m━━━━━━━━━━━━━━━━━━━━━━━━━━━━━━━━━━━━━━━━[0m [32m0.0/16.9 MB[0m [31m?[0m eta [36m-:--:--[0m
[2K [90m━━━━━━━━━━━━━━━━━━━━━━━━━━━━━━━━━━━━━━━━[0m [32m16.9/16.9 MB[0m [31m158.7 MB/s[0m [33m0:00:00[0m
Step #6 - "compile-libfuzzer-introspector-x86_64": [?25hDownloading packaging-26.2-py3-none-any.whl (100 kB)
Step #6 - "compile-libfuzzer-introspector-x86_64": Downloading pillow-12.2.0-cp311-cp311-manylinux_2_27_x86_64.manylinux_2_28_x86_64.whl (7.1 MB)
Step #6 - "compile-libfuzzer-introspector-x86_64": [?25l [90m━━━━━━━━━━━━━━━━━━━━━━━━━━━━━━━━━━━━━━━━[0m [32m0.0/7.1 MB[0m [31m?[0m eta [36m-:--:--[0m
[2K [90m━━━━━━━━━━━━━━━━━━━━━━━━━━━━━━━━━━━━━━━━[0m [32m7.1/7.1 MB[0m [31m140.4 MB/s[0m [33m0:00:00[0m
Step #6 - "compile-libfuzzer-introspector-x86_64": [?25hDownloading pyparsing-3.3.2-py3-none-any.whl (122 kB)
Step #6 - "compile-libfuzzer-introspector-x86_64": Downloading python_dateutil-2.9.0.post0-py2.py3-none-any.whl (229 kB)
Step #6 - "compile-libfuzzer-introspector-x86_64": Installing collected packages: python-dateutil, pyparsing, pillow, packaging, numpy, kiwisolver, fonttools, cycler, contourpy, matplotlib
Step #6 - "compile-libfuzzer-introspector-x86_64": [?25l
[2K [91m━━━━━━━━[0m[90m╺[0m[90m━━━━━━━━━━━━━━━━━━━━━━━━━━━━━━━[0m [32m 2/10[0m [pillow]
[2K [91m━━━━━━━━[0m[90m╺[0m[90m━━━━━━━━━━━━━━━━━━━━━━━━━━━━━━━[0m [32m 2/10[0m [pillow]
[2K [91m━━━━━━━━[0m[90m╺[0m[90m━━━━━━━━━━━━━━━━━━━━━━━━━━━━━━━[0m [32m 2/10[0m [pillow]
[2K [91m━━━━━━━━━━━━[0m[90m╺[0m[90m━━━━━━━━━━━━━━━━━━━━━━━━━━━[0m [32m 3/10[0m [packaging]
[2K [91m━━━━━━━━━━━━━━━━[0m[90m╺[0m[90m━━━━━━━━━━━━━━━━━━━━━━━[0m [32m 4/10[0m [numpy]
[2K [91m━━━━━━━━━━━━━━━━[0m[90m╺[0m[90m━━━━━━━━━━━━━━━━━━━━━━━[0m [32m 4/10[0m [numpy]
[2K [91m━━━━━━━━━━━━━━━━[0m[90m╺[0m[90m━━━━━━━━━━━━━━━━━━━━━━━[0m [32m 4/10[0m [numpy]
[2K [91m━━━━━━━━━━━━━━━━[0m[90m╺[0m[90m━━━━━━━━━━━━━━━━━━━━━━━[0m [32m 4/10[0m [numpy]
[2K [91m━━━━━━━━━━━━━━━━[0m[90m╺[0m[90m━━━━━━━━━━━━━━━━━━━━━━━[0m [32m 4/10[0m [numpy]
[2K [91m━━━━━━━━━━━━━━━━[0m[90m╺[0m[90m━━━━━━━━━━━━━━━━━━━━━━━[0m [32m 4/10[0m [numpy]
[2K [91m━━━━━━━━━━━━━━━━[0m[90m╺[0m[90m━━━━━━━━━━━━━━━━━━━━━━━[0m [32m 4/10[0m [numpy]
[2K [91m━━━━━━━━━━━━━━━━[0m[90m╺[0m[90m━━━━━━━━━━━━━━━━━━━━━━━[0m [32m 4/10[0m [numpy]
[2K [91m━━━━━━━━━━━━━━━━[0m[90m╺[0m[90m━━━━━━━━━━━━━━━━━━━━━━━[0m [32m 4/10[0m [numpy]
[2K [91m━━━━━━━━━━━━━━━━[0m[90m╺[0m[90m━━━━━━━━━━━━━━━━━━━━━━━[0m [32m 4/10[0m [numpy]
[2K [91m━━━━━━━━━━━━━━━━[0m[90m╺[0m[90m━━━━━━━━━━━━━━━━━━━━━━━[0m [32m 4/10[0m [numpy]
[2K [91m━━━━━━━━━━━━━━━━[0m[90m╺[0m[90m━━━━━━━━━━━━━━━━━━━━━━━[0m [32m 4/10[0m [numpy]
[2K [91m━━━━━━━━━━━━━━━━[0m[90m╺[0m[90m━━━━━━━━━━━━━━━━━━━━━━━[0m [32m 4/10[0m [numpy]
[2K [91m━━━━━━━━━━━━━━━━[0m[90m╺[0m[90m━━━━━━━━━━━━━━━━━━━━━━━[0m [32m 4/10[0m [numpy]
[2K [91m━━━━━━━━━━━━━━━━[0m[90m╺[0m[90m━━━━━━━━━━━━━━━━━━━━━━━[0m [32m 4/10[0m [numpy]
[2K [91m━━━━━━━━━━━━━━━━[0m[90m╺[0m[90m━━━━━━━━━━━━━━━━━━━━━━━[0m [32m 4/10[0m [numpy]
[2K [91m━━━━━━━━━━━━━━━━━━━━━━━━[0m[90m╺[0m[90m━━━━━━━━━━━━━━━[0m [32m 6/10[0m [fonttools]
[2K [91m━━━━━━━━━━━━━━━━━━━━━━━━[0m[90m╺[0m[90m━━━━━━━━━━━━━━━[0m [32m 6/10[0m [fonttools]
[2K [91m━━━━━━━━━━━━━━━━━━━━━━━━[0m[90m╺[0m[90m━━━━━━━━━━━━━━━[0m [32m 6/10[0m [fonttools]
[2K [91m━━━━━━━━━━━━━━━━━━━━━━━━[0m[90m╺[0m[90m━━━━━━━━━━━━━━━[0m [32m 6/10[0m [fonttools]
[2K [91m━━━━━━━━━━━━━━━━━━━━━━━━[0m[90m╺[0m[90m━━━━━━━━━━━━━━━[0m [32m 6/10[0m [fonttools]
[2K [91m━━━━━━━━━━━━━━━━━━━━━━━━[0m[90m╺[0m[90m━━━━━━━━━━━━━━━[0m [32m 6/10[0m [fonttools]
[2K [91m━━━━━━━━━━━━━━━━━━━━━━━━[0m[90m╺[0m[90m━━━━━━━━━━━━━━━[0m [32m 6/10[0m [fonttools]
[2K [91m━━━━━━━━━━━━━━━━━━━━━━━━━━━━━━━━━━━━[0m[90m╺[0m[90m━━━[0m [32m 9/10[0m [matplotlib]
[2K [91m━━━━━━━━━━━━━━━━━━━━━━━━━━━━━━━━━━━━[0m[90m╺[0m[90m━━━[0m [32m 9/10[0m [matplotlib]
[2K [91m━━━━━━━━━━━━━━━━━━━━━━━━━━━━━━━━━━━━[0m[90m╺[0m[90m━━━[0m [32m 9/10[0m [matplotlib]
[2K [91m━━━━━━━━━━━━━━━━━━━━━━━━━━━━━━━━━━━━[0m[90m╺[0m[90m━━━[0m [32m 9/10[0m [matplotlib]
[2K [91m━━━━━━━━━━━━━━━━━━━━━━━━━━━━━━━━━━━━[0m[90m╺[0m[90m━━━[0m [32m 9/10[0m [matplotlib]
[2K [91m━━━━━━━━━━━━━━━━━━━━━━━━━━━━━━━━━━━━[0m[90m╺[0m[90m━━━[0m [32m 9/10[0m [matplotlib]
[2K [91m━━━━━━━━━━━━━━━━━━━━━━━━━━━━━━━━━━━━[0m[90m╺[0m[90m━━━[0m [32m 9/10[0m [matplotlib]
[2K [91m━━━━━━━━━━━━━━━━━━━━━━━━━━━━━━━━━━━━[0m[90m╺[0m[90m━━━[0m [32m 9/10[0m [matplotlib]
[2K [91m━━━━━━━━━━━━━━━━━━━━━━━━━━━━━━━━━━━━[0m[90m╺[0m[90m━━━[0m [32m 9/10[0m [matplotlib]
[2K [91m━━━━━━━━━━━━━━━━━━━━━━━━━━━━━━━━━━━━[0m[90m╺[0m[90m━━━[0m [32m 9/10[0m [matplotlib]
[2K [91m━━━━━━━━━━━━━━━━━━━━━━━━━━━━━━━━━━━━[0m[90m╺[0m[90m━━━[0m [32m 9/10[0m [matplotlib]
[2K [91m━━━━━━━━━━━━━━━━━━━━━━━━━━━━━━━━━━━━[0m[90m╺[0m[90m━━━[0m [32m 9/10[0m [matplotlib]
[2K [90m━━━━━━━━━━━━━━━━━━━━━━━━━━━━━━━━━━━━━━━━[0m [32m10/10[0m [matplotlib]
Step #6 - "compile-libfuzzer-introspector-x86_64": [?25h
[1A[2KSuccessfully installed contourpy-1.3.3 cycler-0.12.1 fonttools-4.63.0 kiwisolver-1.5.0 matplotlib-3.11.0 numpy-2.4.6 packaging-26.2 pillow-12.2.0 pyparsing-3.3.2 python-dateutil-2.9.0.post0
Step #6 - "compile-libfuzzer-introspector-x86_64": [33mWARNING: Running pip as the 'root' user can result in broken permissions and conflicting behaviour with the system package manager, possibly rendering your system unusable. It is recommended to use a virtual environment instead: https://pip.pypa.io/warnings/venv. Use the --root-user-action option if you know what you are doing and want to suppress this warning.[0m[33m
Step #6 - "compile-libfuzzer-introspector-x86_64": [0m/fuzz-introspector/src /src
Step #6 - "compile-libfuzzer-introspector-x86_64": Obtaining file:///fuzz-introspector/src
Step #6 - "compile-libfuzzer-introspector-x86_64": Installing build dependencies ... [?25l- \ | / done
Step #6 - "compile-libfuzzer-introspector-x86_64": [?25h Checking if build backend supports build_editable ... [?25ldone
Step #6 - "compile-libfuzzer-introspector-x86_64": [?25h Getting requirements to build editable ... [?25l- \ done
Step #6 - "compile-libfuzzer-introspector-x86_64": [?25h Preparing editable metadata (pyproject.toml) ... [?25l- \ done
Step #6 - "compile-libfuzzer-introspector-x86_64": [?25hCollecting beautifulsoup4==4.10.0 (from fuzz-introspector==0.1.10)
Step #6 - "compile-libfuzzer-introspector-x86_64": Downloading beautifulsoup4-4.10.0-py3-none-any.whl.metadata (3.5 kB)
Step #6 - "compile-libfuzzer-introspector-x86_64": Requirement already satisfied: cxxfilt==0.3.0 in /usr/local/lib/python3.11/site-packages (from fuzz-introspector==0.1.10) (0.3.0)
Step #6 - "compile-libfuzzer-introspector-x86_64": Collecting lxml==5.3.0 (from fuzz-introspector==0.1.10)
Step #6 - "compile-libfuzzer-introspector-x86_64": Downloading lxml-5.3.0-cp311-cp311-manylinux_2_28_x86_64.whl.metadata (3.8 kB)
Step #6 - "compile-libfuzzer-introspector-x86_64": Collecting matplotlib==3.10.0 (from fuzz-introspector==0.1.10)
Step #6 - "compile-libfuzzer-introspector-x86_64": Downloading matplotlib-3.10.0-cp311-cp311-manylinux_2_17_x86_64.manylinux2014_x86_64.whl.metadata (11 kB)
Step #6 - "compile-libfuzzer-introspector-x86_64": Collecting PyYAML==6.0.2 (from fuzz-introspector==0.1.10)
Step #6 - "compile-libfuzzer-introspector-x86_64": Downloading PyYAML-6.0.2-cp311-cp311-manylinux_2_17_x86_64.manylinux2014_x86_64.whl.metadata (2.1 kB)
Step #6 - "compile-libfuzzer-introspector-x86_64": Collecting soupsieve==2.2.1 (from fuzz-introspector==0.1.10)
Step #6 - "compile-libfuzzer-introspector-x86_64": Downloading soupsieve-2.2.1-py3-none-any.whl.metadata (5.5 kB)
Step #6 - "compile-libfuzzer-introspector-x86_64": Collecting yapf==0.40.1 (from fuzz-introspector==0.1.10)
Step #6 - "compile-libfuzzer-introspector-x86_64": Downloading yapf-0.40.1-py3-none-any.whl.metadata (35 kB)
Step #6 - "compile-libfuzzer-introspector-x86_64": Collecting flake8 (from fuzz-introspector==0.1.10)
Step #6 - "compile-libfuzzer-introspector-x86_64": Downloading flake8-7.3.0-py2.py3-none-any.whl.metadata (3.8 kB)
Step #6 - "compile-libfuzzer-introspector-x86_64": Collecting pep8 (from fuzz-introspector==0.1.10)
Step #6 - "compile-libfuzzer-introspector-x86_64": Downloading pep8-1.7.1-py2.py3-none-any.whl.metadata (22 kB)
Step #6 - "compile-libfuzzer-introspector-x86_64": Collecting mypy (from fuzz-introspector==0.1.10)
Step #6 - "compile-libfuzzer-introspector-x86_64": Downloading mypy-2.1.0-cp311-cp311-manylinux2014_x86_64.manylinux_2_17_x86_64.manylinux_2_28_x86_64.whl.metadata (2.3 kB)
Step #6 - "compile-libfuzzer-introspector-x86_64": Collecting psutil (from fuzz-introspector==0.1.10)
Step #6 - "compile-libfuzzer-introspector-x86_64": Downloading psutil-7.2.2-cp36-abi3-manylinux2010_x86_64.manylinux_2_12_x86_64.manylinux_2_28_x86_64.whl.metadata (22 kB)
Step #6 - "compile-libfuzzer-introspector-x86_64": Collecting toml (from fuzz-introspector==0.1.10)
Step #6 - "compile-libfuzzer-introspector-x86_64": Downloading toml-0.10.2-py2.py3-none-any.whl.metadata (7.1 kB)
Step #6 - "compile-libfuzzer-introspector-x86_64": Collecting pytest (from fuzz-introspector==0.1.10)
Step #6 - "compile-libfuzzer-introspector-x86_64": Downloading pytest-9.1.0-py3-none-any.whl.metadata (7.6 kB)
Step #6 - "compile-libfuzzer-introspector-x86_64": Collecting sphinx==6.0.0 (from fuzz-introspector==0.1.10)
Step #6 - "compile-libfuzzer-introspector-x86_64": Downloading sphinx-6.0.0-py3-none-any.whl.metadata (6.2 kB)
Step #6 - "compile-libfuzzer-introspector-x86_64": Collecting sphinx_rtd_theme (from fuzz-introspector==0.1.10)
Step #6 - "compile-libfuzzer-introspector-x86_64": Downloading sphinx_rtd_theme-3.1.0-py2.py3-none-any.whl.metadata (4.5 kB)
Step #6 - "compile-libfuzzer-introspector-x86_64": Collecting configparser (from fuzz-introspector==0.1.10)
Step #6 - "compile-libfuzzer-introspector-x86_64": Downloading configparser-7.2.0-py3-none-any.whl.metadata (5.5 kB)
Step #6 - "compile-libfuzzer-introspector-x86_64": Collecting coverage (from fuzz-introspector==0.1.10)
Step #6 - "compile-libfuzzer-introspector-x86_64": Downloading coverage-7.14.1-cp311-cp311-manylinux1_x86_64.manylinux_2_28_x86_64.manylinux_2_5_x86_64.whl.metadata (8.6 kB)
Step #6 - "compile-libfuzzer-introspector-x86_64": Requirement already satisfied: setuptools>=65.5.1 in /usr/local/lib/python3.11/site-packages (from fuzz-introspector==0.1.10) (82.0.1)
Step #6 - "compile-libfuzzer-introspector-x86_64": Collecting tqdm (from fuzz-introspector==0.1.10)
Step #6 - "compile-libfuzzer-introspector-x86_64": Downloading tqdm-4.68.2-py3-none-any.whl.metadata (58 kB)
Step #6 - "compile-libfuzzer-introspector-x86_64": Requirement already satisfied: rust-demangler in /usr/local/lib/python3.11/site-packages (from fuzz-introspector==0.1.10) (1.0)
Step #6 - "compile-libfuzzer-introspector-x86_64": Collecting numpy==2.1.0 (from fuzz-introspector==0.1.10)
Step #6 - "compile-libfuzzer-introspector-x86_64": Downloading numpy-2.1.0-cp311-cp311-manylinux_2_17_x86_64.manylinux2014_x86_64.whl.metadata (60 kB)
Step #6 - "compile-libfuzzer-introspector-x86_64": Collecting tree-sitter==0.23.2 (from fuzz-introspector==0.1.10)
Step #6 - "compile-libfuzzer-introspector-x86_64": Downloading tree_sitter-0.23.2-cp311-cp311-manylinux_2_17_x86_64.manylinux2014_x86_64.whl.metadata (9.8 kB)
Step #6 - "compile-libfuzzer-introspector-x86_64": Collecting tree-sitter-python==0.23.6 (from fuzz-introspector==0.1.10)
Step #6 - "compile-libfuzzer-introspector-x86_64": Downloading tree_sitter_python-0.23.6-cp39-abi3-manylinux_2_5_x86_64.manylinux1_x86_64.manylinux_2_17_x86_64.manylinux2014_x86_64.whl.metadata (1.9 kB)
Step #6 - "compile-libfuzzer-introspector-x86_64": Collecting networkx (from fuzz-introspector==0.1.10)
Step #6 - "compile-libfuzzer-introspector-x86_64": Downloading networkx-3.6.1-py3-none-any.whl.metadata (6.8 kB)
Step #6 - "compile-libfuzzer-introspector-x86_64": Collecting tree-sitter-languages==1.10.2 (from fuzz-introspector==0.1.10)
Step #6 - "compile-libfuzzer-introspector-x86_64": Downloading tree_sitter_languages-1.10.2-cp311-cp311-manylinux_2_17_x86_64.manylinux2014_x86_64.whl.metadata (10 kB)
Step #6 - "compile-libfuzzer-introspector-x86_64": Collecting tree-sitter-cpp==0.23.4 (from fuzz-introspector==0.1.10)
Step #6 - "compile-libfuzzer-introspector-x86_64": Downloading tree_sitter_cpp-0.23.4-cp39-abi3-manylinux_2_17_x86_64.manylinux2014_x86_64.whl.metadata (1.8 kB)
Step #6 - "compile-libfuzzer-introspector-x86_64": Collecting tree-sitter-go==0.23.4 (from fuzz-introspector==0.1.10)
Step #6 - "compile-libfuzzer-introspector-x86_64": Downloading tree_sitter_go-0.23.4-cp39-abi3-manylinux_2_5_x86_64.manylinux1_x86_64.manylinux_2_17_x86_64.manylinux2014_x86_64.whl.metadata (1.7 kB)
Step #6 - "compile-libfuzzer-introspector-x86_64": Collecting tree-sitter-java==0.23.5 (from fuzz-introspector==0.1.10)
Step #6 - "compile-libfuzzer-introspector-x86_64": Downloading tree_sitter_java-0.23.5-cp39-abi3-manylinux_2_5_x86_64.manylinux1_x86_64.manylinux_2_17_x86_64.manylinux2014_x86_64.whl.metadata (1.7 kB)
Step #6 - "compile-libfuzzer-introspector-x86_64": Collecting tree-sitter-rust==0.23.2 (from fuzz-introspector==0.1.10)
Step #6 - "compile-libfuzzer-introspector-x86_64": Downloading tree_sitter_rust-0.23.2-cp39-abi3-manylinux_2_5_x86_64.manylinux1_x86_64.manylinux_2_17_x86_64.manylinux2014_x86_64.whl.metadata (2.8 kB)
Step #6 - "compile-libfuzzer-introspector-x86_64": Requirement already satisfied: contourpy>=1.0.1 in /usr/local/lib/python3.11/site-packages (from matplotlib==3.10.0->fuzz-introspector==0.1.10) (1.3.3)
Step #6 - "compile-libfuzzer-introspector-x86_64": Requirement already satisfied: cycler>=0.10 in /usr/local/lib/python3.11/site-packages (from matplotlib==3.10.0->fuzz-introspector==0.1.10) (0.12.1)
Step #6 - "compile-libfuzzer-introspector-x86_64": Requirement already satisfied: fonttools>=4.22.0 in /usr/local/lib/python3.11/site-packages (from matplotlib==3.10.0->fuzz-introspector==0.1.10) (4.63.0)
Step #6 - "compile-libfuzzer-introspector-x86_64": Requirement already satisfied: kiwisolver>=1.3.1 in /usr/local/lib/python3.11/site-packages (from matplotlib==3.10.0->fuzz-introspector==0.1.10) (1.5.0)
Step #6 - "compile-libfuzzer-introspector-x86_64": Requirement already satisfied: packaging>=20.0 in /usr/local/lib/python3.11/site-packages (from matplotlib==3.10.0->fuzz-introspector==0.1.10) (26.2)
Step #6 - "compile-libfuzzer-introspector-x86_64": Requirement already satisfied: pillow>=8 in /usr/local/lib/python3.11/site-packages (from matplotlib==3.10.0->fuzz-introspector==0.1.10) (12.2.0)
Step #6 - "compile-libfuzzer-introspector-x86_64": Requirement already satisfied: pyparsing>=2.3.1 in /usr/local/lib/python3.11/site-packages (from matplotlib==3.10.0->fuzz-introspector==0.1.10) (3.3.2)
Step #6 - "compile-libfuzzer-introspector-x86_64": Requirement already satisfied: python-dateutil>=2.7 in /usr/local/lib/python3.11/site-packages (from matplotlib==3.10.0->fuzz-introspector==0.1.10) (2.9.0.post0)
Step #6 - "compile-libfuzzer-introspector-x86_64": Collecting sphinxcontrib-applehelp (from sphinx==6.0.0->fuzz-introspector==0.1.10)
Step #6 - "compile-libfuzzer-introspector-x86_64": Downloading sphinxcontrib_applehelp-2.0.0-py3-none-any.whl.metadata (2.3 kB)
Step #6 - "compile-libfuzzer-introspector-x86_64": Collecting sphinxcontrib-devhelp (from sphinx==6.0.0->fuzz-introspector==0.1.10)
Step #6 - "compile-libfuzzer-introspector-x86_64": Downloading sphinxcontrib_devhelp-2.0.0-py3-none-any.whl.metadata (2.3 kB)
Step #6 - "compile-libfuzzer-introspector-x86_64": Collecting sphinxcontrib-jsmath (from sphinx==6.0.0->fuzz-introspector==0.1.10)
Step #6 - "compile-libfuzzer-introspector-x86_64": Downloading sphinxcontrib_jsmath-1.0.1-py2.py3-none-any.whl.metadata (1.4 kB)
Step #6 - "compile-libfuzzer-introspector-x86_64": Collecting sphinxcontrib-htmlhelp>=2.0.0 (from sphinx==6.0.0->fuzz-introspector==0.1.10)
Step #6 - "compile-libfuzzer-introspector-x86_64": Downloading sphinxcontrib_htmlhelp-2.1.0-py3-none-any.whl.metadata (2.3 kB)
Step #6 - "compile-libfuzzer-introspector-x86_64": Collecting sphinxcontrib-serializinghtml>=1.1.5 (from sphinx==6.0.0->fuzz-introspector==0.1.10)
Step #6 - "compile-libfuzzer-introspector-x86_64": Downloading sphinxcontrib_serializinghtml-2.0.0-py3-none-any.whl.metadata (2.4 kB)
Step #6 - "compile-libfuzzer-introspector-x86_64": Collecting sphinxcontrib-qthelp (from sphinx==6.0.0->fuzz-introspector==0.1.10)
Step #6 - "compile-libfuzzer-introspector-x86_64": Downloading sphinxcontrib_qthelp-2.0.0-py3-none-any.whl.metadata (2.3 kB)
Step #6 - "compile-libfuzzer-introspector-x86_64": Collecting Jinja2>=3.0 (from sphinx==6.0.0->fuzz-introspector==0.1.10)
Step #6 - "compile-libfuzzer-introspector-x86_64": Downloading jinja2-3.1.6-py3-none-any.whl.metadata (2.9 kB)
Step #6 - "compile-libfuzzer-introspector-x86_64": Collecting Pygments>=2.12 (from sphinx==6.0.0->fuzz-introspector==0.1.10)
Step #6 - "compile-libfuzzer-introspector-x86_64": Downloading pygments-2.20.0-py3-none-any.whl.metadata (2.5 kB)
Step #6 - "compile-libfuzzer-introspector-x86_64": Collecting docutils<0.20,>=0.18 (from sphinx==6.0.0->fuzz-introspector==0.1.10)
Step #6 - "compile-libfuzzer-introspector-x86_64": Downloading docutils-0.19-py3-none-any.whl.metadata (2.7 kB)
Step #6 - "compile-libfuzzer-introspector-x86_64": Collecting snowballstemmer>=2.0 (from sphinx==6.0.0->fuzz-introspector==0.1.10)
Step #6 - "compile-libfuzzer-introspector-x86_64": Downloading snowballstemmer-3.1.1-py3-none-any.whl.metadata (7.9 kB)
Step #6 - "compile-libfuzzer-introspector-x86_64": Collecting babel>=2.9 (from sphinx==6.0.0->fuzz-introspector==0.1.10)
Step #6 - "compile-libfuzzer-introspector-x86_64": Downloading babel-2.18.0-py3-none-any.whl.metadata (2.2 kB)
Step #6 - "compile-libfuzzer-introspector-x86_64": Collecting alabaster<0.8,>=0.7 (from sphinx==6.0.0->fuzz-introspector==0.1.10)
Step #6 - "compile-libfuzzer-introspector-x86_64": Downloading alabaster-0.7.16-py3-none-any.whl.metadata (2.9 kB)
Step #6 - "compile-libfuzzer-introspector-x86_64": Collecting imagesize>=1.3 (from sphinx==6.0.0->fuzz-introspector==0.1.10)
Step #6 - "compile-libfuzzer-introspector-x86_64": Downloading imagesize-2.0.0-py2.py3-none-any.whl.metadata (1.5 kB)
Step #6 - "compile-libfuzzer-introspector-x86_64": Collecting requests>=2.25.0 (from sphinx==6.0.0->fuzz-introspector==0.1.10)
Step #6 - "compile-libfuzzer-introspector-x86_64": Downloading requests-2.34.2-py3-none-any.whl.metadata (4.8 kB)
Step #6 - "compile-libfuzzer-introspector-x86_64": Collecting importlib-metadata>=6.6.0 (from yapf==0.40.1->fuzz-introspector==0.1.10)
Step #6 - "compile-libfuzzer-introspector-x86_64": Downloading importlib_metadata-9.0.0-py3-none-any.whl.metadata (4.5 kB)
Step #6 - "compile-libfuzzer-introspector-x86_64": Collecting platformdirs>=3.5.1 (from yapf==0.40.1->fuzz-introspector==0.1.10)
Step #6 - "compile-libfuzzer-introspector-x86_64": Downloading platformdirs-4.10.0-py3-none-any.whl.metadata (5.5 kB)
Step #6 - "compile-libfuzzer-introspector-x86_64": Collecting tomli>=2.0.1 (from yapf==0.40.1->fuzz-introspector==0.1.10)
Step #6 - "compile-libfuzzer-introspector-x86_64": Downloading tomli-2.4.1-cp311-cp311-manylinux2014_x86_64.manylinux_2_17_x86_64.manylinux_2_28_x86_64.whl.metadata (10 kB)
Step #6 - "compile-libfuzzer-introspector-x86_64": Collecting zipp>=3.20 (from importlib-metadata>=6.6.0->yapf==0.40.1->fuzz-introspector==0.1.10)
Step #6 - "compile-libfuzzer-introspector-x86_64": Downloading zipp-4.1.0-py3-none-any.whl.metadata (3.6 kB)
Step #6 - "compile-libfuzzer-introspector-x86_64": Collecting MarkupSafe>=2.0 (from Jinja2>=3.0->sphinx==6.0.0->fuzz-introspector==0.1.10)
Step #6 - "compile-libfuzzer-introspector-x86_64": Downloading markupsafe-3.0.3-cp311-cp311-manylinux2014_x86_64.manylinux_2_17_x86_64.manylinux_2_28_x86_64.whl.metadata (2.7 kB)
Step #6 - "compile-libfuzzer-introspector-x86_64": Requirement already satisfied: six>=1.5 in /usr/local/lib/python3.11/site-packages (from python-dateutil>=2.7->matplotlib==3.10.0->fuzz-introspector==0.1.10) (1.15.0)
Step #6 - "compile-libfuzzer-introspector-x86_64": Collecting charset_normalizer<4,>=2 (from requests>=2.25.0->sphinx==6.0.0->fuzz-introspector==0.1.10)
Step #6 - "compile-libfuzzer-introspector-x86_64": Downloading charset_normalizer-3.4.7-cp311-cp311-manylinux2014_x86_64.manylinux_2_17_x86_64.manylinux_2_28_x86_64.whl.metadata (40 kB)
Step #6 - "compile-libfuzzer-introspector-x86_64": Collecting idna<4,>=2.5 (from requests>=2.25.0->sphinx==6.0.0->fuzz-introspector==0.1.10)
Step #6 - "compile-libfuzzer-introspector-x86_64": Downloading idna-3.18-py3-none-any.whl.metadata (6.1 kB)
Step #6 - "compile-libfuzzer-introspector-x86_64": Collecting urllib3<3,>=1.26 (from requests>=2.25.0->sphinx==6.0.0->fuzz-introspector==0.1.10)
Step #6 - "compile-libfuzzer-introspector-x86_64": Downloading urllib3-2.7.0-py3-none-any.whl.metadata (6.9 kB)
Step #6 - "compile-libfuzzer-introspector-x86_64": Collecting certifi>=2023.5.7 (from requests>=2.25.0->sphinx==6.0.0->fuzz-introspector==0.1.10)
Step #6 - "compile-libfuzzer-introspector-x86_64": Downloading certifi-2026.5.20-py3-none-any.whl.metadata (2.5 kB)
Step #6 - "compile-libfuzzer-introspector-x86_64": Collecting mccabe<0.8.0,>=0.7.0 (from flake8->fuzz-introspector==0.1.10)
Step #6 - "compile-libfuzzer-introspector-x86_64": Downloading mccabe-0.7.0-py2.py3-none-any.whl.metadata (5.0 kB)
Step #6 - "compile-libfuzzer-introspector-x86_64": Collecting pycodestyle<2.15.0,>=2.14.0 (from flake8->fuzz-introspector==0.1.10)
Step #6 - "compile-libfuzzer-introspector-x86_64": Downloading pycodestyle-2.14.0-py2.py3-none-any.whl.metadata (4.5 kB)
Step #6 - "compile-libfuzzer-introspector-x86_64": Collecting pyflakes<3.5.0,>=3.4.0 (from flake8->fuzz-introspector==0.1.10)
Step #6 - "compile-libfuzzer-introspector-x86_64": Downloading pyflakes-3.4.0-py2.py3-none-any.whl.metadata (3.5 kB)
Step #6 - "compile-libfuzzer-introspector-x86_64": Requirement already satisfied: typing_extensions>=4.6.0 in /usr/local/lib/python3.11/site-packages (from mypy->fuzz-introspector==0.1.10) (4.15.0)
Step #6 - "compile-libfuzzer-introspector-x86_64": Collecting mypy_extensions>=1.0.0 (from mypy->fuzz-introspector==0.1.10)
Step #6 - "compile-libfuzzer-introspector-x86_64": Downloading mypy_extensions-1.1.0-py3-none-any.whl.metadata (1.1 kB)
Step #6 - "compile-libfuzzer-introspector-x86_64": Collecting pathspec>=1.0.0 (from mypy->fuzz-introspector==0.1.10)
Step #6 - "compile-libfuzzer-introspector-x86_64": Downloading pathspec-1.1.1-py3-none-any.whl.metadata (14 kB)
Step #6 - "compile-libfuzzer-introspector-x86_64": Collecting librt>=0.11.0 (from mypy->fuzz-introspector==0.1.10)
Step #6 - "compile-libfuzzer-introspector-x86_64": Downloading librt-0.11.0-cp311-cp311-manylinux2014_x86_64.manylinux_2_17_x86_64.manylinux_2_28_x86_64.whl.metadata (1.3 kB)
Step #6 - "compile-libfuzzer-introspector-x86_64": Collecting ast-serialize<1.0.0,>=0.3.0 (from mypy->fuzz-introspector==0.1.10)
Step #6 - "compile-libfuzzer-introspector-x86_64": Downloading ast_serialize-0.5.0-cp39-abi3-manylinux_2_17_x86_64.manylinux2014_x86_64.whl.metadata (1.3 kB)
Step #6 - "compile-libfuzzer-introspector-x86_64": Collecting iniconfig>=1.0.1 (from pytest->fuzz-introspector==0.1.10)
Step #6 - "compile-libfuzzer-introspector-x86_64": Downloading iniconfig-2.3.0-py3-none-any.whl.metadata (2.5 kB)
Step #6 - "compile-libfuzzer-introspector-x86_64": Collecting pluggy<2,>=1.5 (from pytest->fuzz-introspector==0.1.10)
Step #6 - "compile-libfuzzer-introspector-x86_64": Downloading pluggy-1.6.0-py3-none-any.whl.metadata (4.8 kB)
Step #6 - "compile-libfuzzer-introspector-x86_64": Collecting sphinxcontrib-jquery<5,>=4 (from sphinx_rtd_theme->fuzz-introspector==0.1.10)
Step #6 - "compile-libfuzzer-introspector-x86_64": Downloading sphinxcontrib_jquery-4.1-py2.py3-none-any.whl.metadata (2.6 kB)
Step #6 - "compile-libfuzzer-introspector-x86_64": Downloading beautifulsoup4-4.10.0-py3-none-any.whl (97 kB)
Step #6 - "compile-libfuzzer-introspector-x86_64": Downloading lxml-5.3.0-cp311-cp311-manylinux_2_28_x86_64.whl (5.0 MB)
Step #6 - "compile-libfuzzer-introspector-x86_64": [?25l [90m━━━━━━━━━━━━━━━━━━━━━━━━━━━━━━━━━━━━━━━━[0m [32m0.0/5.0 MB[0m [31m?[0m eta [36m-:--:--[0m
[2K [90m━━━━━━━━━━━━━━━━━━━━━━━━━━━━━━━━━━━━━━━━[0m [32m5.0/5.0 MB[0m [31m82.5 MB/s[0m [33m0:00:00[0m
Step #6 - "compile-libfuzzer-introspector-x86_64": [?25hDownloading matplotlib-3.10.0-cp311-cp311-manylinux_2_17_x86_64.manylinux2014_x86_64.whl (8.6 MB)
Step #6 - "compile-libfuzzer-introspector-x86_64": [?25l [90m━━━━━━━━━━━━━━━━━━━━━━━━━━━━━━━━━━━━━━━━[0m [32m0.0/8.6 MB[0m [31m?[0m eta [36m-:--:--[0m
[2K [90m━━━━━━━━━━━━━━━━━━━━━━━━━━━━━━━━━━━━━━━━[0m [32m8.6/8.6 MB[0m [31m115.6 MB/s[0m [33m0:00:00[0m
Step #6 - "compile-libfuzzer-introspector-x86_64": [?25hDownloading numpy-2.1.0-cp311-cp311-manylinux_2_17_x86_64.manylinux2014_x86_64.whl (16.3 MB)
Step #6 - "compile-libfuzzer-introspector-x86_64": [?25l [90m━━━━━━━━━━━━━━━━━━━━━━━━━━━━━━━━━━━━━━━━[0m [32m0.0/16.3 MB[0m [31m?[0m eta [36m-:--:--[0m
[2K [90m━━━━━━━━━━━━━━━━━━━━━━━━━━━━━━━━━━━━━━━━[0m [32m16.3/16.3 MB[0m [31m155.0 MB/s[0m [33m0:00:00[0m
Step #6 - "compile-libfuzzer-introspector-x86_64": [?25hDownloading PyYAML-6.0.2-cp311-cp311-manylinux_2_17_x86_64.manylinux2014_x86_64.whl (762 kB)
Step #6 - "compile-libfuzzer-introspector-x86_64": [?25l [90m━━━━━━━━━━━━━━━━━━━━━━━━━━━━━━━━━━━━━━━━[0m [32m0.0/763.0 kB[0m [31m?[0m eta [36m-:--:--[0m
[2K [90m━━━━━━━━━━━━━━━━━━━━━━━━━━━━━━━━━━━━━━━━[0m [32m763.0/763.0 kB[0m [31m47.9 MB/s[0m [33m0:00:00[0m
Step #6 - "compile-libfuzzer-introspector-x86_64": [?25hDownloading soupsieve-2.2.1-py3-none-any.whl (33 kB)
Step #6 - "compile-libfuzzer-introspector-x86_64": Downloading sphinx-6.0.0-py3-none-any.whl (3.0 MB)
Step #6 - "compile-libfuzzer-introspector-x86_64": [?25l [90m━━━━━━━━━━━━━━━━━━━━━━━━━━━━━━━━━━━━━━━━[0m [32m0.0/3.0 MB[0m [31m?[0m eta [36m-:--:--[0m
[2K [90m━━━━━━━━━━━━━━━━━━━━━━━━━━━━━━━━━━━━━━━━[0m [32m3.0/3.0 MB[0m [31m126.3 MB/s[0m [33m0:00:00[0m
Step #6 - "compile-libfuzzer-introspector-x86_64": [?25hDownloading tree_sitter-0.23.2-cp311-cp311-manylinux_2_17_x86_64.manylinux2014_x86_64.whl (567 kB)
Step #6 - "compile-libfuzzer-introspector-x86_64": [?25l [90m━━━━━━━━━━━━━━━━━━━━━━━━━━━━━━━━━━━━━━━━[0m [32m0.0/567.6 kB[0m [31m?[0m eta [36m-:--:--[0m
[2K [90m━━━━━━━━━━━━━━━━━━━━━━━━━━━━━━━━━━━━━━━━[0m [32m567.6/567.6 kB[0m [31m38.2 MB/s[0m [33m0:00:00[0m
Step #6 - "compile-libfuzzer-introspector-x86_64": [?25hDownloading tree_sitter_cpp-0.23.4-cp39-abi3-manylinux_2_17_x86_64.manylinux2014_x86_64.whl (316 kB)
Step #6 - "compile-libfuzzer-introspector-x86_64": Downloading tree_sitter_go-0.23.4-cp39-abi3-manylinux_2_5_x86_64.manylinux1_x86_64.manylinux_2_17_x86_64.manylinux2014_x86_64.whl (65 kB)
Step #6 - "compile-libfuzzer-introspector-x86_64": Downloading tree_sitter_java-0.23.5-cp39-abi3-manylinux_2_5_x86_64.manylinux1_x86_64.manylinux_2_17_x86_64.manylinux2014_x86_64.whl (84 kB)
Step #6 - "compile-libfuzzer-introspector-x86_64": Downloading tree_sitter_languages-1.10.2-cp311-cp311-manylinux_2_17_x86_64.manylinux2014_x86_64.whl (8.4 MB)
Step #6 - "compile-libfuzzer-introspector-x86_64": [?25l [90m━━━━━━━━━━━━━━━━━━━━━━━━━━━━━━━━━━━━━━━━[0m [32m0.0/8.4 MB[0m [31m?[0m eta [36m-:--:--[0m
[2K [90m━━━━━━━━━━━━━━━━━━━━━━━━━━━━━━━━━━━━━━━━[0m [32m8.4/8.4 MB[0m [31m138.9 MB/s[0m [33m0:00:00[0m
Step #6 - "compile-libfuzzer-introspector-x86_64": [?25hDownloading tree_sitter_python-0.23.6-cp39-abi3-manylinux_2_5_x86_64.manylinux1_x86_64.manylinux_2_17_x86_64.manylinux2014_x86_64.whl (112 kB)
Step #6 - "compile-libfuzzer-introspector-x86_64": Downloading tree_sitter_rust-0.23.2-cp39-abi3-manylinux_2_5_x86_64.manylinux1_x86_64.manylinux_2_17_x86_64.manylinux2014_x86_64.whl (157 kB)
Step #6 - "compile-libfuzzer-introspector-x86_64": Downloading yapf-0.40.1-py3-none-any.whl (250 kB)
Step #6 - "compile-libfuzzer-introspector-x86_64": Downloading alabaster-0.7.16-py3-none-any.whl (13 kB)
Step #6 - "compile-libfuzzer-introspector-x86_64": Downloading docutils-0.19-py3-none-any.whl (570 kB)
Step #6 - "compile-libfuzzer-introspector-x86_64": [?25l [90m━━━━━━━━━━━━━━━━━━━━━━━━━━━━━━━━━━━━━━━━[0m [32m0.0/570.5 kB[0m [31m?[0m eta [36m-:--:--[0m
[2K [90m━━━━━━━━━━━━━━━━━━━━━━━━━━━━━━━━━━━━━━━━[0m [32m570.5/570.5 kB[0m [31m32.9 MB/s[0m [33m0:00:00[0m
Step #6 - "compile-libfuzzer-introspector-x86_64": [?25hDownloading babel-2.18.0-py3-none-any.whl (10.2 MB)
Step #6 - "compile-libfuzzer-introspector-x86_64": [?25l [90m━━━━━━━━━━━━━━━━━━━━━━━━━━━━━━━━━━━━━━━━[0m [32m0.0/10.2 MB[0m [31m?[0m eta [36m-:--:--[0m
[2K [90m━━━━━━━━━━━━━━━━━━━━━━━━━━━━━━━━━━━━━━━━[0m [32m10.2/10.2 MB[0m [31m146.3 MB/s[0m [33m0:00:00[0m
Step #6 - "compile-libfuzzer-introspector-x86_64": [?25hDownloading imagesize-2.0.0-py2.py3-none-any.whl (9.4 kB)
Step #6 - "compile-libfuzzer-introspector-x86_64": Downloading importlib_metadata-9.0.0-py3-none-any.whl (27 kB)
Step #6 - "compile-libfuzzer-introspector-x86_64": Downloading jinja2-3.1.6-py3-none-any.whl (134 kB)
Step #6 - "compile-libfuzzer-introspector-x86_64": Downloading markupsafe-3.0.3-cp311-cp311-manylinux2014_x86_64.manylinux_2_17_x86_64.manylinux_2_28_x86_64.whl (22 kB)
Step #6 - "compile-libfuzzer-introspector-x86_64": Downloading platformdirs-4.10.0-py3-none-any.whl (22 kB)
Step #6 - "compile-libfuzzer-introspector-x86_64": Downloading pygments-2.20.0-py3-none-any.whl (1.2 MB)
Step #6 - "compile-libfuzzer-introspector-x86_64": [?25l [90m━━━━━━━━━━━━━━━━━━━━━━━━━━━━━━━━━━━━━━━━[0m [32m0.0/1.2 MB[0m [31m?[0m eta [36m-:--:--[0m
[2K [90m━━━━━━━━━━━━━━━━━━━━━━━━━━━━━━━━━━━━━━━━[0m [32m1.2/1.2 MB[0m [31m63.6 MB/s[0m [33m0:00:00[0m
Step #6 - "compile-libfuzzer-introspector-x86_64": [?25hDownloading requests-2.34.2-py3-none-any.whl (73 kB)
Step #6 - "compile-libfuzzer-introspector-x86_64": Downloading charset_normalizer-3.4.7-cp311-cp311-manylinux2014_x86_64.manylinux_2_17_x86_64.manylinux_2_28_x86_64.whl (214 kB)
Step #6 - "compile-libfuzzer-introspector-x86_64": Downloading idna-3.18-py3-none-any.whl (65 kB)
Step #6 - "compile-libfuzzer-introspector-x86_64": Downloading urllib3-2.7.0-py3-none-any.whl (131 kB)
Step #6 - "compile-libfuzzer-introspector-x86_64": Downloading certifi-2026.5.20-py3-none-any.whl (134 kB)
Step #6 - "compile-libfuzzer-introspector-x86_64": Downloading snowballstemmer-3.1.1-py3-none-any.whl (104 kB)
Step #6 - "compile-libfuzzer-introspector-x86_64": Downloading sphinxcontrib_htmlhelp-2.1.0-py3-none-any.whl (98 kB)
Step #6 - "compile-libfuzzer-introspector-x86_64": Downloading sphinxcontrib_serializinghtml-2.0.0-py3-none-any.whl (92 kB)
Step #6 - "compile-libfuzzer-introspector-x86_64": Downloading tomli-2.4.1-cp311-cp311-manylinux2014_x86_64.manylinux_2_17_x86_64.manylinux_2_28_x86_64.whl (243 kB)
Step #6 - "compile-libfuzzer-introspector-x86_64": Downloading zipp-4.1.0-py3-none-any.whl (10 kB)
Step #6 - "compile-libfuzzer-introspector-x86_64": Downloading configparser-7.2.0-py3-none-any.whl (17 kB)
Step #6 - "compile-libfuzzer-introspector-x86_64": Downloading coverage-7.14.1-cp311-cp311-manylinux1_x86_64.manylinux_2_28_x86_64.manylinux_2_5_x86_64.whl (252 kB)
Step #6 - "compile-libfuzzer-introspector-x86_64": Downloading flake8-7.3.0-py2.py3-none-any.whl (57 kB)
Step #6 - "compile-libfuzzer-introspector-x86_64": Downloading mccabe-0.7.0-py2.py3-none-any.whl (7.3 kB)
Step #6 - "compile-libfuzzer-introspector-x86_64": Downloading pycodestyle-2.14.0-py2.py3-none-any.whl (31 kB)
Step #6 - "compile-libfuzzer-introspector-x86_64": Downloading pyflakes-3.4.0-py2.py3-none-any.whl (63 kB)
Step #6 - "compile-libfuzzer-introspector-x86_64": Downloading mypy-2.1.0-cp311-cp311-manylinux2014_x86_64.manylinux_2_17_x86_64.manylinux_2_28_x86_64.whl (14.9 MB)
Step #6 - "compile-libfuzzer-introspector-x86_64": [?25l [90m━━━━━━━━━━━━━━━━━━━━━━━━━━━━━━━━━━━━━━━━[0m [32m0.0/14.9 MB[0m [31m?[0m eta [36m-:--:--[0m
[2K [90m━━━━━━━━━━━━━━━━━━━━━━━━━━━━━━━━━━━━━━━━[0m [32m14.9/14.9 MB[0m [31m155.3 MB/s[0m [33m0:00:00[0m
Step #6 - "compile-libfuzzer-introspector-x86_64": [?25hDownloading ast_serialize-0.5.0-cp39-abi3-manylinux_2_17_x86_64.manylinux2014_x86_64.whl (1.3 MB)
Step #6 - "compile-libfuzzer-introspector-x86_64": [?25l [90m━━━━━━━━━━━━━━━━━━━━━━━━━━━━━━━━━━━━━━━━[0m [32m0.0/1.3 MB[0m [31m?[0m eta [36m-:--:--[0m
[2K [90m━━━━━━━━━━━━━━━━━━━━━━━━━━━━━━━━━━━━━━━━[0m [32m1.3/1.3 MB[0m [31m79.0 MB/s[0m [33m0:00:00[0m
Step #6 - "compile-libfuzzer-introspector-x86_64": [?25hDownloading librt-0.11.0-cp311-cp311-manylinux2014_x86_64.manylinux_2_17_x86_64.manylinux_2_28_x86_64.whl (497 kB)
Step #6 - "compile-libfuzzer-introspector-x86_64": Downloading mypy_extensions-1.1.0-py3-none-any.whl (5.0 kB)
Step #6 - "compile-libfuzzer-introspector-x86_64": Downloading pathspec-1.1.1-py3-none-any.whl (57 kB)
Step #6 - "compile-libfuzzer-introspector-x86_64": Downloading networkx-3.6.1-py3-none-any.whl (2.1 MB)
Step #6 - "compile-libfuzzer-introspector-x86_64": [?25l [90m━━━━━━━━━━━━━━━━━━━━━━━━━━━━━━━━━━━━━━━━[0m [32m0.0/2.1 MB[0m [31m?[0m eta [36m-:--:--[0m
[2K [90m━━━━━━━━━━━━━━━━━━━━━━━━━━━━━━━━━━━━━━━━[0m [32m2.1/2.1 MB[0m [31m111.8 MB/s[0m [33m0:00:00[0m
Step #6 - "compile-libfuzzer-introspector-x86_64": [?25hDownloading pep8-1.7.1-py2.py3-none-any.whl (41 kB)
Step #6 - "compile-libfuzzer-introspector-x86_64": Downloading psutil-7.2.2-cp36-abi3-manylinux2010_x86_64.manylinux_2_12_x86_64.manylinux_2_28_x86_64.whl (155 kB)
Step #6 - "compile-libfuzzer-introspector-x86_64": Downloading pytest-9.1.0-py3-none-any.whl (386 kB)
Step #6 - "compile-libfuzzer-introspector-x86_64": Downloading pluggy-1.6.0-py3-none-any.whl (20 kB)
Step #6 - "compile-libfuzzer-introspector-x86_64": Downloading iniconfig-2.3.0-py3-none-any.whl (7.5 kB)
Step #6 - "compile-libfuzzer-introspector-x86_64": Downloading sphinx_rtd_theme-3.1.0-py2.py3-none-any.whl (7.7 MB)
Step #6 - "compile-libfuzzer-introspector-x86_64": [?25l [90m━━━━━━━━━━━━━━━━━━━━━━━━━━━━━━━━━━━━━━━━[0m [32m0.0/7.7 MB[0m [31m?[0m eta [36m-:--:--[0m
[2K [90m━━━━━━━━━━━━━━━━━━━━━━━━━━━━━━━━━━━━━━━━[0m [32m7.7/7.7 MB[0m [31m142.9 MB/s[0m [33m0:00:00[0m
Step #6 - "compile-libfuzzer-introspector-x86_64": [?25hDownloading sphinxcontrib_jquery-4.1-py2.py3-none-any.whl (121 kB)
Step #6 - "compile-libfuzzer-introspector-x86_64": Downloading sphinxcontrib_applehelp-2.0.0-py3-none-any.whl (119 kB)
Step #6 - "compile-libfuzzer-introspector-x86_64": Downloading sphinxcontrib_devhelp-2.0.0-py3-none-any.whl (82 kB)
Step #6 - "compile-libfuzzer-introspector-x86_64": Downloading sphinxcontrib_jsmath-1.0.1-py2.py3-none-any.whl (5.1 kB)
Step #6 - "compile-libfuzzer-introspector-x86_64": Downloading sphinxcontrib_qthelp-2.0.0-py3-none-any.whl (88 kB)
Step #6 - "compile-libfuzzer-introspector-x86_64": Downloading toml-0.10.2-py2.py3-none-any.whl (16 kB)
Step #6 - "compile-libfuzzer-introspector-x86_64": Downloading tqdm-4.68.2-py3-none-any.whl (78 kB)
Step #6 - "compile-libfuzzer-introspector-x86_64": Building wheels for collected packages: fuzz-introspector
Step #6 - "compile-libfuzzer-introspector-x86_64": Building editable for fuzz-introspector (pyproject.toml) ... [?25l- \ | done
Step #6 - "compile-libfuzzer-introspector-x86_64": [?25h Created wheel for fuzz-introspector: filename=fuzz_introspector-0.1.10-0.editable-py3-none-any.whl size=3905 sha256=5a8725d76ab21569d0a92101d8fc08ba70eab9827e48689f91a688be37206ffb
Step #6 - "compile-libfuzzer-introspector-x86_64": Stored in directory: /tmp/pip-ephem-wheel-cache-alsh0yeu/wheels/44/ee/b6/7a2a30503e5336c67773d206f572139af7f7e84341b0b70950
Step #6 - "compile-libfuzzer-introspector-x86_64": Successfully built fuzz-introspector
Step #6 - "compile-libfuzzer-introspector-x86_64": Installing collected packages: pep8, zipp, urllib3, tree-sitter-rust, tree-sitter-python, tree-sitter-java, tree-sitter-go, tree-sitter-cpp, tree-sitter, tqdm, tomli, toml, sphinxcontrib-serializinghtml, sphinxcontrib-qthelp, sphinxcontrib-jsmath, sphinxcontrib-htmlhelp, sphinxcontrib-devhelp, sphinxcontrib-applehelp, soupsieve, snowballstemmer, PyYAML, Pygments, pyflakes, pycodestyle, psutil, pluggy, platformdirs, pathspec, numpy, networkx, mypy_extensions, mccabe, MarkupSafe, lxml, librt, iniconfig, imagesize, idna, docutils, coverage, configparser, charset_normalizer, certifi, babel, ast-serialize, alabaster, tree-sitter-languages, requests, pytest, mypy, Jinja2, importlib-metadata, flake8, beautifulsoup4, yapf, sphinx, matplotlib, sphinxcontrib-jquery, sphinx_rtd_theme, fuzz-introspector
Step #6 - "compile-libfuzzer-introspector-x86_64": [?25l
[2K [91m━━━[0m[90m╺[0m[90m━━━━━━━━━━━━━━━━━━━━━━━━━━━━━━━━━━━━[0m [32m 5/60[0m [tree-sitter-java]
[2K [91m━━━━━━━[0m[91m╸[0m[90m━━━━━━━━━━━━━━━━━━━━━━━━━━━━━━━[0m [32m12/60[0m [sphinxcontrib-serializinghtml]
[2K Attempting uninstall: soupsieve
Step #6 - "compile-libfuzzer-introspector-x86_64": [91m━━━━━━━[0m[91m╸[0m[90m━━━━━━━━━━━━━━━━━━━━━━━━━━━━━━━[0m [32m12/60[0m [sphinxcontrib-serializinghtml]
[2K [91m━━━━━━━━━━━━[0m[90m╺[0m[90m━━━━━━━━━━━━━━━━━━━━━━━━━━━[0m [32m18/60[0m [soupsieve]
[2K Found existing installation: soupsieve 2.8.4
Step #6 - "compile-libfuzzer-introspector-x86_64": [91m━━━━━━━━━━━━[0m[90m╺[0m[90m━━━━━━━━━━━━━━━━━━━━━━━━━━━[0m [32m18/60[0m [soupsieve]
[2K Uninstalling soupsieve-2.8.4:
Step #6 - "compile-libfuzzer-introspector-x86_64": [91m━━━━━━━━━━━━[0m[90m╺[0m[90m━━━━━━━━━━━━━━━━━━━━━━━━━━━[0m [32m18/60[0m [soupsieve]
[2K Successfully uninstalled soupsieve-2.8.4
Step #6 - "compile-libfuzzer-introspector-x86_64": [91m━━━━━━━━━━━━[0m[90m╺[0m[90m━━━━━━━━━━━━━━━━━━━━━━━━━━━[0m [32m18/60[0m [soupsieve]
[2K [91m━━━━━━━━━━━━[0m[91m╸[0m[90m━━━━━━━━━━━━━━━━━━━━━━━━━━━[0m [32m19/60[0m [snowballstemmer]
[2K Attempting uninstall: PyYAML
Step #6 - "compile-libfuzzer-introspector-x86_64": [91m━━━━━━━━━━━━[0m[91m╸[0m[90m━━━━━━━━━━━━━━━━━━━━━━━━━━━[0m [32m19/60[0m [snowballstemmer]
[2K Found existing installation: PyYAML 6.0.3
Step #6 - "compile-libfuzzer-introspector-x86_64": [91m━━━━━━━━━━━━[0m[91m╸[0m[90m━━━━━━━━━━━━━━━━━━━━━━━━━━━[0m [32m19/60[0m [snowballstemmer]
[2K Uninstalling PyYAML-6.0.3:
Step #6 - "compile-libfuzzer-introspector-x86_64": [91m━━━━━━━━━━━━[0m[91m╸[0m[90m━━━━━━━━━━━━━━━━━━━━━━━━━━━[0m [32m19/60[0m [snowballstemmer]
[2K Successfully uninstalled PyYAML-6.0.3
Step #6 - "compile-libfuzzer-introspector-x86_64": [91m━━━━━━━━━━━━[0m[91m╸[0m[90m━━━━━━━━━━━━━━━━━━━━━━━━━━━[0m [32m19/60[0m [snowballstemmer]
[2K [91m━━━━━━━━━━━━━[0m[90m╺[0m[90m━━━━━━━━━━━━━━━━━━━━━━━━━━[0m [32m20/60[0m [PyYAML]
[2K [91m━━━━━━━━━━━━━━[0m[90m╺[0m[90m━━━━━━━━━━━━━━━━━━━━━━━━━[0m [32m21/60[0m [Pygments]
[2K [91m━━━━━━━━━━━━━━[0m[90m╺[0m[90m━━━━━━━━━━━━━━━━━━━━━━━━━[0m [32m21/60[0m [Pygments]
[2K [91m━━━━━━━━━━━━━━[0m[90m╺[0m[90m━━━━━━━━━━━━━━━━━━━━━━━━━[0m [32m21/60[0m [Pygments]
[2K [91m━━━━━━━━━━━━━━[0m[90m╺[0m[90m━━━━━━━━━━━━━━━━━━━━━━━━━[0m [32m21/60[0m [Pygments]
[2K [91m━━━━━━━━━━━━━━[0m[90m╺[0m[90m━━━━━━━━━━━━━━━━━━━━━━━━━[0m [32m21/60[0m [Pygments]
[2K [91m━━━━━━━━━━━━━━━━[0m[90m╺[0m[90m━━━━━━━━━━━━━━━━━━━━━━━[0m [32m24/60[0m [psutil]
[2K [91m━━━━━━━━━━━━━━━━━━[0m[90m╺[0m[90m━━━━━━━━━━━━━━━━━━━━━[0m [32m27/60[0m [pathspec]
[2K Attempting uninstall: numpy
Step #6 - "compile-libfuzzer-introspector-x86_64": [91m━━━━━━━━━━━━━━━━━━[0m[90m╺[0m[90m━━━━━━━━━━━━━━━━━━━━━[0m [32m27/60[0m [pathspec]
[2K Found existing installation: numpy 2.4.6
Step #6 - "compile-libfuzzer-introspector-x86_64": [91m━━━━━━━━━━━━━━━━━━[0m[90m╺[0m[90m━━━━━━━━━━━━━━━━━━━━━[0m [32m27/60[0m [pathspec]
[2K Uninstalling numpy-2.4.6:
Step #6 - "compile-libfuzzer-introspector-x86_64": [91m━━━━━━━━━━━━━━━━━━[0m[90m╺[0m[90m━━━━━━━━━━━━━━━━━━━━━[0m [32m27/60[0m [pathspec]
[2K Successfully uninstalled numpy-2.4.6
Step #6 - "compile-libfuzzer-introspector-x86_64": [91m━━━━━━━━━━━━━━━━━━[0m[90m╺[0m[90m━━━━━━━━━━━━━━━━━━━━━[0m [32m27/60[0m [pathspec]
[2K [91m━━━━━━━━━━━━━━━━━━[0m[91m╸[0m[90m━━━━━━━━━━━━━━━━━━━━━[0m [32m28/60[0m [numpy]
[2K [91m━━━━━━━━━━━━━━━━━━[0m[91m╸[0m[90m━━━━━━━━━━━━━━━━━━━━━[0m [32m28/60[0m [numpy]
[2K [91m━━━━━━━━━━━━━━━━━━[0m[91m╸[0m[90m━━━━━━━━━━━━━━━━━━━━━[0m [32m28/60[0m [numpy]
[2K [91m━━━━━━━━━━━━━━━━━━[0m[91m╸[0m[90m━━━━━━━━━━━━━━━━━━━━━[0m [32m28/60[0m [numpy]
[2K [91m━━━━━━━━━━━━━━━━━━[0m[91m╸[0m[90m━━━━━━━━━━━━━━━━━━━━━[0m [32m28/60[0m [numpy]
[2K [91m━━━━━━━━━━━━━━━━━━[0m[91m╸[0m[90m━━━━━━━━━━━━━━━━━━━━━[0m [32m28/60[0m [numpy]
[2K [91m━━━━━━━━━━━━━━━━━━[0m[91m╸[0m[90m━━━━━━━━━━━━━━━━━━━━━[0m [32m28/60[0m [numpy]
[2K [91m━━━━━━━━━━━━━━━━━━[0m[91m╸[0m[90m━━━━━━━━━━━━━━━━━━━━━[0m [32m28/60[0m [numpy]
[2K [91m━━━━━━━━━━━━━━━━━━[0m[91m╸[0m[90m━━━━━━━━━━━━━━━━━━━━━[0m [32m28/60[0m [numpy]
[2K [91m━━━━━━━━━━━━━━━━━━[0m[91m╸[0m[90m━━━━━━━━━━━━━━━━━━━━━[0m [32m28/60[0m [numpy]
[2K [91m━━━━━━━━━━━━━━━━━━[0m[91m╸[0m[90m━━━━━━━━━━━━━━━━━━━━━[0m [32m28/60[0m [numpy]
[2K [91m━━━━━━━━━━━━━━━━━━[0m[91m╸[0m[90m━━━━━━━━━━━━━━━━━━━━━[0m [32m28/60[0m [numpy]
[2K [91m━━━━━━━━━━━━━━━━━━[0m[91m╸[0m[90m━━━━━━━━━━━━━━━━━━━━━[0m [32m28/60[0m [numpy]
[2K [91m━━━━━━━━━━━━━━━━━━[0m[91m╸[0m[90m━━━━━━━━━━━━━━━━━━━━━[0m [32m28/60[0m [numpy]
[2K [91m━━━━━━━━━━━━━━━━━━[0m[91m╸[0m[90m━━━━━━━━━━━━━━━━━━━━━[0m [32m28/60[0m [numpy]
[2K [91m━━━━━━━━━━━━━━━━━━━[0m[90m╺[0m[90m━━━━━━━━━━━━━━━━━━━━[0m [32m29/60[0m [networkx]
[2K [91m━━━━━━━━━━━━━━━━━━━[0m[90m╺[0m[90m━━━━━━━━━━━━━━━━━━━━[0m [32m29/60[0m [networkx]
[2K [91m━━━━━━━━━━━━━━━━━━━[0m[90m╺[0m[90m━━━━━━━━━━━━━━━━━━━━[0m [32m29/60[0m [networkx]
[2K [91m━━━━━━━━━━━━━━━━━━━[0m[90m╺[0m[90m━━━━━━━━━━━━━━━━━━━━[0m [32m29/60[0m [networkx]
[2K [91m━━━━━━━━━━━━━━━━━━━[0m[90m╺[0m[90m━━━━━━━━━━━━━━━━━━━━[0m [32m29/60[0m [networkx]
[2K [91m━━━━━━━━━━━━━━━━━━━[0m[90m╺[0m[90m━━━━━━━━━━━━━━━━━━━━[0m [32m29/60[0m [networkx]
[2K [91m━━━━━━━━━━━━━━━━━━━[0m[90m╺[0m[90m━━━━━━━━━━━━━━━━━━━━[0m [32m29/60[0m [networkx]
[2K [91m━━━━━━━━━━━━━━━━━━━[0m[90m╺[0m[90m━━━━━━━━━━━━━━━━━━━━[0m [32m29/60[0m [networkx]
[2K [91m━━━━━━━━━━━━━━━━━━━[0m[90m╺[0m[90m━━━━━━━━━━━━━━━━━━━━[0m [32m29/60[0m [networkx]
[2K Attempting uninstall: lxml
Step #6 - "compile-libfuzzer-introspector-x86_64": [91m━━━━━━━━━━━━━━━━━━━[0m[90m╺[0m[90m━━━━━━━━━━━━━━━━━━━━[0m [32m29/60[0m [networkx]
[2K Found existing installation: lxml 6.1.1
Step #6 - "compile-libfuzzer-introspector-x86_64": [91m━━━━━━━━━━━━━━━━━━━[0m[90m╺[0m[90m━━━━━━━━━━━━━━━━━━━━[0m [32m29/60[0m [networkx]
[2K Uninstalling lxml-6.1.1:
Step #6 - "compile-libfuzzer-introspector-x86_64": [91m━━━━━━━━━━━━━━━━━━━[0m[90m╺[0m[90m━━━━━━━━━━━━━━━━━━━━[0m [32m29/60[0m [networkx]
[2K Successfully uninstalled lxml-6.1.1
Step #6 - "compile-libfuzzer-introspector-x86_64": [91m━━━━━━━━━━━━━━━━━━━[0m[90m╺[0m[90m━━━━━━━━━━━━━━━━━━━━[0m [32m29/60[0m [networkx]
[2K [91m━━━━━━━━━━━━━━━━━━━━━━[0m[90m╺[0m[90m━━━━━━━━━━━━━━━━━[0m [32m33/60[0m [lxml]
[2K [91m━━━━━━━━━━━━━━━━━━━━━━[0m[90m╺[0m[90m━━━━━━━━━━━━━━━━━[0m [32m33/60[0m [lxml]
[2K [91m━━━━━━━━━━━━━━━━━━━━━━━━━[0m[90m╺[0m[90m━━━━━━━━━━━━━━[0m [32m38/60[0m [docutils]
[2K [91m━━━━━━━━━━━━━━━━━━━━━━━━━[0m[90m╺[0m[90m━━━━━━━━━━━━━━[0m [32m38/60[0m [docutils]
[2K [91m━━━━━━━━━━━━━━━━━━━━━━━━━━[0m[90m╺[0m[90m━━━━━━━━━━━━━[0m [32m39/60[0m [coverage]
[2K [91m━━━━━━━━━━━━━━━━━━━━━━━━━━━[0m[90m╺[0m[90m━━━━━━━━━━━━[0m [32m41/60[0m [charset_normalizer]
[2K [91m━━━━━━━━━━━━━━━━━━━━━━━━━━━━[0m[91m╸[0m[90m━━━━━━━━━━━[0m [32m43/60[0m [babel]
[2K [91m━━━━━━━━━━━━━━━━━━━━━━━━━━━━[0m[91m╸[0m[90m━━━━━━━━━━━[0m [32m43/60[0m [babel]
[2K [91m━━━━━━━━━━━━━━━━━━━━━━━━━━━━[0m[91m╸[0m[90m━━━━━━━━━━━[0m [32m43/60[0m [babel]
[2K [91m━━━━━━━━━━━━━━━━━━━━━━━━━━━━━━[0m[91m╸[0m[90m━━━━━━━━━[0m [32m46/60[0m [tree-sitter-languages]
[2K [91m━━━━━━━━━━━━━━━━━━━━━━━━━━━━━━[0m[91m╸[0m[90m━━━━━━━━━[0m [32m46/60[0m [tree-sitter-languages]
[2K [91m━━━━━━━━━━━━━━━━━━━━━━━━━━━━━━━━[0m[90m╺[0m[90m━━━━━━━[0m [32m48/60[0m [pytest]
[2K [91m━━━━━━━━━━━━━━━━━━━━━━━━━━━━━━━━[0m[90m╺[0m[90m━━━━━━━[0m [32m48/60[0m [pytest]
[2K [91m━━━━━━━━━━━━━━━━━━━━━━━━━━━━━━━━[0m[91m╸[0m[90m━━━━━━━[0m [32m49/60[0m [mypy]
[2K [91m━━━━━━━━━━━━━━━━━━━━━━━━━━━━━━━━[0m[91m╸[0m[90m━━━━━━━[0m [32m49/60[0m [mypy]
[2K [91m━━━━━━━━━━━━━━━━━━━━━━━━━━━━━━━━[0m[91m╸[0m[90m━━━━━━━[0m [32m49/60[0m [mypy]
[2K [91m━━━━━━━━━━━━━━━━━━━━━━━━━━━━━━━━[0m[91m╸[0m[90m━━━━━━━[0m [32m49/60[0m [mypy]
[2K [91m━━━━━━━━━━━━━━━━━━━━━━━━━━━━━━━━[0m[91m╸[0m[90m━━━━━━━[0m [32m49/60[0m [mypy]
[2K [91m━━━━━━━━━━━━━━━━━━━━━━━━━━━━━━━━[0m[91m╸[0m[90m━━━━━━━[0m [32m49/60[0m [mypy]
[2K [91m━━━━━━━━━━━━━━━━━━━━━━━━━━━━━━━━[0m[91m╸[0m[90m━━━━━━━[0m [32m49/60[0m [mypy]
[2K [91m━━━━━━━━━━━━━━━━━━━━━━━━━━━━━━━━[0m[91m╸[0m[90m━━━━━━━[0m [32m49/60[0m [mypy]
[2K [91m━━━━━━━━━━━━━━━━━━━━━━━━━━━━━━━━[0m[91m╸[0m[90m━━━━━━━[0m [32m49/60[0m [mypy]
[2K [91m━━━━━━━━━━━━━━━━━━━━━━━━━━━━━━━━[0m[91m╸[0m[90m━━━━━━━[0m [32m49/60[0m [mypy]
[2K [91m━━━━━━━━━━━━━━━━━━━━━━━━━━━━━━━━[0m[91m╸[0m[90m━━━━━━━[0m [32m49/60[0m [mypy]
[2K [91m━━━━━━━━━━━━━━━━━━━━━━━━━━━━━━━━[0m[91m╸[0m[90m━━━━━━━[0m [32m49/60[0m [mypy]
[2K [91m━━━━━━━━━━━━━━━━━━━━━━━━━━━━━━━━━[0m[90m╺[0m[90m━━━━━━[0m [32m50/60[0m [Jinja2]
[2K Attempting uninstall: beautifulsoup4
Step #6 - "compile-libfuzzer-introspector-x86_64": [91m━━━━━━━━━━━━━━━━━━━━━━━━━━━━━━━━━[0m[90m╺[0m[90m━━━━━━[0m [32m50/60[0m [Jinja2]
[2K Found existing installation: beautifulsoup4 4.15.0
Step #6 - "compile-libfuzzer-introspector-x86_64": [91m━━━━━━━━━━━━━━━━━━━━━━━━━━━━━━━━━[0m[90m╺[0m[90m━━━━━━[0m [32m50/60[0m [Jinja2]
[2K Uninstalling beautifulsoup4-4.15.0:
Step #6 - "compile-libfuzzer-introspector-x86_64": [91m━━━━━━━━━━━━━━━━━━━━━━━━━━━━━━━━━[0m[90m╺[0m[90m━━━━━━[0m [32m50/60[0m [Jinja2]
[2K Successfully uninstalled beautifulsoup4-4.15.0
Step #6 - "compile-libfuzzer-introspector-x86_64": [91m━━━━━━━━━━━━━━━━━━━━━━━━━━━━━━━━━[0m[90m╺[0m[90m━━━━━━[0m [32m50/60[0m [Jinja2]
[2K [91m━━━━━━━━━━━━━━━━━━━━━━━━━━━━━━━━━━━[0m[90m╺[0m[90m━━━━[0m [32m53/60[0m [beautifulsoup4]
[2K [91m━━━━━━━━━━━━━━━━━━━━━━━━━━━━━━━━━━━━[0m[90m╺[0m[90m━━━[0m [32m54/60[0m [yapf]
[2K [91m━━━━━━━━━━━━━━━━━━━━━━━━━━━━━━━━━━━━[0m[91m╸[0m[90m━━━[0m [32m55/60[0m [sphinx]
[2K [91m━━━━━━━━━━━━━━━━━━━━━━━━━━━━━━━━━━━━[0m[91m╸[0m[90m━━━[0m [32m55/60[0m [sphinx]
[2K [91m━━━━━━━━━━━━━━━━━━━━━━━━━━━━━━━━━━━━[0m[91m╸[0m[90m━━━[0m [32m55/60[0m [sphinx]
[2K [91m━━━━━━━━━━━━━━━━━━━━━━━━━━━━━━━━━━━━[0m[91m╸[0m[90m━━━[0m [32m55/60[0m [sphinx]
[2K Attempting uninstall: matplotlib
Step #6 - "compile-libfuzzer-introspector-x86_64": [91m━━━━━━━━━━━━━━━━━━━━━━━━━━━━━━━━━━━━[0m[91m╸[0m[90m━━━[0m [32m55/60[0m [sphinx]
[2K Found existing installation: matplotlib 3.11.0
Step #6 - "compile-libfuzzer-introspector-x86_64": [91m━━━━━━━━━━━━━━━━━━━━━━━━━━━━━━━━━━━━[0m[91m╸[0m[90m━━━[0m [32m55/60[0m [sphinx]
[2K [91m━━━━━━━━━━━━━━━━━━━━━━━━━━━━━━━━━━━━━[0m[90m╺[0m[90m━━[0m [32m56/60[0m [matplotlib]
[2K Uninstalling matplotlib-3.11.0:
Step #6 - "compile-libfuzzer-introspector-x86_64": [91m━━━━━━━━━━━━━━━━━━━━━━━━━━━━━━━━━━━━━[0m[90m╺[0m[90m━━[0m [32m56/60[0m [matplotlib]
[2K Successfully uninstalled matplotlib-3.11.0
Step #6 - "compile-libfuzzer-introspector-x86_64": [91m━━━━━━━━━━━━━━━━━━━━━━━━━━━━━━━━━━━━━[0m[90m╺[0m[90m━━[0m [32m56/60[0m [matplotlib]
[2K [91m━━━━━━━━━━━━━━━━━━━━━━━━━━━━━━━━━━━━━[0m[90m╺[0m[90m━━[0m [32m56/60[0m [matplotlib]
[2K [91m━━━━━━━━━━━━━━━━━━━━━━━━━━━━━━━━━━━━━[0m[90m╺[0m[90m━━[0m [32m56/60[0m [matplotlib]
[2K [91m━━━━━━━━━━━━━━━━━━━━━━━━━━━━━━━━━━━━━[0m[90m╺[0m[90m━━[0m [32m56/60[0m [matplotlib]
[2K [91m━━━━━━━━━━━━━━━━━━━━━━━━━━━━━━━━━━━━━[0m[90m╺[0m[90m━━[0m [32m56/60[0m [matplotlib]
[2K [91m━━━━━━━━━━━━━━━━━━━━━━━━━━━━━━━━━━━━━[0m[90m╺[0m[90m━━[0m [32m56/60[0m [matplotlib]
[2K [91m━━━━━━━━━━━━━━━━━━━━━━━━━━━━━━━━━━━━━[0m[90m╺[0m[90m━━[0m [32m56/60[0m [matplotlib]
[2K [91m━━━━━━━━━━━━━━━━━━━━━━━━━━━━━━━━━━━━━[0m[90m╺[0m[90m━━[0m [32m56/60[0m [matplotlib]
[2K [91m━━━━━━━━━━━━━━━━━━━━━━━━━━━━━━━━━━━━━[0m[90m╺[0m[90m━━[0m [32m56/60[0m [matplotlib]
[2K [91m━━━━━━━━━━━━━━━━━━━━━━━━━━━━━━━━━━━━━[0m[90m╺[0m[90m━━[0m [32m56/60[0m [matplotlib]
[2K [91m━━━━━━━━━━━━━━━━━━━━━━━━━━━━━━━━━━━━━[0m[90m╺[0m[90m━━[0m [32m56/60[0m [matplotlib]
[2K [91m━━━━━━━━━━━━━━━━━━━━━━━━━━━━━━━━━━━━━[0m[90m╺[0m[90m━━[0m [32m56/60[0m [matplotlib]
[2K [91m━━━━━━━━━━━━━━━━━━━━━━━━━━━━━━━━━━━━━[0m[90m╺[0m[90m━━[0m [32m56/60[0m [matplotlib]
[2K [90m━━━━━━━━━━━━━━━━━━━━━━━━━━━━━━━━━━━━━━━━[0m [32m60/60[0m [fuzz-introspector]
Step #6 - "compile-libfuzzer-introspector-x86_64": [?25h
[1A[2KSuccessfully installed Jinja2-3.1.6 MarkupSafe-3.0.3 PyYAML-6.0.2 Pygments-2.20.0 alabaster-0.7.16 ast-serialize-0.5.0 babel-2.18.0 beautifulsoup4-4.10.0 certifi-2026.5.20 charset_normalizer-3.4.7 configparser-7.2.0 coverage-7.14.1 docutils-0.19 flake8-7.3.0 fuzz-introspector-0.1.10 idna-3.18 imagesize-2.0.0 importlib-metadata-9.0.0 iniconfig-2.3.0 librt-0.11.0 lxml-5.3.0 matplotlib-3.10.0 mccabe-0.7.0 mypy-2.1.0 mypy_extensions-1.1.0 networkx-3.6.1 numpy-2.1.0 pathspec-1.1.1 pep8-1.7.1 platformdirs-4.10.0 pluggy-1.6.0 psutil-7.2.2 pycodestyle-2.14.0 pyflakes-3.4.0 pytest-9.1.0 requests-2.34.2 snowballstemmer-3.1.1 soupsieve-2.2.1 sphinx-6.0.0 sphinx_rtd_theme-3.1.0 sphinxcontrib-applehelp-2.0.0 sphinxcontrib-devhelp-2.0.0 sphinxcontrib-htmlhelp-2.1.0 sphinxcontrib-jquery-4.1 sphinxcontrib-jsmath-1.0.1 sphinxcontrib-qthelp-2.0.0 sphinxcontrib-serializinghtml-2.0.0 toml-0.10.2 tomli-2.4.1 tqdm-4.68.2 tree-sitter-0.23.2 tree-sitter-cpp-0.23.4 tree-sitter-go-0.23.4 tree-sitter-java-0.23.5 tree-sitter-languages-1.10.2 tree-sitter-python-0.23.6 tree-sitter-rust-0.23.2 urllib3-2.7.0 yapf-0.40.1 zipp-4.1.0
Step #6 - "compile-libfuzzer-introspector-x86_64": [33mWARNING: Running pip as the 'root' user can result in broken permissions and conflicting behaviour with the system package manager, possibly rendering your system unusable. It is recommended to use a virtual environment instead: https://pip.pypa.io/warnings/venv. Use the --root-user-action option if you know what you are doing and want to suppress this warning.[0m[33m
Step #6 - "compile-libfuzzer-introspector-x86_64": [0m/src
Step #6 - "compile-libfuzzer-introspector-x86_64": 2026-06-15 10:06:53.863 INFO cli - main: Running fuzz introspector post-processing
Step #6 - "compile-libfuzzer-introspector-x86_64": 2026-06-15 10:06:53.999 INFO analysis - extract_tests_from_directories: All test files
Step #6 - "compile-libfuzzer-introspector-x86_64": 2026-06-15 10:06:53.999 INFO analysis - extract_tests_from_directories: /src/snappy/snappy-test.cc
Step #6 - "compile-libfuzzer-introspector-x86_64": 2026-06-15 10:06:54.000 INFO analysis - extract_tests_from_directories: /src/snappy/snappy_unittest.cc
Step #6 - "compile-libfuzzer-introspector-x86_64": 2026-06-15 10:06:54.000 INFO analysis - extract_tests_from_directories: /src/snappy/snappy_test_tool.cc
Step #6 - "compile-libfuzzer-introspector-x86_64": 2026-06-15 10:06:54.000 INFO analysis - extract_tests_from_directories: /src/snappy/snappy_test_data.cc
Step #6 - "compile-libfuzzer-introspector-x86_64": 2026-06-15 10:06:54.038 INFO cli - main: Ending fuzz introspector post-processing
Step #6 - "compile-libfuzzer-introspector-x86_64": 2026-06-15 10:06:54.251 INFO cli - main: Running fuzz introspector post-processing
Step #6 - "compile-libfuzzer-introspector-x86_64": 2026-06-15 10:06:54.265 INFO oss_fuzz - analyse_folder: Found 276 files to include in analysis
Step #6 - "compile-libfuzzer-introspector-x86_64": 2026-06-15 10:06:54.265 INFO oss_fuzz - analyse_folder: Going C/C++ route
Step #6 - "compile-libfuzzer-introspector-x86_64": 2026-06-15 10:06:54.265 INFO oss_fuzz - analyse_folder: Loading tree-sitter trees
Step #6 - "compile-libfuzzer-introspector-x86_64": 2026-06-15 10:06:54.307 INFO frontend_c_cpp - load_treesitter_trees: harness: /src/snappy/snappy_uncompress_fuzzer.cc
Step #6 - "compile-libfuzzer-introspector-x86_64": 2026-06-15 10:06:57.291 INFO frontend_c_cpp - load_treesitter_trees: harness: /src/snappy/snappy_compress_fuzzer.cc
Step #6 - "compile-libfuzzer-introspector-x86_64": 2026-06-15 10:20:39.138 INFO oss_fuzz - analyse_folder: Dump methods for snappy_uncompress_fuzzer
Step #6 - "compile-libfuzzer-introspector-x86_64": 2026-06-15 10:20:39.138 INFO datatypes - dump_module_logic: Generating report
Step #6 - "compile-libfuzzer-introspector-x86_64": 2026-06-15 11:26:01.260 INFO datatypes - dump_module_logic: Report generated
Step #6 - "compile-libfuzzer-introspector-x86_64": 2026-06-15 11:26:02.877 INFO datatypes - dump_module_logic: Dumping project-wide logic.
Step #6 - "compile-libfuzzer-introspector-x86_64": 2026-06-15 11:26:02.878 INFO datatypes - dump_module_logic: Using safe yaml safe C dumper.
Step #6 - "compile-libfuzzer-introspector-x86_64": 2026-06-15 11:26:18.001 INFO datatypes - dump_module_logic: Dumped
Step #6 - "compile-libfuzzer-introspector-x86_64": 2026-06-15 11:26:18.042 INFO oss_fuzz - analyse_folder: Extracting calltree for snappy_uncompress_fuzzer
Step #6 - "compile-libfuzzer-introspector-x86_64": 2026-06-15 11:26:18.320 INFO oss_fuzz - analyse_folder: Calltree extracted
Step #6 - "compile-libfuzzer-introspector-x86_64": 2026-06-15 11:26:18.321 INFO datatypes - dump_type_definition: Dumping custom type definitions.
Step #6 - "compile-libfuzzer-introspector-x86_64": 2026-06-15 11:26:18.334 INFO datatypes - dump_type_definition: Custom type definitions dumping completed.
Step #6 - "compile-libfuzzer-introspector-x86_64": 2026-06-15 11:26:18.334 INFO datatypes - dump_macro_block_info: Dumping macro blocks information.
Step #6 - "compile-libfuzzer-introspector-x86_64": 2026-06-15 11:26:18.355 INFO datatypes - dump_macro_block_info: Macro blocks information dumping completed.
Step #6 - "compile-libfuzzer-introspector-x86_64": 2026-06-15 11:26:18.355 INFO oss_fuzz - analyse_folder: Dump methods for snappy_compress_fuzzer
Step #6 - "compile-libfuzzer-introspector-x86_64": 2026-06-15 11:26:18.355 INFO datatypes - dump_module_logic: Generating report
Step #6 - "compile-libfuzzer-introspector-x86_64": 2026-06-15 11:26:19.562 INFO datatypes - dump_module_logic: Report generated
Step #6 - "compile-libfuzzer-introspector-x86_64": 2026-06-15 11:26:20.798 INFO datatypes - dump_module_logic: Dumping project-wide logic.
Step #6 - "compile-libfuzzer-introspector-x86_64": 2026-06-15 11:26:20.798 INFO datatypes - dump_module_logic: Using safe yaml safe C dumper.
Step #6 - "compile-libfuzzer-introspector-x86_64": 2026-06-15 11:26:35.961 INFO datatypes - dump_module_logic: Dumped
Step #6 - "compile-libfuzzer-introspector-x86_64": 2026-06-15 11:26:36.007 INFO oss_fuzz - analyse_folder: Extracting calltree for snappy_compress_fuzzer
Step #6 - "compile-libfuzzer-introspector-x86_64": 2026-06-15 11:26:36.948 INFO oss_fuzz - analyse_folder: Calltree extracted
Step #6 - "compile-libfuzzer-introspector-x86_64": 2026-06-15 11:26:36.949 INFO datatypes - dump_type_definition: Dumping custom type definitions.
Step #6 - "compile-libfuzzer-introspector-x86_64": 2026-06-15 11:26:36.966 INFO datatypes - dump_type_definition: Custom type definitions dumping completed.
Step #6 - "compile-libfuzzer-introspector-x86_64": 2026-06-15 11:26:36.966 INFO datatypes - dump_macro_block_info: Dumping macro blocks information.
Step #6 - "compile-libfuzzer-introspector-x86_64": 2026-06-15 11:26:36.993 INFO datatypes - dump_macro_block_info: Macro blocks information dumping completed.
Step #6 - "compile-libfuzzer-introspector-x86_64": 2026-06-15 11:26:36.993 INFO commands - analyse_end_to_end: No harness list at place
Step #6 - "compile-libfuzzer-introspector-x86_64": 2026-06-15 11:26:36.993 INFO commands - run_analysis_on_dir: Running analysis
Step #6 - "compile-libfuzzer-introspector-x86_64": 2026-06-15 11:26:37.032 INFO analysis - load_data_files: Loading profiles using files
Step #6 - "compile-libfuzzer-introspector-x86_64": 2026-06-15 11:26:37.032 INFO data_loader - load_all_profiles: Loading profiles from /src/inspector
Step #6 - "compile-libfuzzer-introspector-x86_64": 2026-06-15 11:26:37.033 INFO data_loader - load_all_profiles: []
Step #6 - "compile-libfuzzer-introspector-x86_64": 2026-06-15 11:26:37.033 INFO data_loader - load_all_profiles: - found 2 profiles to load
Step #6 - "compile-libfuzzer-introspector-x86_64": 2026-06-15 11:26:37.070 INFO data_loader - read_fuzzer_data_file_to_profile: - loading /src/inspector/fuzzerLogFile-snappy_compress_fuzzer.data
Step #6 - "compile-libfuzzer-introspector-x86_64": 2026-06-15 11:26:37.071 INFO data_loader - read_fuzzer_data_file_to_profile: target data f: /src/inspector/fuzzerLogFile-snappy_compress_fuzzer.data
Step #6 - "compile-libfuzzer-introspector-x86_64": 2026-06-15 11:26:37.071 INFO utils - data_file_read_yaml: Set base loader to use CSafeLoader
Step #6 - "compile-libfuzzer-introspector-x86_64": 2026-06-15 11:26:37.074 INFO data_loader - read_fuzzer_data_file_to_profile: - loading /src/inspector/fuzzerLogFile-snappy_uncompress_fuzzer.data
Step #6 - "compile-libfuzzer-introspector-x86_64": 2026-06-15 11:26:37.075 INFO data_loader - read_fuzzer_data_file_to_profile: target data f: /src/inspector/fuzzerLogFile-snappy_uncompress_fuzzer.data
Step #6 - "compile-libfuzzer-introspector-x86_64": 2026-06-15 11:26:37.075 INFO utils - data_file_read_yaml: Set base loader to use CSafeLoader
Step #6 - "compile-libfuzzer-introspector-x86_64": 2026-06-15 11:26:59.002 INFO utils - data_file_read_yaml: Loaded single yaml module
Step #6 - "compile-libfuzzer-introspector-x86_64": 2026-06-15 11:26:59.056 INFO utils - data_file_read_yaml: Loaded single yaml module
Step #6 - "compile-libfuzzer-introspector-x86_64": 2026-06-15 11:26:59.589 INFO data_loader - read_fuzzer_data_file_to_profile: Returning profile
Step #6 - "compile-libfuzzer-introspector-x86_64": 2026-06-15 11:26:59.649 INFO data_loader - read_fuzzer_data_file_to_profile: Returning profile
Step #6 - "compile-libfuzzer-introspector-x86_64": 2026-06-15 11:27:00.694 INFO analysis - load_data_files: Found 2 profiles
Step #6 - "compile-libfuzzer-introspector-x86_64": 2026-06-15 11:27:00.694 INFO analysis - load_data_files: [+] Accummulating profiles
Step #6 - "compile-libfuzzer-introspector-x86_64": 2026-06-15 11:27:00.694 INFO analysis - load_data_files: Accummulating using multiprocessing
Step #6 - "compile-libfuzzer-introspector-x86_64": 2026-06-15 11:27:00.721 INFO fuzzer_profile - accummulate_profile: /src/snappy/snappy_uncompress_fuzzer.cc: propagating functions reached
Step #6 - "compile-libfuzzer-introspector-x86_64": 2026-06-15 11:27:00.730 INFO fuzzer_profile - accummulate_profile: /src/snappy/snappy_compress_fuzzer.cc: propagating functions reached
Step #6 - "compile-libfuzzer-introspector-x86_64": 2026-06-15 11:27:00.816 INFO fuzzer_profile - accummulate_profile: /src/snappy/snappy_compress_fuzzer.cc: setting reached funcs
Step #6 - "compile-libfuzzer-introspector-x86_64": 2026-06-15 11:27:00.817 INFO fuzzer_profile - accummulate_profile: /src/snappy/snappy_compress_fuzzer.cc: setting unreached funcs
Step #6 - "compile-libfuzzer-introspector-x86_64": 2026-06-15 11:27:00.817 INFO fuzzer_profile - accummulate_profile: /src/snappy/snappy_uncompress_fuzzer.cc: setting reached funcs
Step #6 - "compile-libfuzzer-introspector-x86_64": 2026-06-15 11:27:00.817 INFO fuzzer_profile - accummulate_profile: /src/snappy/snappy_uncompress_fuzzer.cc: setting unreached funcs
Step #6 - "compile-libfuzzer-introspector-x86_64": 2026-06-15 11:27:00.821 INFO fuzzer_profile - accummulate_profile: /src/snappy/snappy_compress_fuzzer.cc: loading coverage
Step #6 - "compile-libfuzzer-introspector-x86_64": 2026-06-15 11:27:00.821 INFO fuzzer_profile - _load_coverage: Loading coverage of type c-cpp
Step #6 - "compile-libfuzzer-introspector-x86_64": 2026-06-15 11:27:00.821 INFO fuzzer_profile - accummulate_profile: /src/snappy/snappy_uncompress_fuzzer.cc: loading coverage
Step #6 - "compile-libfuzzer-introspector-x86_64": 2026-06-15 11:27:00.821 INFO code_coverage - load_llvm_coverage: Loading LLVM coverage for target /src/snappy/snappy_compress_fuzzer.cc
Step #6 - "compile-libfuzzer-introspector-x86_64": 2026-06-15 11:27:00.821 INFO fuzzer_profile - _load_coverage: Loading coverage of type c-cpp
Step #6 - "compile-libfuzzer-introspector-x86_64": 2026-06-15 11:27:00.822 INFO code_coverage - load_llvm_coverage: Loading LLVM coverage for target /src/snappy/snappy_uncompress_fuzzer.cc
Step #6 - "compile-libfuzzer-introspector-x86_64": 2026-06-15 11:27:00.822 INFO code_coverage - load_llvm_coverage: Found 0 coverage reports
Step #6 - "compile-libfuzzer-introspector-x86_64": 2026-06-15 11:27:00.822 INFO code_coverage - load_llvm_coverage: Using the following coverages []
Step #6 - "compile-libfuzzer-introspector-x86_64": 2026-06-15 11:27:00.822 INFO code_coverage - load_llvm_coverage: Found 0 coverage reports
Step #6 - "compile-libfuzzer-introspector-x86_64": 2026-06-15 11:27:00.823 INFO fuzzer_profile - accummulate_profile: /src/snappy/snappy_compress_fuzzer.cc: setting file targets
Step #6 - "compile-libfuzzer-introspector-x86_64": 2026-06-15 11:27:00.823 INFO code_coverage - load_llvm_coverage: Using the following coverages []
Step #6 - "compile-libfuzzer-introspector-x86_64": 2026-06-15 11:27:00.823 INFO fuzzer_profile - accummulate_profile: /src/snappy/snappy_uncompress_fuzzer.cc: setting file targets
Step #6 - "compile-libfuzzer-introspector-x86_64": 2026-06-15 11:27:00.823 INFO fuzzer_profile - accummulate_profile: /src/snappy/snappy_compress_fuzzer.cc: setting total basic blocks
Step #6 - "compile-libfuzzer-introspector-x86_64": 2026-06-15 11:27:00.823 INFO fuzzer_profile - accummulate_profile: /src/snappy/snappy_compress_fuzzer.cc: setting cyclomatic complexity
Step #6 - "compile-libfuzzer-introspector-x86_64": 2026-06-15 11:27:00.823 INFO fuzzer_profile - accummulate_profile: /src/snappy/snappy_uncompress_fuzzer.cc: setting total basic blocks
Step #6 - "compile-libfuzzer-introspector-x86_64": 2026-06-15 11:27:00.823 INFO fuzzer_profile - accummulate_profile: /src/snappy/snappy_compress_fuzzer.cc: setting fd cache
Step #6 - "compile-libfuzzer-introspector-x86_64": 2026-06-15 11:27:00.823 INFO fuzzer_profile - accummulate_profile: /src/snappy/snappy_uncompress_fuzzer.cc: setting cyclomatic complexity
Step #6 - "compile-libfuzzer-introspector-x86_64": 2026-06-15 11:27:00.823 INFO fuzzer_profile - accummulate_profile: /src/snappy/snappy_uncompress_fuzzer.cc: setting fd cache
Step #6 - "compile-libfuzzer-introspector-x86_64": 2026-06-15 11:27:00.835 INFO fuzzer_profile - accummulate_profile: /src/snappy/snappy_compress_fuzzer.cc: setting reached funcs in runtime
Step #6 - "compile-libfuzzer-introspector-x86_64": 2026-06-15 11:27:00.835 INFO fuzzer_profile - accummulate_profile: /src/snappy/snappy_compress_fuzzer.cc: finished accummulating profile
Step #6 - "compile-libfuzzer-introspector-x86_64": 2026-06-15 11:27:00.837 INFO fuzzer_profile - accummulate_profile: /src/snappy/snappy_uncompress_fuzzer.cc: setting reached funcs in runtime
Step #6 - "compile-libfuzzer-introspector-x86_64": 2026-06-15 11:27:00.837 INFO fuzzer_profile - accummulate_profile: /src/snappy/snappy_uncompress_fuzzer.cc: finished accummulating profile
Step #6 - "compile-libfuzzer-introspector-x86_64": 2026-06-15 11:27:01.589 INFO analysis - load_data_files: [+] Creating project profile
Step #6 - "compile-libfuzzer-introspector-x86_64": 2026-06-15 11:27:01.590 INFO project_profile - __init__: Creating merged profile of 2 profiles
Step #6 - "compile-libfuzzer-introspector-x86_64": 2026-06-15 11:27:01.590 INFO project_profile - __init__: Populating functions reached
Step #6 - "compile-libfuzzer-introspector-x86_64": 2026-06-15 11:27:01.590 INFO project_profile - __init__: Populating functions unreached
Step #6 - "compile-libfuzzer-introspector-x86_64": 2026-06-15 11:27:01.594 INFO project_profile - __init__: Creating all_functions dictionary
Step #6 - "compile-libfuzzer-introspector-x86_64": 2026-06-15 11:27:01.642 INFO project_profile - __init__: Gathering complexity and incoming references of each function
Step #6 - "compile-libfuzzer-introspector-x86_64": 2026-06-15 11:27:01.699 INFO project_profile - __init__: Completed creationg of merged profile
Step #6 - "compile-libfuzzer-introspector-x86_64": 2026-06-15 11:27:01.699 INFO analysis - load_data_files: [+] Refining profiles
Step #6 - "compile-libfuzzer-introspector-x86_64": 2026-06-15 11:27:01.729 INFO utils - get_target_coverage_url: Extracting coverage for https://storage.googleapis.com/oss-fuzz-coverage/snappy/reports/20260615/linux -- snappy_compress_fuzzer.cc
Step #6 - "compile-libfuzzer-introspector-x86_64": 2026-06-15 11:27:01.730 INFO analysis - overlay_calltree_with_coverage: Using coverage url: https://storage.googleapis.com/oss-fuzz-coverage/snappy/reports-by-target/20260615/snappy_compress_fuzzer.cc/linux
Step #6 - "compile-libfuzzer-introspector-x86_64": 2026-06-15 11:27:01.730 INFO analysis - get_node_coverage_hitcount: There is no coverage data (not even all negative).
Step #6 - "compile-libfuzzer-introspector-x86_64": 2026-06-15 11:27:01.732 INFO analysis - overlay_calltree_with_coverage: Overlaying 2
Step #6 - "compile-libfuzzer-introspector-x86_64": 2026-06-15 11:27:01.733 INFO analysis - overlay_calltree_with_coverage: Overlaying 3
Step #6 - "compile-libfuzzer-introspector-x86_64": 2026-06-15 11:27:01.733 INFO analysis - overlay_calltree_with_coverage: Updating branch complexities
Step #6 - "compile-libfuzzer-introspector-x86_64": 2026-06-15 11:27:01.736 INFO analysis - overlay_calltree_with_coverage: [+] found 0 branch blockers.
Step #6 - "compile-libfuzzer-introspector-x86_64": 2026-06-15 11:27:01.737 INFO utils - get_target_coverage_url: Extracting coverage for https://storage.googleapis.com/oss-fuzz-coverage/snappy/reports/20260615/linux -- snappy_uncompress_fuzzer.cc
Step #6 - "compile-libfuzzer-introspector-x86_64": 2026-06-15 11:27:01.737 INFO analysis - overlay_calltree_with_coverage: Using coverage url: https://storage.googleapis.com/oss-fuzz-coverage/snappy/reports-by-target/20260615/snappy_uncompress_fuzzer.cc/linux
Step #6 - "compile-libfuzzer-introspector-x86_64": 2026-06-15 11:27:01.737 INFO analysis - get_node_coverage_hitcount: There is no coverage data (not even all negative).
Step #6 - "compile-libfuzzer-introspector-x86_64": 2026-06-15 11:27:01.737 INFO analysis - overlay_calltree_with_coverage: Overlaying 2
Step #6 - "compile-libfuzzer-introspector-x86_64": 2026-06-15 11:27:01.737 INFO analysis - overlay_calltree_with_coverage: Overlaying 3
Step #6 - "compile-libfuzzer-introspector-x86_64": 2026-06-15 11:27:01.737 INFO analysis - overlay_calltree_with_coverage: Updating branch complexities
Step #6 - "compile-libfuzzer-introspector-x86_64": 2026-06-15 11:27:01.740 INFO analysis - overlay_calltree_with_coverage: [+] found 0 branch blockers.
Step #6 - "compile-libfuzzer-introspector-x86_64": 2026-06-15 11:27:01.778 INFO commands - run_analysis_on_dir: Analyses to run: ['OptimalTargets', 'FuzzEngineInputAnalysis', 'RuntimeCoverageAnalysis', 'FuzzDriverSynthesizerAnalysis', 'BugDigestorAnalysis', 'FilePathAnalyser', 'ThirdPartyAPICoverageAnalyser', 'MetadataAnalysis', 'SinkCoverageAnalyser', 'AnnotatedCFG', 'SourceCodeLineAnalyser', 'FarReachLowCoverageAnalyser', 'PublicCandidateAnalyser', 'FrontendAnalyser']
Step #6 - "compile-libfuzzer-introspector-x86_64": 2026-06-15 11:27:01.778 INFO commands - run_analysis_on_dir: [+] Creating HTML report
Step #6 - "compile-libfuzzer-introspector-x86_64": 2026-06-15 11:27:01.778 INFO html_report - create_html_report: - Creating HTML report
Step #6 - "compile-libfuzzer-introspector-x86_64": 2026-06-15 11:27:01.778 INFO html_report - create_section_project_overview: - Creating reachability overview table
Step #6 - "compile-libfuzzer-introspector-x86_64": 2026-06-15 11:27:01.856 INFO html_report - create_section_fuzzers_overview: - Creating table with overview of all fuzzers
Step #6 - "compile-libfuzzer-introspector-x86_64": 2026-06-15 11:27:01.856 INFO html_report - create_section_all_functions: - Creating table with information about all functions in target
Step #6 - "compile-libfuzzer-introspector-x86_64": 2026-06-15 11:27:01.950 INFO html_report - create_all_function_table: Assembled a total of 4716 entries
Step #6 - "compile-libfuzzer-introspector-x86_64": 2026-06-15 11:27:01.951 INFO html_report - create_section_fuzzer_detailed_section: - Creating section with details about each fuzzer
Step #6 - "compile-libfuzzer-introspector-x86_64": 2026-06-15 11:27:01.951 INFO calltree_analysis - __init__: Creating FuzzCalltreeAnalysis
Step #6 - "compile-libfuzzer-introspector-x86_64": 2026-06-15 11:27:01.951 INFO calltree_analysis - create_calltree: In calltree
Step #6 - "compile-libfuzzer-introspector-x86_64": 2026-06-15 11:27:01.952 INFO calltree_analysis - create_calltree: At end
Step #6 - "compile-libfuzzer-introspector-x86_64": 2026-06-15 11:27:01.952 INFO calltree_analysis - create_calltree: calltree_html_section_string: : 53 -- : 53
Step #6 - "compile-libfuzzer-introspector-x86_64": 2026-06-15 11:27:01.952 INFO calltree_analysis - create_calltree: Calltree created
Step #6 - "compile-libfuzzer-introspector-x86_64": 2026-06-15 11:27:01.952 INFO calltree_analysis - create_fuzz_blocker_table: Creating fuzz blocker table
Step #6 - "compile-libfuzzer-introspector-x86_64": 2026-06-15 11:27:02.417 INFO font_manager - _load_fontmanager: generated new fontManager
Step #6 - "compile-libfuzzer-introspector-x86_64": 2026-06-15 11:27:02.656 INFO html_helpers - create_horisontal_calltree_image: Creating image snappy_compress_fuzzer.cc_colormap.png
Step #6 - "compile-libfuzzer-introspector-x86_64": 2026-06-15 11:27:02.656 INFO html_helpers - create_horisontal_calltree_image: - extracted the callsites (42 nodes)
Step #6 - "compile-libfuzzer-introspector-x86_64": 2026-06-15 11:27:02.675 INFO html_helpers - create_horisontal_calltree_image: - iterated over color list
Step #6 - "compile-libfuzzer-introspector-x86_64": 2026-06-15 11:27:02.675 INFO html_helpers - create_horisontal_calltree_image: - saving image
Step #6 - "compile-libfuzzer-introspector-x86_64": 2026-06-15 11:27:02.756 INFO html_helpers - create_horisontal_calltree_image: - image saved
Step #6 - "compile-libfuzzer-introspector-x86_64": 2026-06-15 11:27:02.757 INFO calltree_analysis - __init__: Creating FuzzCalltreeAnalysis
Step #6 - "compile-libfuzzer-introspector-x86_64": 2026-06-15 11:27:02.757 INFO calltree_analysis - create_calltree: In calltree
Step #6 - "compile-libfuzzer-introspector-x86_64": 2026-06-15 11:27:02.757 INFO calltree_analysis - create_calltree: At end
Step #6 - "compile-libfuzzer-introspector-x86_64": 2026-06-15 11:27:02.757 INFO calltree_analysis - create_calltree: calltree_html_section_string: : 20 -- : 20
Step #6 - "compile-libfuzzer-introspector-x86_64": 2026-06-15 11:27:02.757 INFO calltree_analysis - create_calltree: Calltree created
Step #6 - "compile-libfuzzer-introspector-x86_64": 2026-06-15 11:27:02.757 INFO calltree_analysis - create_fuzz_blocker_table: Creating fuzz blocker table
Step #6 - "compile-libfuzzer-introspector-x86_64": 2026-06-15 11:27:02.770 INFO html_helpers - create_horisontal_calltree_image: Creating image snappy_uncompress_fuzzer.cc_colormap.png
Step #6 - "compile-libfuzzer-introspector-x86_64": 2026-06-15 11:27:02.771 INFO html_helpers - create_horisontal_calltree_image: - extracted the callsites (14 nodes)
Step #6 - "compile-libfuzzer-introspector-x86_64": 2026-06-15 11:27:02.785 INFO html_helpers - create_horisontal_calltree_image: - iterated over color list
Step #6 - "compile-libfuzzer-introspector-x86_64": 2026-06-15 11:27:02.785 INFO html_helpers - create_horisontal_calltree_image: - saving image
Step #6 - "compile-libfuzzer-introspector-x86_64": 2026-06-15 11:27:02.867 INFO html_helpers - create_horisontal_calltree_image: - image saved
Step #6 - "compile-libfuzzer-introspector-x86_64": 2026-06-15 11:27:02.867 INFO html_report - create_section_optional_analyses: - Handling optional analyses
Step #6 - "compile-libfuzzer-introspector-x86_64": 2026-06-15 11:27:02.868 INFO optimal_targets - analysis_func: - Running analysis OptimalTargets
Step #6 - "compile-libfuzzer-introspector-x86_64": 2026-06-15 11:27:02.868 INFO optimal_targets - iteratively_get_optimal_targets: - in iteratively_get_optimal_targets
Step #6 - "compile-libfuzzer-introspector-x86_64": 2026-06-15 11:27:03.484 INFO optimal_targets - analysis_get_optimal_targets: - in analysis_get_optimal_targets
Step #6 - "compile-libfuzzer-introspector-x86_64": 2026-06-15 11:27:03.484 INFO optimal_targets - analysis_get_optimal_targets: Filtering optimal functions from 4716 functions
Step #6 - "compile-libfuzzer-introspector-x86_64": 2026-06-15 11:27:03.491 INFO optimal_targets - analysis_get_optimal_targets: Found a total of 25 potential targets
Step #6 - "compile-libfuzzer-introspector-x86_64": 2026-06-15 11:27:03.491 INFO optimal_targets - iteratively_get_optimal_targets: Getting 7 optimal targets
Step #6 - "compile-libfuzzer-introspector-x86_64": 2026-06-15 11:27:03.491 INFO optimal_targets - iteratively_get_optimal_targets: - sorting by unreached complexity.
Step #6 - "compile-libfuzzer-introspector-x86_64": 2026-06-15 11:27:03.491 INFO optimal_targets - add_func_to_reached_and_clone: Creating a deepcopy
Step #6 - "compile-libfuzzer-introspector-x86_64": 2026-06-15 11:27:04.076 INFO optimal_targets - add_func_to_reached_and_clone: Updating hitcount
Step #6 - "compile-libfuzzer-introspector-x86_64": 2026-06-15 11:27:04.078 INFO optimal_targets - add_func_to_reached_and_clone: Updating hitcount-related data
Step #6 - "compile-libfuzzer-introspector-x86_64": 2026-06-15 11:27:04.113 INFO optimal_targets - analysis_get_optimal_targets: - in analysis_get_optimal_targets
Step #6 - "compile-libfuzzer-introspector-x86_64": 2026-06-15 11:27:04.113 INFO optimal_targets - analysis_get_optimal_targets: Filtering optimal functions from 4716 functions
Step #6 - "compile-libfuzzer-introspector-x86_64": 2026-06-15 11:27:04.118 INFO optimal_targets - analysis_get_optimal_targets: Found a total of 17 potential targets
Step #6 - "compile-libfuzzer-introspector-x86_64": 2026-06-15 11:27:04.118 INFO optimal_targets - iteratively_get_optimal_targets: - sorting by unreached complexity.
Step #6 - "compile-libfuzzer-introspector-x86_64": 2026-06-15 11:27:04.118 INFO optimal_targets - add_func_to_reached_and_clone: Creating a deepcopy
Step #6 - "compile-libfuzzer-introspector-x86_64": 2026-06-15 11:27:04.714 INFO optimal_targets - add_func_to_reached_and_clone: Updating hitcount
Step #6 - "compile-libfuzzer-introspector-x86_64": 2026-06-15 11:27:04.715 INFO optimal_targets - add_func_to_reached_and_clone: Updating hitcount-related data
Step #6 - "compile-libfuzzer-introspector-x86_64": 2026-06-15 11:27:04.747 INFO optimal_targets - analysis_get_optimal_targets: - in analysis_get_optimal_targets
Step #6 - "compile-libfuzzer-introspector-x86_64": 2026-06-15 11:27:04.748 INFO optimal_targets - analysis_get_optimal_targets: Filtering optimal functions from 4716 functions
Step #6 - "compile-libfuzzer-introspector-x86_64": 2026-06-15 11:27:04.753 INFO optimal_targets - analysis_get_optimal_targets: Found a total of 16 potential targets
Step #6 - "compile-libfuzzer-introspector-x86_64": 2026-06-15 11:27:04.753 INFO optimal_targets - iteratively_get_optimal_targets: - sorting by unreached complexity.
Step #6 - "compile-libfuzzer-introspector-x86_64": 2026-06-15 11:27:04.753 INFO optimal_targets - add_func_to_reached_and_clone: Creating a deepcopy
Step #6 - "compile-libfuzzer-introspector-x86_64": 2026-06-15 11:27:06.053 INFO optimal_targets - add_func_to_reached_and_clone: Updating hitcount
Step #6 - "compile-libfuzzer-introspector-x86_64": 2026-06-15 11:27:06.055 INFO optimal_targets - add_func_to_reached_and_clone: Updating hitcount-related data
Step #6 - "compile-libfuzzer-introspector-x86_64": 2026-06-15 11:27:06.092 INFO optimal_targets - analysis_get_optimal_targets: - in analysis_get_optimal_targets
Step #6 - "compile-libfuzzer-introspector-x86_64": 2026-06-15 11:27:06.093 INFO optimal_targets - analysis_get_optimal_targets: Filtering optimal functions from 4716 functions
Step #6 - "compile-libfuzzer-introspector-x86_64": 2026-06-15 11:27:06.097 INFO optimal_targets - analysis_get_optimal_targets: Found a total of 12 potential targets
Step #6 - "compile-libfuzzer-introspector-x86_64": 2026-06-15 11:27:06.098 INFO optimal_targets - iteratively_get_optimal_targets: - sorting by unreached complexity.
Step #6 - "compile-libfuzzer-introspector-x86_64": 2026-06-15 11:27:06.098 INFO optimal_targets - add_func_to_reached_and_clone: Creating a deepcopy
Step #6 - "compile-libfuzzer-introspector-x86_64": 2026-06-15 11:27:06.705 INFO optimal_targets - add_func_to_reached_and_clone: Updating hitcount
Step #6 - "compile-libfuzzer-introspector-x86_64": 2026-06-15 11:27:06.707 INFO optimal_targets - add_func_to_reached_and_clone: Updating hitcount-related data
Step #6 - "compile-libfuzzer-introspector-x86_64": 2026-06-15 11:27:06.741 INFO optimal_targets - analysis_get_optimal_targets: - in analysis_get_optimal_targets
Step #6 - "compile-libfuzzer-introspector-x86_64": 2026-06-15 11:27:06.743 INFO optimal_targets - analysis_get_optimal_targets: Filtering optimal functions from 4716 functions
Step #6 - "compile-libfuzzer-introspector-x86_64": 2026-06-15 11:27:06.748 INFO optimal_targets - analysis_get_optimal_targets: Found a total of 8 potential targets
Step #6 - "compile-libfuzzer-introspector-x86_64": 2026-06-15 11:27:06.748 INFO optimal_targets - iteratively_get_optimal_targets: - sorting by unreached complexity.
Step #6 - "compile-libfuzzer-introspector-x86_64": 2026-06-15 11:27:06.748 INFO optimal_targets - add_func_to_reached_and_clone: Creating a deepcopy
Step #6 - "compile-libfuzzer-introspector-x86_64": 2026-06-15 11:27:07.350 INFO optimal_targets - add_func_to_reached_and_clone: Updating hitcount
Step #6 - "compile-libfuzzer-introspector-x86_64": 2026-06-15 11:27:07.351 INFO optimal_targets - add_func_to_reached_and_clone: Updating hitcount-related data
Step #6 - "compile-libfuzzer-introspector-x86_64": 2026-06-15 11:27:07.390 INFO optimal_targets - analysis_get_optimal_targets: - in analysis_get_optimal_targets
Step #6 - "compile-libfuzzer-introspector-x86_64": 2026-06-15 11:27:07.391 INFO optimal_targets - analysis_get_optimal_targets: Filtering optimal functions from 4716 functions
Step #6 - "compile-libfuzzer-introspector-x86_64": 2026-06-15 11:27:07.395 INFO optimal_targets - analysis_get_optimal_targets: Found a total of 7 potential targets
Step #6 - "compile-libfuzzer-introspector-x86_64": 2026-06-15 11:27:07.396 INFO optimal_targets - iteratively_get_optimal_targets: - sorting by unreached complexity.
Step #6 - "compile-libfuzzer-introspector-x86_64": 2026-06-15 11:27:07.396 INFO optimal_targets - add_func_to_reached_and_clone: Creating a deepcopy
Step #6 - "compile-libfuzzer-introspector-x86_64": 2026-06-15 11:27:08.568 INFO optimal_targets - add_func_to_reached_and_clone: Updating hitcount
Step #6 - "compile-libfuzzer-introspector-x86_64": 2026-06-15 11:27:08.570 INFO optimal_targets - add_func_to_reached_and_clone: Updating hitcount-related data
Step #6 - "compile-libfuzzer-introspector-x86_64": 2026-06-15 11:27:08.602 INFO optimal_targets - analysis_get_optimal_targets: - in analysis_get_optimal_targets
Step #6 - "compile-libfuzzer-introspector-x86_64": 2026-06-15 11:27:08.602 INFO optimal_targets - analysis_get_optimal_targets: Filtering optimal functions from 4716 functions
Step #6 - "compile-libfuzzer-introspector-x86_64": 2026-06-15 11:27:08.609 INFO optimal_targets - analysis_get_optimal_targets: Found a total of 6 potential targets
Step #6 - "compile-libfuzzer-introspector-x86_64": 2026-06-15 11:27:08.609 INFO optimal_targets - iteratively_get_optimal_targets: - sorting by unreached complexity.
Step #6 - "compile-libfuzzer-introspector-x86_64": 2026-06-15 11:27:08.609 INFO optimal_targets - add_func_to_reached_and_clone: Creating a deepcopy
Step #6 - "compile-libfuzzer-introspector-x86_64": 2026-06-15 11:27:09.212 INFO optimal_targets - add_func_to_reached_and_clone: Updating hitcount
Step #6 - "compile-libfuzzer-introspector-x86_64": 2026-06-15 11:27:09.214 INFO optimal_targets - add_func_to_reached_and_clone: Updating hitcount-related data
Step #6 - "compile-libfuzzer-introspector-x86_64": 2026-06-15 11:27:09.253 INFO optimal_targets - iteratively_get_optimal_targets: Found the following optimal functions: { ['testing::ParseFlagsTest::TestParsingFlags', 'benchmark::GetCPUCyclesPerSecond', 'snappy::Verify', 'testing::internal::XmlUnitTestResultPrinter::PrintXmlUnitTest', 'DecompressAllTags', 'benchmark::RunSpecifiedBenchmarks', 'MeasureFile'] }
Step #6 - "compile-libfuzzer-introspector-x86_64": 2026-06-15 11:27:09.398 INFO html_report - create_all_function_table: Assembled a total of 4716 entries
Step #6 - "compile-libfuzzer-introspector-x86_64": 2026-06-15 11:27:09.513 INFO optimal_targets - analysis_func: - Completed analysis OptimalTargets
Step #6 - "compile-libfuzzer-introspector-x86_64": 2026-06-15 11:27:09.537 INFO engine_input - analysis_func: - Running analysis FuzzEngineInputAnalysis
Step #6 - "compile-libfuzzer-introspector-x86_64": 2026-06-15 11:27:09.537 INFO engine_input - analysis_func: Generating input for snappy_compress_fuzzer.cc
Step #6 - "compile-libfuzzer-introspector-x86_64": 2026-06-15 11:27:09.538 INFO calltree_analysis - __init__: Creating FuzzCalltreeAnalysis
Step #6 - "compile-libfuzzer-introspector-x86_64": 2026-06-15 11:27:09.538 INFO engine_input - analysis_func: Generating input for snappy_uncompress_fuzzer.cc
Step #6 - "compile-libfuzzer-introspector-x86_64": 2026-06-15 11:27:09.539 INFO calltree_analysis - __init__: Creating FuzzCalltreeAnalysis
Step #6 - "compile-libfuzzer-introspector-x86_64": 2026-06-15 11:27:09.539 INFO engine_input - analysis_func: - Completed analysis FuzzEngineInputAnalysis
Step #6 - "compile-libfuzzer-introspector-x86_64": 2026-06-15 11:27:09.539 INFO runtime_coverage_analysis - analysis_func: - Running analysis RuntimeCoverageAnalysis
Step #6 - "compile-libfuzzer-introspector-x86_64": 2026-06-15 11:27:09.540 INFO runtime_coverage_analysis - analysis_func: - Completed analysis RuntimeCoverageAnalysis
Step #6 - "compile-libfuzzer-introspector-x86_64": 2026-06-15 11:27:09.540 INFO driver_synthesizer - analysis_func: - Running analysis FuzzDriverSynthesizerAnalysis
Step #6 - "compile-libfuzzer-introspector-x86_64": 2026-06-15 11:27:09.540 INFO optimal_targets - iteratively_get_optimal_targets: - in iteratively_get_optimal_targets
Step #6 - "compile-libfuzzer-introspector-x86_64": 2026-06-15 11:27:10.135 INFO optimal_targets - analysis_get_optimal_targets: - in analysis_get_optimal_targets
Step #6 - "compile-libfuzzer-introspector-x86_64": 2026-06-15 11:27:10.136 INFO optimal_targets - analysis_get_optimal_targets: Filtering optimal functions from 4716 functions
Step #6 - "compile-libfuzzer-introspector-x86_64": 2026-06-15 11:27:10.140 INFO optimal_targets - analysis_get_optimal_targets: Found a total of 25 potential targets
Step #6 - "compile-libfuzzer-introspector-x86_64": 2026-06-15 11:27:10.140 INFO optimal_targets - iteratively_get_optimal_targets: Getting 7 optimal targets
Step #6 - "compile-libfuzzer-introspector-x86_64": 2026-06-15 11:27:10.140 INFO optimal_targets - iteratively_get_optimal_targets: - sorting by unreached complexity.
Step #6 - "compile-libfuzzer-introspector-x86_64": 2026-06-15 11:27:10.140 INFO optimal_targets - add_func_to_reached_and_clone: Creating a deepcopy
Step #6 - "compile-libfuzzer-introspector-x86_64": 2026-06-15 11:27:11.321 INFO optimal_targets - add_func_to_reached_and_clone: Updating hitcount
Step #6 - "compile-libfuzzer-introspector-x86_64": 2026-06-15 11:27:11.322 INFO optimal_targets - add_func_to_reached_and_clone: Updating hitcount-related data
Step #6 - "compile-libfuzzer-introspector-x86_64": 2026-06-15 11:27:11.358 INFO optimal_targets - analysis_get_optimal_targets: - in analysis_get_optimal_targets
Step #6 - "compile-libfuzzer-introspector-x86_64": 2026-06-15 11:27:11.358 INFO optimal_targets - analysis_get_optimal_targets: Filtering optimal functions from 4716 functions
Step #6 - "compile-libfuzzer-introspector-x86_64": 2026-06-15 11:27:11.363 INFO optimal_targets - analysis_get_optimal_targets: Found a total of 17 potential targets
Step #6 - "compile-libfuzzer-introspector-x86_64": 2026-06-15 11:27:11.363 INFO optimal_targets - iteratively_get_optimal_targets: - sorting by unreached complexity.
Step #6 - "compile-libfuzzer-introspector-x86_64": 2026-06-15 11:27:11.363 INFO optimal_targets - add_func_to_reached_and_clone: Creating a deepcopy
Step #6 - "compile-libfuzzer-introspector-x86_64": 2026-06-15 11:27:11.975 INFO optimal_targets - add_func_to_reached_and_clone: Updating hitcount
Step #6 - "compile-libfuzzer-introspector-x86_64": 2026-06-15 11:27:11.976 INFO optimal_targets - add_func_to_reached_and_clone: Updating hitcount-related data
Step #6 - "compile-libfuzzer-introspector-x86_64": 2026-06-15 11:27:12.009 INFO optimal_targets - analysis_get_optimal_targets: - in analysis_get_optimal_targets
Step #6 - "compile-libfuzzer-introspector-x86_64": 2026-06-15 11:27:12.010 INFO optimal_targets - analysis_get_optimal_targets: Filtering optimal functions from 4716 functions
Step #6 - "compile-libfuzzer-introspector-x86_64": 2026-06-15 11:27:12.015 INFO optimal_targets - analysis_get_optimal_targets: Found a total of 16 potential targets
Step #6 - "compile-libfuzzer-introspector-x86_64": 2026-06-15 11:27:12.015 INFO optimal_targets - iteratively_get_optimal_targets: - sorting by unreached complexity.
Step #6 - "compile-libfuzzer-introspector-x86_64": 2026-06-15 11:27:12.015 INFO optimal_targets - add_func_to_reached_and_clone: Creating a deepcopy
Step #6 - "compile-libfuzzer-introspector-x86_64": 2026-06-15 11:27:12.613 INFO optimal_targets - add_func_to_reached_and_clone: Updating hitcount
Step #6 - "compile-libfuzzer-introspector-x86_64": 2026-06-15 11:27:12.615 INFO optimal_targets - add_func_to_reached_and_clone: Updating hitcount-related data
Step #6 - "compile-libfuzzer-introspector-x86_64": 2026-06-15 11:27:12.652 INFO optimal_targets - analysis_get_optimal_targets: - in analysis_get_optimal_targets
Step #6 - "compile-libfuzzer-introspector-x86_64": 2026-06-15 11:27:12.653 INFO optimal_targets - analysis_get_optimal_targets: Filtering optimal functions from 4716 functions
Step #6 - "compile-libfuzzer-introspector-x86_64": 2026-06-15 11:27:12.658 INFO optimal_targets - analysis_get_optimal_targets: Found a total of 12 potential targets
Step #6 - "compile-libfuzzer-introspector-x86_64": 2026-06-15 11:27:12.658 INFO optimal_targets - iteratively_get_optimal_targets: - sorting by unreached complexity.
Step #6 - "compile-libfuzzer-introspector-x86_64": 2026-06-15 11:27:12.658 INFO optimal_targets - add_func_to_reached_and_clone: Creating a deepcopy
Step #6 - "compile-libfuzzer-introspector-x86_64": 2026-06-15 11:27:13.852 INFO optimal_targets - add_func_to_reached_and_clone: Updating hitcount
Step #6 - "compile-libfuzzer-introspector-x86_64": 2026-06-15 11:27:13.854 INFO optimal_targets - add_func_to_reached_and_clone: Updating hitcount-related data
Step #6 - "compile-libfuzzer-introspector-x86_64": 2026-06-15 11:27:13.888 INFO optimal_targets - analysis_get_optimal_targets: - in analysis_get_optimal_targets
Step #6 - "compile-libfuzzer-introspector-x86_64": 2026-06-15 11:27:13.889 INFO optimal_targets - analysis_get_optimal_targets: Filtering optimal functions from 4716 functions
Step #6 - "compile-libfuzzer-introspector-x86_64": 2026-06-15 11:27:13.894 INFO optimal_targets - analysis_get_optimal_targets: Found a total of 8 potential targets
Step #6 - "compile-libfuzzer-introspector-x86_64": 2026-06-15 11:27:13.894 INFO optimal_targets - iteratively_get_optimal_targets: - sorting by unreached complexity.
Step #6 - "compile-libfuzzer-introspector-x86_64": 2026-06-15 11:27:13.894 INFO optimal_targets - add_func_to_reached_and_clone: Creating a deepcopy
Step #6 - "compile-libfuzzer-introspector-x86_64": 2026-06-15 11:27:14.495 INFO optimal_targets - add_func_to_reached_and_clone: Updating hitcount
Step #6 - "compile-libfuzzer-introspector-x86_64": 2026-06-15 11:27:14.496 INFO optimal_targets - add_func_to_reached_and_clone: Updating hitcount-related data
Step #6 - "compile-libfuzzer-introspector-x86_64": 2026-06-15 11:27:14.535 INFO optimal_targets - analysis_get_optimal_targets: - in analysis_get_optimal_targets
Step #6 - "compile-libfuzzer-introspector-x86_64": 2026-06-15 11:27:14.536 INFO optimal_targets - analysis_get_optimal_targets: Filtering optimal functions from 4716 functions
Step #6 - "compile-libfuzzer-introspector-x86_64": 2026-06-15 11:27:14.540 INFO optimal_targets - analysis_get_optimal_targets: Found a total of 7 potential targets
Step #6 - "compile-libfuzzer-introspector-x86_64": 2026-06-15 11:27:14.541 INFO optimal_targets - iteratively_get_optimal_targets: - sorting by unreached complexity.
Step #6 - "compile-libfuzzer-introspector-x86_64": 2026-06-15 11:27:14.541 INFO optimal_targets - add_func_to_reached_and_clone: Creating a deepcopy
Step #6 - "compile-libfuzzer-introspector-x86_64": 2026-06-15 11:27:15.153 INFO optimal_targets - add_func_to_reached_and_clone: Updating hitcount
Step #6 - "compile-libfuzzer-introspector-x86_64": 2026-06-15 11:27:15.154 INFO optimal_targets - add_func_to_reached_and_clone: Updating hitcount-related data
Step #6 - "compile-libfuzzer-introspector-x86_64": 2026-06-15 11:27:15.188 INFO optimal_targets - analysis_get_optimal_targets: - in analysis_get_optimal_targets
Step #6 - "compile-libfuzzer-introspector-x86_64": 2026-06-15 11:27:15.189 INFO optimal_targets - analysis_get_optimal_targets: Filtering optimal functions from 4716 functions
Step #6 - "compile-libfuzzer-introspector-x86_64": 2026-06-15 11:27:15.194 INFO optimal_targets - analysis_get_optimal_targets: Found a total of 6 potential targets
Step #6 - "compile-libfuzzer-introspector-x86_64": 2026-06-15 11:27:15.194 INFO optimal_targets - iteratively_get_optimal_targets: - sorting by unreached complexity.
Step #6 - "compile-libfuzzer-introspector-x86_64": 2026-06-15 11:27:15.194 INFO optimal_targets - add_func_to_reached_and_clone: Creating a deepcopy
Step #6 - "compile-libfuzzer-introspector-x86_64": 2026-06-15 11:27:16.423 INFO optimal_targets - add_func_to_reached_and_clone: Updating hitcount
Step #6 - "compile-libfuzzer-introspector-x86_64": 2026-06-15 11:27:16.424 INFO optimal_targets - add_func_to_reached_and_clone: Updating hitcount-related data
Step #6 - "compile-libfuzzer-introspector-x86_64": 2026-06-15 11:27:16.464 INFO optimal_targets - iteratively_get_optimal_targets: Found the following optimal functions: { ['testing::ParseFlagsTest::TestParsingFlags', 'benchmark::GetCPUCyclesPerSecond', 'snappy::Verify', 'testing::internal::XmlUnitTestResultPrinter::PrintXmlUnitTest', 'DecompressAllTags', 'benchmark::RunSpecifiedBenchmarks', 'MeasureFile'] }
Step #6 - "compile-libfuzzer-introspector-x86_64": 2026-06-15 11:27:16.466 INFO driver_synthesizer - analysis_func: . Done
Step #6 - "compile-libfuzzer-introspector-x86_64": 2026-06-15 11:27:16.466 INFO driver_synthesizer - analysis_func: . Done
Step #6 - "compile-libfuzzer-introspector-x86_64": 2026-06-15 11:27:16.466 INFO driver_synthesizer - analysis_func: . Done
Step #6 - "compile-libfuzzer-introspector-x86_64": 2026-06-15 11:27:16.466 INFO driver_synthesizer - analysis_func: . Done
Step #6 - "compile-libfuzzer-introspector-x86_64": 2026-06-15 11:27:16.466 INFO driver_synthesizer - analysis_func: . Done
Step #6 - "compile-libfuzzer-introspector-x86_64": 2026-06-15 11:27:16.466 INFO driver_synthesizer - analysis_func: . Done
Step #6 - "compile-libfuzzer-introspector-x86_64": 2026-06-15 11:27:16.466 INFO driver_synthesizer - analysis_func: . Done
Step #6 - "compile-libfuzzer-introspector-x86_64": 2026-06-15 11:27:16.466 INFO driver_synthesizer - analysis_func: Synthesizing drivers for the following optimal functions: { ['testing::ParseFlagsTest::TestParsingFlags', 'benchmark::GetCPUCyclesPerSecond', 'snappy::Verify', 'testing::internal::XmlUnitTestResultPrinter::PrintXmlUnitTest', 'DecompressAllTags', 'benchmark::RunSpecifiedBenchmarks', 'MeasureFile'] }
Step #6 - "compile-libfuzzer-introspector-x86_64": 2026-06-15 11:27:16.467 INFO driver_synthesizer - analysis_func: - Completed analysis FuzzDriverSynthesizerAnalysis
Step #6 - "compile-libfuzzer-introspector-x86_64": 2026-06-15 11:27:16.492 INFO bug_digestor - analysis_func: - Running analysis BugDigestorAnalysis
Step #6 - "compile-libfuzzer-introspector-x86_64": 2026-06-15 11:27:16.493 INFO filepath_analyser - analysis_func: - Running analysis FilePathAnalyser
Step #6 - "compile-libfuzzer-introspector-x86_64": 2026-06-15 11:27:17.671 INFO function_call_analyser - analysis_func: - Running analysis ThirdPartyAPICoverageAnalyser
Step #6 - "compile-libfuzzer-introspector-x86_64": 2026-06-15 11:27:17.690 INFO metadata - analysis_func: - Running analysis MetadataAnalysis
Step #6 - "compile-libfuzzer-introspector-x86_64": 2026-06-15 11:27:17.692 INFO metadata - analysis_func: - Completed analysis MetadataAnalysis
Step #6 - "compile-libfuzzer-introspector-x86_64": 2026-06-15 11:27:17.693 INFO sinks_analyser - analysis_func: - Running analysis SinkCoverageAnalyser
Step #6 - "compile-libfuzzer-introspector-x86_64": 2026-06-15 11:27:18.200 INFO sinks_analyser - analysis_func: ['snappy_compress_fuzzer.cc', 'snappy_uncompress_fuzzer.cc']
Step #6 - "compile-libfuzzer-introspector-x86_64": 2026-06-15 11:27:18.200 INFO sinks_analyser - analysis_func: - Running analysis SinkCoverageAnalyser for CWE78
Step #6 - "compile-libfuzzer-introspector-x86_64": 2026-06-15 11:27:18.208 INFO sinks_analyser - analysis_func: - Running analysis SinkCoverageAnalyser for CWE79
Step #6 - "compile-libfuzzer-introspector-x86_64": 2026-06-15 11:27:18.216 INFO sinks_analyser - analysis_func: - Running analysis SinkCoverageAnalyser for CWE787
Step #6 - "compile-libfuzzer-introspector-x86_64": 2026-06-15 11:27:18.232 INFO sinks_analyser - analysis_func: - Running analysis SinkCoverageAnalyser for CWE89
Step #6 - "compile-libfuzzer-introspector-x86_64": 2026-06-15 11:27:18.239 INFO sinks_analyser - analysis_func: - Running analysis SinkCoverageAnalyser for CWE416
Step #6 - "compile-libfuzzer-introspector-x86_64": 2026-06-15 11:27:18.250 INFO sinks_analyser - analysis_func: - Running analysis SinkCoverageAnalyser for CWE20
Step #6 - "compile-libfuzzer-introspector-x86_64": 2026-06-15 11:27:18.262 INFO sinks_analyser - analysis_func: - Running analysis SinkCoverageAnalyser for CWE22
Step #6 - "compile-libfuzzer-introspector-x86_64": 2026-06-15 11:27:18.273 INFO sinks_analyser - analysis_func: - Running analysis SinkCoverageAnalyser for CWE352
Step #6 - "compile-libfuzzer-introspector-x86_64": 2026-06-15 11:27:18.280 INFO sinks_analyser - analysis_func: - Running analysis SinkCoverageAnalyser for CWE434
Step #6 - "compile-libfuzzer-introspector-x86_64": 2026-06-15 11:27:18.290 INFO sinks_analyser - analysis_func: - Finish running analysis SinkCoverageAnalyser
Step #6 - "compile-libfuzzer-introspector-x86_64": 2026-06-15 11:27:18.290 INFO annotated_cfg - __init__: Creating annotated CFG
Step #6 - "compile-libfuzzer-introspector-x86_64": 2026-06-15 11:27:18.290 INFO annotated_cfg - analysis_func: Creating annotated CFGs
Step #6 - "compile-libfuzzer-introspector-x86_64": 2026-06-15 11:27:18.290 INFO annotated_cfg - analysis_func: Analysing: snappy_compress_fuzzer.cc
Step #6 - "compile-libfuzzer-introspector-x86_64": 2026-06-15 11:27:18.290 INFO annotated_cfg - analysis_func: Analysing: snappy_uncompress_fuzzer.cc
Step #6 - "compile-libfuzzer-introspector-x86_64": 2026-06-15 11:27:18.292 INFO source_code_line_analyser - standalone_analysis: - Running analysis SourceCodeLineAnalyser
Step #6 - "compile-libfuzzer-introspector-x86_64": 2026-06-15 11:27:18.292 INFO far_reach_low_coverage_analyser - standalone_analysis: - Running analysis FarReachLowCoverageAnalyser
Step #6 - "compile-libfuzzer-introspector-x86_64": 2026-06-15 11:27:18.292 INFO far_reach_low_coverage_analyser - standalone_analysis: - Settings: exclude_static_functions: False, only_referenced_functions: False, only_header_functions: False, only_interesting_functions: False, only_easy_fuzz_params: False, min_complexity: 0, max_functions: 10
Step #6 - "compile-libfuzzer-introspector-x86_64": 2026-06-15 11:27:18.345 INFO far_reach_low_coverage_analyser - standalone_analysis: Found 10 function candidiates.
Step #6 - "compile-libfuzzer-introspector-x86_64": 2026-06-15 11:27:18.345 INFO far_reach_low_coverage_analyser - standalone_analysis: Dumping result to /src/inspector/result.json
Step #6 - "compile-libfuzzer-introspector-x86_64": 2026-06-15 11:27:18.346 INFO public_candidate_analyser - standalone_analysis: - Running analysis PublicCandidateAnalyser
Step #6 - "compile-libfuzzer-introspector-x86_64": 2026-06-15 11:27:18.377 INFO public_candidate_analyser - standalone_analysis: Found 1536 function candidiates.
Step #6 - "compile-libfuzzer-introspector-x86_64": 2026-06-15 11:27:18.378 INFO public_candidate_analyser - standalone_analysis: Dumping result to /src/inspector/result.json
Step #6 - "compile-libfuzzer-introspector-x86_64": 2026-06-15 11:27:18.464 INFO oss_fuzz - analyse_folder: Found 276 files to include in analysis
Step #6 - "compile-libfuzzer-introspector-x86_64": 2026-06-15 11:27:18.465 INFO oss_fuzz - analyse_folder: Going C/C++ route
Step #6 - "compile-libfuzzer-introspector-x86_64": 2026-06-15 11:27:18.465 INFO oss_fuzz - analyse_folder: Loading tree-sitter trees
Step #6 - "compile-libfuzzer-introspector-x86_64": 2026-06-15 11:27:18.499 INFO frontend_c_cpp - load_treesitter_trees: harness: /src/snappy/snappy_uncompress_fuzzer.cc
Step #6 - "compile-libfuzzer-introspector-x86_64": 2026-06-15 11:27:21.573 INFO frontend_c_cpp - load_treesitter_trees: harness: /src/snappy/snappy_compress_fuzzer.cc
Step #6 - "compile-libfuzzer-introspector-x86_64": 2026-06-15 11:40:58.902 INFO oss_fuzz - analyse_folder: Dump methods for snappy_uncompress_fuzzer
Step #6 - "compile-libfuzzer-introspector-x86_64": 2026-06-15 11:40:58.902 INFO datatypes - dump_module_logic: Generating report
Step #6 - "compile-libfuzzer-introspector-x86_64": 2026-06-15 12:48:47.841 INFO datatypes - dump_module_logic: Report generated
Step #6 - "compile-libfuzzer-introspector-x86_64": 2026-06-15 12:48:50.157 INFO datatypes - dump_module_logic: Dumping project-wide logic.
Step #6 - "compile-libfuzzer-introspector-x86_64": 2026-06-15 12:48:50.157 INFO datatypes - dump_module_logic: Using safe yaml safe C dumper.
Step #6 - "compile-libfuzzer-introspector-x86_64": 2026-06-15 12:49:05.420 INFO datatypes - dump_module_logic: Dumped
Step #6 - "compile-libfuzzer-introspector-x86_64": 2026-06-15 12:49:05.464 INFO oss_fuzz - analyse_folder: Extracting calltree for snappy_uncompress_fuzzer
Step #6 - "compile-libfuzzer-introspector-x86_64": 2026-06-15 12:49:05.748 INFO oss_fuzz - analyse_folder: Calltree extracted
Step #6 - "compile-libfuzzer-introspector-x86_64": 2026-06-15 12:49:05.748 INFO datatypes - dump_type_definition: Dumping custom type definitions.
Step #6 - "compile-libfuzzer-introspector-x86_64": 2026-06-15 12:49:05.762 INFO datatypes - dump_type_definition: Custom type definitions dumping completed.
Step #6 - "compile-libfuzzer-introspector-x86_64": 2026-06-15 12:49:05.762 INFO datatypes - dump_macro_block_info: Dumping macro blocks information.
Step #6 - "compile-libfuzzer-introspector-x86_64": 2026-06-15 12:49:05.782 INFO datatypes - dump_macro_block_info: Macro blocks information dumping completed.
Step #6 - "compile-libfuzzer-introspector-x86_64": 2026-06-15 12:49:05.783 INFO oss_fuzz - analyse_folder: Dump methods for snappy_compress_fuzzer
Step #6 - "compile-libfuzzer-introspector-x86_64": 2026-06-15 12:49:05.783 INFO datatypes - dump_module_logic: Generating report
Step #6 - "compile-libfuzzer-introspector-x86_64": 2026-06-15 12:49:06.982 INFO datatypes - dump_module_logic: Report generated
Step #6 - "compile-libfuzzer-introspector-x86_64": 2026-06-15 12:49:08.222 INFO datatypes - dump_module_logic: Dumping project-wide logic.
Step #6 - "compile-libfuzzer-introspector-x86_64": 2026-06-15 12:49:08.222 INFO datatypes - dump_module_logic: Using safe yaml safe C dumper.
Step #6 - "compile-libfuzzer-introspector-x86_64": 2026-06-15 12:49:23.757 INFO datatypes - dump_module_logic: Dumped
Step #6 - "compile-libfuzzer-introspector-x86_64": 2026-06-15 12:49:23.806 INFO oss_fuzz - analyse_folder: Extracting calltree for snappy_compress_fuzzer
Step #6 - "compile-libfuzzer-introspector-x86_64": 2026-06-15 12:49:24.764 INFO oss_fuzz - analyse_folder: Calltree extracted
Step #6 - "compile-libfuzzer-introspector-x86_64": 2026-06-15 12:49:24.764 INFO datatypes - dump_type_definition: Dumping custom type definitions.
Step #6 - "compile-libfuzzer-introspector-x86_64": 2026-06-15 12:49:24.783 INFO datatypes - dump_type_definition: Custom type definitions dumping completed.
Step #6 - "compile-libfuzzer-introspector-x86_64": 2026-06-15 12:49:24.783 INFO datatypes - dump_macro_block_info: Dumping macro blocks information.
Step #6 - "compile-libfuzzer-introspector-x86_64": 2026-06-15 12:49:24.812 INFO datatypes - dump_macro_block_info: Macro blocks information dumping completed.
Step #6 - "compile-libfuzzer-introspector-x86_64": 2026-06-15 12:49:24.900 INFO analysis - load_data_files: Loading profiles using files
Step #6 - "compile-libfuzzer-introspector-x86_64": 2026-06-15 12:49:24.900 INFO data_loader - load_all_profiles: Loading profiles from /src
Step #6 - "compile-libfuzzer-introspector-x86_64": 2026-06-15 12:49:24.937 INFO data_loader - load_all_profiles: []
Step #6 - "compile-libfuzzer-introspector-x86_64": 2026-06-15 12:49:24.938 INFO data_loader - load_all_profiles: - found 4 profiles to load
Step #6 - "compile-libfuzzer-introspector-x86_64": 2026-06-15 12:49:24.970 INFO data_loader - read_fuzzer_data_file_to_profile: - loading /src/inspector/fuzzerLogFile-snappy_compress_fuzzer.data
Step #6 - "compile-libfuzzer-introspector-x86_64": 2026-06-15 12:49:24.971 INFO data_loader - read_fuzzer_data_file_to_profile: target data f: /src/inspector/fuzzerLogFile-snappy_compress_fuzzer.data
Step #6 - "compile-libfuzzer-introspector-x86_64": 2026-06-15 12:49:24.971 INFO utils - data_file_read_yaml: Set base loader to use CSafeLoader
Step #6 - "compile-libfuzzer-introspector-x86_64": 2026-06-15 12:49:24.975 INFO data_loader - read_fuzzer_data_file_to_profile: - loading /src/inspector/fuzzerLogFile-snappy_uncompress_fuzzer.data
Step #6 - "compile-libfuzzer-introspector-x86_64": 2026-06-15 12:49:24.975 INFO data_loader - read_fuzzer_data_file_to_profile: target data f: /src/inspector/fuzzerLogFile-snappy_uncompress_fuzzer.data
Step #6 - "compile-libfuzzer-introspector-x86_64": 2026-06-15 12:49:24.975 INFO utils - data_file_read_yaml: Set base loader to use CSafeLoader
Step #6 - "compile-libfuzzer-introspector-x86_64": 2026-06-15 12:49:24.980 INFO data_loader - read_fuzzer_data_file_to_profile: - loading /src/inspector/second-frontend-run/fuzzerLogFile-snappy_compress_fuzzer.data
Step #6 - "compile-libfuzzer-introspector-x86_64": 2026-06-15 12:49:24.980 INFO data_loader - read_fuzzer_data_file_to_profile: target data f: /src/inspector/second-frontend-run/fuzzerLogFile-snappy_compress_fuzzer.data
Step #6 - "compile-libfuzzer-introspector-x86_64": 2026-06-15 12:49:24.981 INFO utils - data_file_read_yaml: Set base loader to use CSafeLoader
Step #6 - "compile-libfuzzer-introspector-x86_64": 2026-06-15 12:49:24.985 INFO data_loader - read_fuzzer_data_file_to_profile: - loading /src/inspector/second-frontend-run/fuzzerLogFile-snappy_uncompress_fuzzer.data
Step #6 - "compile-libfuzzer-introspector-x86_64": 2026-06-15 12:49:24.986 INFO data_loader - read_fuzzer_data_file_to_profile: target data f: /src/inspector/second-frontend-run/fuzzerLogFile-snappy_uncompress_fuzzer.data
Step #6 - "compile-libfuzzer-introspector-x86_64": 2026-06-15 12:49:24.986 INFO utils - data_file_read_yaml: Set base loader to use CSafeLoader
Step #6 - "compile-libfuzzer-introspector-x86_64": 2026-06-15 12:49:50.200 INFO utils - data_file_read_yaml: Loaded single yaml module
Step #6 - "compile-libfuzzer-introspector-x86_64": 2026-06-15 12:49:50.247 INFO utils - data_file_read_yaml: Loaded single yaml module
Step #6 - "compile-libfuzzer-introspector-x86_64": 2026-06-15 12:49:50.269 INFO utils - data_file_read_yaml: Loaded single yaml module
Step #6 - "compile-libfuzzer-introspector-x86_64": 2026-06-15 12:49:50.357 INFO utils - data_file_read_yaml: Loaded single yaml module
Step #6 - "compile-libfuzzer-introspector-x86_64": 2026-06-15 12:49:50.783 INFO data_loader - read_fuzzer_data_file_to_profile: Returning profile
Step #6 - "compile-libfuzzer-introspector-x86_64": 2026-06-15 12:49:50.826 INFO data_loader - read_fuzzer_data_file_to_profile: Returning profile
Step #6 - "compile-libfuzzer-introspector-x86_64": 2026-06-15 12:49:50.850 INFO data_loader - read_fuzzer_data_file_to_profile: Returning profile
Step #6 - "compile-libfuzzer-introspector-x86_64": 2026-06-15 12:49:50.936 INFO data_loader - read_fuzzer_data_file_to_profile: Returning profile
Step #6 - "compile-libfuzzer-introspector-x86_64": 2026-06-15 12:49:52.428 INFO analysis - load_data_files: Found 4 profiles
Step #6 - "compile-libfuzzer-introspector-x86_64": 2026-06-15 12:49:52.428 INFO analysis - load_data_files: [+] Accummulating profiles
Step #6 - "compile-libfuzzer-introspector-x86_64": 2026-06-15 12:49:52.428 INFO analysis - load_data_files: Accummulating using multiprocessing
Step #6 - "compile-libfuzzer-introspector-x86_64": 2026-06-15 12:49:52.470 INFO fuzzer_profile - accummulate_profile: /src/snappy/snappy_compress_fuzzer.cc: propagating functions reached
Step #6 - "compile-libfuzzer-introspector-x86_64": 2026-06-15 12:49:52.482 INFO fuzzer_profile - accummulate_profile: /src/snappy/snappy_uncompress_fuzzer.cc: propagating functions reached
Step #6 - "compile-libfuzzer-introspector-x86_64": 2026-06-15 12:49:52.494 INFO fuzzer_profile - accummulate_profile: /src/snappy/snappy_compress_fuzzer.cc: propagating functions reached
Step #6 - "compile-libfuzzer-introspector-x86_64": 2026-06-15 12:49:52.507 INFO fuzzer_profile - accummulate_profile: /src/snappy/snappy_uncompress_fuzzer.cc: propagating functions reached
Step #6 - "compile-libfuzzer-introspector-x86_64": 2026-06-15 12:49:52.572 INFO fuzzer_profile - accummulate_profile: /src/snappy/snappy_uncompress_fuzzer.cc: setting reached funcs
Step #6 - "compile-libfuzzer-introspector-x86_64": 2026-06-15 12:49:52.572 INFO fuzzer_profile - accummulate_profile: /src/snappy/snappy_uncompress_fuzzer.cc: setting unreached funcs
Step #6 - "compile-libfuzzer-introspector-x86_64": 2026-06-15 12:49:52.575 INFO fuzzer_profile - accummulate_profile: /src/snappy/snappy_compress_fuzzer.cc: setting reached funcs
Step #6 - "compile-libfuzzer-introspector-x86_64": 2026-06-15 12:49:52.575 INFO fuzzer_profile - accummulate_profile: /src/snappy/snappy_compress_fuzzer.cc: setting unreached funcs
Step #6 - "compile-libfuzzer-introspector-x86_64": 2026-06-15 12:49:52.576 INFO fuzzer_profile - accummulate_profile: /src/snappy/snappy_uncompress_fuzzer.cc: loading coverage
Step #6 - "compile-libfuzzer-introspector-x86_64": 2026-06-15 12:49:52.576 INFO fuzzer_profile - _load_coverage: Loading coverage of type c-cpp
Step #6 - "compile-libfuzzer-introspector-x86_64": 2026-06-15 12:49:52.576 INFO code_coverage - load_llvm_coverage: Loading LLVM coverage for target /src/snappy/snappy_uncompress_fuzzer.cc
Step #6 - "compile-libfuzzer-introspector-x86_64": 2026-06-15 12:49:52.582 INFO fuzzer_profile - accummulate_profile: /src/snappy/snappy_compress_fuzzer.cc: loading coverage
Step #6 - "compile-libfuzzer-introspector-x86_64": 2026-06-15 12:49:52.582 INFO fuzzer_profile - _load_coverage: Loading coverage of type c-cpp
Step #6 - "compile-libfuzzer-introspector-x86_64": 2026-06-15 12:49:52.582 INFO code_coverage - load_llvm_coverage: Loading LLVM coverage for target /src/snappy/snappy_compress_fuzzer.cc
Step #6 - "compile-libfuzzer-introspector-x86_64": 2026-06-15 12:49:52.583 INFO fuzzer_profile - accummulate_profile: /src/snappy/snappy_compress_fuzzer.cc: setting reached funcs
Step #6 - "compile-libfuzzer-introspector-x86_64": 2026-06-15 12:49:52.583 INFO fuzzer_profile - accummulate_profile: /src/snappy/snappy_compress_fuzzer.cc: setting unreached funcs
Step #6 - "compile-libfuzzer-introspector-x86_64": 2026-06-15 12:49:52.588 INFO fuzzer_profile - accummulate_profile: /src/snappy/snappy_compress_fuzzer.cc: loading coverage
Step #6 - "compile-libfuzzer-introspector-x86_64": 2026-06-15 12:49:52.589 INFO fuzzer_profile - _load_coverage: Loading coverage of type c-cpp
Step #6 - "compile-libfuzzer-introspector-x86_64": 2026-06-15 12:49:52.589 INFO code_coverage - load_llvm_coverage: Loading LLVM coverage for target /src/snappy/snappy_compress_fuzzer.cc
Step #6 - "compile-libfuzzer-introspector-x86_64": 2026-06-15 12:49:52.589 INFO fuzzer_profile - accummulate_profile: /src/snappy/snappy_uncompress_fuzzer.cc: setting reached funcs
Step #6 - "compile-libfuzzer-introspector-x86_64": 2026-06-15 12:49:52.589 INFO fuzzer_profile - accummulate_profile: /src/snappy/snappy_uncompress_fuzzer.cc: setting unreached funcs
Step #6 - "compile-libfuzzer-introspector-x86_64": 2026-06-15 12:49:52.591 INFO code_coverage - load_llvm_coverage: Found 0 coverage reports
Step #6 - "compile-libfuzzer-introspector-x86_64": 2026-06-15 12:49:52.591 INFO code_coverage - load_llvm_coverage: Using the following coverages []
Step #6 - "compile-libfuzzer-introspector-x86_64": 2026-06-15 12:49:52.591 INFO fuzzer_profile - accummulate_profile: /src/snappy/snappy_uncompress_fuzzer.cc: setting file targets
Step #6 - "compile-libfuzzer-introspector-x86_64": 2026-06-15 12:49:52.591 INFO fuzzer_profile - accummulate_profile: /src/snappy/snappy_uncompress_fuzzer.cc: setting total basic blocks
Step #6 - "compile-libfuzzer-introspector-x86_64": 2026-06-15 12:49:52.591 INFO fuzzer_profile - accummulate_profile: /src/snappy/snappy_uncompress_fuzzer.cc: setting cyclomatic complexity
Step #6 - "compile-libfuzzer-introspector-x86_64": 2026-06-15 12:49:52.591 INFO fuzzer_profile - accummulate_profile: /src/snappy/snappy_uncompress_fuzzer.cc: setting fd cache
Step #6 - "compile-libfuzzer-introspector-x86_64": 2026-06-15 12:49:52.592 INFO fuzzer_profile - accummulate_profile: /src/snappy/snappy_uncompress_fuzzer.cc: loading coverage
Step #6 - "compile-libfuzzer-introspector-x86_64": 2026-06-15 12:49:52.593 INFO fuzzer_profile - _load_coverage: Loading coverage of type c-cpp
Step #6 - "compile-libfuzzer-introspector-x86_64": 2026-06-15 12:49:52.593 INFO code_coverage - load_llvm_coverage: Loading LLVM coverage for target /src/snappy/snappy_uncompress_fuzzer.cc
Step #6 - "compile-libfuzzer-introspector-x86_64": 2026-06-15 12:49:52.596 INFO code_coverage - load_llvm_coverage: Found 0 coverage reports
Step #6 - "compile-libfuzzer-introspector-x86_64": 2026-06-15 12:49:52.596 INFO code_coverage - load_llvm_coverage: Using the following coverages []
Step #6 - "compile-libfuzzer-introspector-x86_64": 2026-06-15 12:49:52.597 INFO fuzzer_profile - accummulate_profile: /src/snappy/snappy_compress_fuzzer.cc: setting file targets
Step #6 - "compile-libfuzzer-introspector-x86_64": 2026-06-15 12:49:52.597 INFO fuzzer_profile - accummulate_profile: /src/snappy/snappy_compress_fuzzer.cc: setting total basic blocks
Step #6 - "compile-libfuzzer-introspector-x86_64": 2026-06-15 12:49:52.597 INFO fuzzer_profile - accummulate_profile: /src/snappy/snappy_compress_fuzzer.cc: setting cyclomatic complexity
Step #6 - "compile-libfuzzer-introspector-x86_64": 2026-06-15 12:49:52.597 INFO fuzzer_profile - accummulate_profile: /src/snappy/snappy_compress_fuzzer.cc: setting fd cache
Step #6 - "compile-libfuzzer-introspector-x86_64": 2026-06-15 12:49:52.603 INFO code_coverage - load_llvm_coverage: Found 0 coverage reports
Step #6 - "compile-libfuzzer-introspector-x86_64": 2026-06-15 12:49:52.603 INFO code_coverage - load_llvm_coverage: Using the following coverages []
Step #6 - "compile-libfuzzer-introspector-x86_64": 2026-06-15 12:49:52.603 INFO fuzzer_profile - accummulate_profile: /src/snappy/snappy_compress_fuzzer.cc: setting file targets
Step #6 - "compile-libfuzzer-introspector-x86_64": 2026-06-15 12:49:52.603 INFO fuzzer_profile - accummulate_profile: /src/snappy/snappy_compress_fuzzer.cc: setting total basic blocks
Step #6 - "compile-libfuzzer-introspector-x86_64": 2026-06-15 12:49:52.603 INFO fuzzer_profile - accummulate_profile: /src/snappy/snappy_compress_fuzzer.cc: setting cyclomatic complexity
Step #6 - "compile-libfuzzer-introspector-x86_64": 2026-06-15 12:49:52.603 INFO fuzzer_profile - accummulate_profile: /src/snappy/snappy_compress_fuzzer.cc: setting fd cache
Step #6 - "compile-libfuzzer-introspector-x86_64": 2026-06-15 12:49:52.604 INFO fuzzer_profile - accummulate_profile: /src/snappy/snappy_uncompress_fuzzer.cc: setting reached funcs in runtime
Step #6 - "compile-libfuzzer-introspector-x86_64": 2026-06-15 12:49:52.604 INFO fuzzer_profile - accummulate_profile: /src/snappy/snappy_uncompress_fuzzer.cc: finished accummulating profile
Step #6 - "compile-libfuzzer-introspector-x86_64": 2026-06-15 12:49:52.606 INFO code_coverage - load_llvm_coverage: Found 0 coverage reports
Step #6 - "compile-libfuzzer-introspector-x86_64": 2026-06-15 12:49:52.607 INFO code_coverage - load_llvm_coverage: Using the following coverages []
Step #6 - "compile-libfuzzer-introspector-x86_64": 2026-06-15 12:49:52.607 INFO fuzzer_profile - accummulate_profile: /src/snappy/snappy_uncompress_fuzzer.cc: setting file targets
Step #6 - "compile-libfuzzer-introspector-x86_64": 2026-06-15 12:49:52.607 INFO fuzzer_profile - accummulate_profile: /src/snappy/snappy_uncompress_fuzzer.cc: setting total basic blocks
Step #6 - "compile-libfuzzer-introspector-x86_64": 2026-06-15 12:49:52.607 INFO fuzzer_profile - accummulate_profile: /src/snappy/snappy_uncompress_fuzzer.cc: setting cyclomatic complexity
Step #6 - "compile-libfuzzer-introspector-x86_64": 2026-06-15 12:49:52.607 INFO fuzzer_profile - accummulate_profile: /src/snappy/snappy_uncompress_fuzzer.cc: setting fd cache
Step #6 - "compile-libfuzzer-introspector-x86_64": 2026-06-15 12:49:52.613 INFO fuzzer_profile - accummulate_profile: /src/snappy/snappy_compress_fuzzer.cc: setting reached funcs in runtime
Step #6 - "compile-libfuzzer-introspector-x86_64": 2026-06-15 12:49:52.614 INFO fuzzer_profile - accummulate_profile: /src/snappy/snappy_compress_fuzzer.cc: finished accummulating profile
Step #6 - "compile-libfuzzer-introspector-x86_64": 2026-06-15 12:49:52.616 INFO fuzzer_profile - accummulate_profile: /src/snappy/snappy_compress_fuzzer.cc: setting reached funcs in runtime
Step #6 - "compile-libfuzzer-introspector-x86_64": 2026-06-15 12:49:52.616 INFO fuzzer_profile - accummulate_profile: /src/snappy/snappy_compress_fuzzer.cc: finished accummulating profile
Step #6 - "compile-libfuzzer-introspector-x86_64": 2026-06-15 12:49:52.620 INFO fuzzer_profile - accummulate_profile: /src/snappy/snappy_uncompress_fuzzer.cc: setting reached funcs in runtime
Step #6 - "compile-libfuzzer-introspector-x86_64": 2026-06-15 12:49:52.620 INFO fuzzer_profile - accummulate_profile: /src/snappy/snappy_uncompress_fuzzer.cc: finished accummulating profile
Step #6 - "compile-libfuzzer-introspector-x86_64": 2026-06-15 12:49:53.908 INFO analysis - load_data_files: [+] Creating project profile
Step #6 - "compile-libfuzzer-introspector-x86_64": 2026-06-15 12:49:53.909 INFO project_profile - __init__: Creating merged profile of 4 profiles
Step #6 - "compile-libfuzzer-introspector-x86_64": 2026-06-15 12:49:53.909 INFO project_profile - __init__: Populating functions reached
Step #6 - "compile-libfuzzer-introspector-x86_64": 2026-06-15 12:49:53.909 INFO project_profile - __init__: Populating functions unreached
Step #6 - "compile-libfuzzer-introspector-x86_64": 2026-06-15 12:49:53.913 INFO project_profile - __init__: Creating all_functions dictionary
Step #6 - "compile-libfuzzer-introspector-x86_64": 2026-06-15 12:49:54.042 INFO project_profile - __init__: Gathering complexity and incoming references of each function
Step #6 - "compile-libfuzzer-introspector-x86_64": 2026-06-15 12:49:54.127 INFO project_profile - __init__: Completed creationg of merged profile
Step #6 - "compile-libfuzzer-introspector-x86_64": 2026-06-15 12:49:54.127 INFO analysis - load_data_files: [+] Refining profiles
Step #6 - "compile-libfuzzer-introspector-x86_64": 2026-06-15 12:49:54.147 INFO utils - get_target_coverage_url: Extracting coverage for /src/inspector/second-frontend-run -- snappy_compress_fuzzer.cc
Step #6 - "compile-libfuzzer-introspector-x86_64": 2026-06-15 12:49:54.147 INFO analysis - overlay_calltree_with_coverage: Using coverage url: /src/inspector/second-frontend-run
Step #6 - "compile-libfuzzer-introspector-x86_64": 2026-06-15 12:49:54.148 INFO analysis - get_node_coverage_hitcount: There is no coverage data (not even all negative).
Step #6 - "compile-libfuzzer-introspector-x86_64": 2026-06-15 12:49:54.149 INFO analysis - overlay_calltree_with_coverage: Overlaying 2
Step #6 - "compile-libfuzzer-introspector-x86_64": 2026-06-15 12:49:54.149 INFO analysis - overlay_calltree_with_coverage: Overlaying 3
Step #6 - "compile-libfuzzer-introspector-x86_64": 2026-06-15 12:49:54.149 INFO analysis - overlay_calltree_with_coverage: Updating branch complexities
Step #6 - "compile-libfuzzer-introspector-x86_64": 2026-06-15 12:49:54.151 INFO analysis - overlay_calltree_with_coverage: [+] found 0 branch blockers.
Step #6 - "compile-libfuzzer-introspector-x86_64": 2026-06-15 12:49:54.152 INFO utils - get_target_coverage_url: Extracting coverage for /src/inspector/second-frontend-run -- snappy_uncompress_fuzzer.cc
Step #6 - "compile-libfuzzer-introspector-x86_64": 2026-06-15 12:49:54.152 INFO analysis - overlay_calltree_with_coverage: Using coverage url: /src/inspector/second-frontend-run
Step #6 - "compile-libfuzzer-introspector-x86_64": 2026-06-15 12:49:54.152 INFO analysis - get_node_coverage_hitcount: There is no coverage data (not even all negative).
Step #6 - "compile-libfuzzer-introspector-x86_64": 2026-06-15 12:49:54.152 INFO analysis - overlay_calltree_with_coverage: Overlaying 2
Step #6 - "compile-libfuzzer-introspector-x86_64": 2026-06-15 12:49:54.152 INFO analysis - overlay_calltree_with_coverage: Overlaying 3
Step #6 - "compile-libfuzzer-introspector-x86_64": 2026-06-15 12:49:54.152 INFO analysis - overlay_calltree_with_coverage: Updating branch complexities
Step #6 - "compile-libfuzzer-introspector-x86_64": 2026-06-15 12:49:54.155 INFO analysis - overlay_calltree_with_coverage: [+] found 0 branch blockers.
Step #6 - "compile-libfuzzer-introspector-x86_64": 2026-06-15 12:49:54.156 INFO utils - get_target_coverage_url: Extracting coverage for /src/inspector/second-frontend-run -- snappy_uncompress_fuzzer.cc
Step #6 - "compile-libfuzzer-introspector-x86_64": 2026-06-15 12:49:54.156 INFO analysis - overlay_calltree_with_coverage: Using coverage url: /src/inspector/second-frontend-run
Step #6 - "compile-libfuzzer-introspector-x86_64": 2026-06-15 12:49:54.156 INFO analysis - get_node_coverage_hitcount: There is no coverage data (not even all negative).
Step #6 - "compile-libfuzzer-introspector-x86_64": 2026-06-15 12:49:54.156 INFO analysis - overlay_calltree_with_coverage: Overlaying 2
Step #6 - "compile-libfuzzer-introspector-x86_64": 2026-06-15 12:49:54.156 INFO analysis - overlay_calltree_with_coverage: Overlaying 3
Step #6 - "compile-libfuzzer-introspector-x86_64": 2026-06-15 12:49:54.156 INFO analysis - overlay_calltree_with_coverage: Updating branch complexities
Step #6 - "compile-libfuzzer-introspector-x86_64": 2026-06-15 12:49:54.158 INFO analysis - overlay_calltree_with_coverage: [+] found 0 branch blockers.
Step #6 - "compile-libfuzzer-introspector-x86_64": 2026-06-15 12:49:54.159 INFO utils - get_target_coverage_url: Extracting coverage for /src/inspector/second-frontend-run -- snappy_compress_fuzzer.cc
Step #6 - "compile-libfuzzer-introspector-x86_64": 2026-06-15 12:49:54.159 INFO analysis - overlay_calltree_with_coverage: Using coverage url: /src/inspector/second-frontend-run
Step #6 - "compile-libfuzzer-introspector-x86_64": 2026-06-15 12:49:54.159 INFO analysis - get_node_coverage_hitcount: There is no coverage data (not even all negative).
Step #6 - "compile-libfuzzer-introspector-x86_64": 2026-06-15 12:49:54.160 INFO analysis - overlay_calltree_with_coverage: Overlaying 2
Step #6 - "compile-libfuzzer-introspector-x86_64": 2026-06-15 12:49:54.160 INFO analysis - overlay_calltree_with_coverage: Overlaying 3
Step #6 - "compile-libfuzzer-introspector-x86_64": 2026-06-15 12:49:54.160 INFO analysis - overlay_calltree_with_coverage: Updating branch complexities
Step #6 - "compile-libfuzzer-introspector-x86_64": 2026-06-15 12:49:54.162 INFO analysis - overlay_calltree_with_coverage: [+] found 0 branch blockers.
Step #6 - "compile-libfuzzer-introspector-x86_64": 2026-06-15 12:49:54.410 INFO analysis - extract_tests_from_directories: All test files
Step #6 - "compile-libfuzzer-introspector-x86_64": 2026-06-15 12:49:54.410 INFO analysis - extract_tests_from_directories: /src/snappy/snappy-test.cc
Step #6 - "compile-libfuzzer-introspector-x86_64": 2026-06-15 12:49:54.410 INFO analysis - extract_tests_from_directories: /src/snappy/snappy_test_tool.cc
Step #6 - "compile-libfuzzer-introspector-x86_64": 2026-06-15 12:49:54.410 INFO analysis - extract_tests_from_directories: /src/snappy/snappy_test_data.cc
Step #6 - "compile-libfuzzer-introspector-x86_64": 2026-06-15 12:49:54.410 INFO analysis - extract_tests_from_directories: /src/snappy/snappy_unittest.cc
Step #6 - "compile-libfuzzer-introspector-x86_64": 2026-06-15 12:49:54.567 INFO utils - get_target_coverage_url: Extracting coverage for https://storage.googleapis.com/oss-fuzz-coverage/snappy/reports/20260615/linux -- snappy_compress_fuzzer.cc
Step #6 - "compile-libfuzzer-introspector-x86_64": 2026-06-15 12:49:54.567 INFO utils - get_target_coverage_url: Extracting coverage for https://storage.googleapis.com/oss-fuzz-coverage/snappy/reports/20260615/linux -- snappy_uncompress_fuzzer.cc
Step #6 - "compile-libfuzzer-introspector-x86_64": 2026-06-15 12:49:54.568 INFO debug_info - load_debug_all_yaml_files: Set base loader to use CSafeLoader
Step #6 - "compile-libfuzzer-introspector-x86_64": 2026-06-15 12:49:54.568 INFO debug_info - load_debug_all_yaml_files: Set base loader to use CSafeLoader
Step #6 - "compile-libfuzzer-introspector-x86_64": 2026-06-15 12:49:54.569 INFO debug_info - correlate_debugged_function_to_debug_types: Creating dictionary
Step #6 - "compile-libfuzzer-introspector-x86_64": 2026-06-15 12:49:54.569 INFO debug_info - create_friendly_debug_types: Have to create for 0 addresses
Step #6 - "compile-libfuzzer-introspector-x86_64": 2026-06-15 12:49:54.569 INFO debug_info - correlate_debugged_function_to_debug_types: Finished creating dictionary
Step #6 - "compile-libfuzzer-introspector-x86_64": 2026-06-15 12:49:54.600 INFO analysis - extract_tests_from_directories: All test files
Step #6 - "compile-libfuzzer-introspector-x86_64": 2026-06-15 12:49:54.949 INFO html_report - write_content_to_html_files: Dumping report
Step #6 - "compile-libfuzzer-introspector-x86_64": 2026-06-15 12:49:55.447 INFO cli - main: Ending fuzz introspector post-processing
Step #6 - "compile-libfuzzer-introspector-x86_64": sending incremental file list
Step #6 - "compile-libfuzzer-introspector-x86_64": created directory /workspace/out/libfuzzer-introspector-x86_64/inspector
Step #6 - "compile-libfuzzer-introspector-x86_64": ./
Step #6 - "compile-libfuzzer-introspector-x86_64": all-files.json
Step #6 - "compile-libfuzzer-introspector-x86_64": all-friendly-debug-types.json
Step #6 - "compile-libfuzzer-introspector-x86_64": all-fuzz-introspector-functions.json
Step #6 - "compile-libfuzzer-introspector-x86_64": all_debug_info.json
Step #6 - "compile-libfuzzer-introspector-x86_64": all_functions.js
Step #6 - "compile-libfuzzer-introspector-x86_64": all_tests.json
Step #6 - "compile-libfuzzer-introspector-x86_64": all_tests_with_xreference.json
Step #6 - "compile-libfuzzer-introspector-x86_64": analysis_1.js
Step #6 - "compile-libfuzzer-introspector-x86_64": branch-blockers.json
Step #6 - "compile-libfuzzer-introspector-x86_64": calltree.js
Step #6 - "compile-libfuzzer-introspector-x86_64": calltree_view_0.html
Step #6 - "compile-libfuzzer-introspector-x86_64": calltree_view_1.html
Step #6 - "compile-libfuzzer-introspector-x86_64": clike.js
Step #6 - "compile-libfuzzer-introspector-x86_64": custom.js
Step #6 - "compile-libfuzzer-introspector-x86_64": full_type_defs.json
Step #6 - "compile-libfuzzer-introspector-x86_64": fuzz_report.html
Step #6 - "compile-libfuzzer-introspector-x86_64": fuzzerLogFile-snappy_compress_fuzzer.data
Step #6 - "compile-libfuzzer-introspector-x86_64": fuzzerLogFile-snappy_compress_fuzzer.data.yaml
Step #6 - "compile-libfuzzer-introspector-x86_64": fuzzerLogFile-snappy_uncompress_fuzzer.data
Step #6 - "compile-libfuzzer-introspector-x86_64": fuzzerLogFile-snappy_uncompress_fuzzer.data.yaml
Step #6 - "compile-libfuzzer-introspector-x86_64": fuzzer_table_data.js
Step #6 - "compile-libfuzzer-introspector-x86_64": macro_block_info.json
Step #6 - "compile-libfuzzer-introspector-x86_64": prism.css
Step #6 - "compile-libfuzzer-introspector-x86_64": prism.js
Step #6 - "compile-libfuzzer-introspector-x86_64": result.json
Step #6 - "compile-libfuzzer-introspector-x86_64": snappy_compress_fuzzer.cc_colormap.png
Step #6 - "compile-libfuzzer-introspector-x86_64": snappy_uncompress_fuzzer.cc_colormap.png
Step #6 - "compile-libfuzzer-introspector-x86_64": styles.css
Step #6 - "compile-libfuzzer-introspector-x86_64": summary.json
Step #6 - "compile-libfuzzer-introspector-x86_64": test-files.json
Step #6 - "compile-libfuzzer-introspector-x86_64": light/
Step #6 - "compile-libfuzzer-introspector-x86_64": light/all_files.json
Step #6 - "compile-libfuzzer-introspector-x86_64": light/all_pairs.json
Step #6 - "compile-libfuzzer-introspector-x86_64": light/all_tests.json
Step #6 - "compile-libfuzzer-introspector-x86_64": light/source_files/
Step #6 - "compile-libfuzzer-introspector-x86_64": light/source_files/src/
Step #6 - "compile-libfuzzer-introspector-x86_64": light/source_files/src/snappy/
Step #6 - "compile-libfuzzer-introspector-x86_64": light/source_files/src/snappy/snappy-c.cc
Step #6 - "compile-libfuzzer-introspector-x86_64": light/source_files/src/snappy/snappy-c.h
Step #6 - "compile-libfuzzer-introspector-x86_64": light/source_files/src/snappy/snappy-internal.h
Step #6 - "compile-libfuzzer-introspector-x86_64": light/source_files/src/snappy/snappy-sinksource.cc
Step #6 - "compile-libfuzzer-introspector-x86_64": light/source_files/src/snappy/snappy-sinksource.h
Step #6 - "compile-libfuzzer-introspector-x86_64": light/source_files/src/snappy/snappy-stubs-internal.cc
Step #6 - "compile-libfuzzer-introspector-x86_64": light/source_files/src/snappy/snappy-stubs-internal.h
Step #6 - "compile-libfuzzer-introspector-x86_64": light/source_files/src/snappy/snappy-test.cc
Step #6 - "compile-libfuzzer-introspector-x86_64": light/source_files/src/snappy/snappy-test.h
Step #6 - "compile-libfuzzer-introspector-x86_64": light/source_files/src/snappy/snappy.cc
Step #6 - "compile-libfuzzer-introspector-x86_64": light/source_files/src/snappy/snappy.h
Step #6 - "compile-libfuzzer-introspector-x86_64": light/source_files/src/snappy/snappy_benchmark.cc
Step #6 - "compile-libfuzzer-introspector-x86_64": light/source_files/src/snappy/snappy_compress_fuzzer.cc
Step #6 - "compile-libfuzzer-introspector-x86_64": light/source_files/src/snappy/snappy_test_data.cc
Step #6 - "compile-libfuzzer-introspector-x86_64": light/source_files/src/snappy/snappy_test_data.h
Step #6 - "compile-libfuzzer-introspector-x86_64": light/source_files/src/snappy/snappy_test_tool.cc
Step #6 - "compile-libfuzzer-introspector-x86_64": light/source_files/src/snappy/snappy_uncompress_fuzzer.cc
Step #6 - "compile-libfuzzer-introspector-x86_64": light/source_files/src/snappy/snappy_unittest.cc
Step #6 - "compile-libfuzzer-introspector-x86_64": second-frontend-run/
Step #6 - "compile-libfuzzer-introspector-x86_64": second-frontend-run/full_type_defs.json
Step #6 - "compile-libfuzzer-introspector-x86_64": second-frontend-run/fuzzerLogFile-snappy_compress_fuzzer.data
Step #6 - "compile-libfuzzer-introspector-x86_64": second-frontend-run/fuzzerLogFile-snappy_compress_fuzzer.data.yaml
Step #6 - "compile-libfuzzer-introspector-x86_64": second-frontend-run/fuzzerLogFile-snappy_uncompress_fuzzer.data
Step #6 - "compile-libfuzzer-introspector-x86_64": second-frontend-run/fuzzerLogFile-snappy_uncompress_fuzzer.data.yaml
Step #6 - "compile-libfuzzer-introspector-x86_64": second-frontend-run/macro_block_info.json
Step #6 - "compile-libfuzzer-introspector-x86_64": source-code/
Step #6 - "compile-libfuzzer-introspector-x86_64": source-code/src/
Step #6 - "compile-libfuzzer-introspector-x86_64": source-code/src/snappy/
Step #6 - "compile-libfuzzer-introspector-x86_64": source-code/src/snappy/snappy-c.cc
Step #6 - "compile-libfuzzer-introspector-x86_64": source-code/src/snappy/snappy-c.h
Step #6 - "compile-libfuzzer-introspector-x86_64": source-code/src/snappy/snappy-internal.h
Step #6 - "compile-libfuzzer-introspector-x86_64": source-code/src/snappy/snappy-sinksource.cc
Step #6 - "compile-libfuzzer-introspector-x86_64": source-code/src/snappy/snappy-sinksource.h
Step #6 - "compile-libfuzzer-introspector-x86_64": source-code/src/snappy/snappy-stubs-internal.cc
Step #6 - "compile-libfuzzer-introspector-x86_64": source-code/src/snappy/snappy-stubs-internal.h
Step #6 - "compile-libfuzzer-introspector-x86_64": source-code/src/snappy/snappy-test.cc
Step #6 - "compile-libfuzzer-introspector-x86_64": source-code/src/snappy/snappy-test.h
Step #6 - "compile-libfuzzer-introspector-x86_64": source-code/src/snappy/snappy.cc
Step #6 - "compile-libfuzzer-introspector-x86_64": source-code/src/snappy/snappy.h
Step #6 - "compile-libfuzzer-introspector-x86_64": source-code/src/snappy/snappy_benchmark.cc
Step #6 - "compile-libfuzzer-introspector-x86_64": source-code/src/snappy/snappy_compress_fuzzer.cc
Step #6 - "compile-libfuzzer-introspector-x86_64": source-code/src/snappy/snappy_test_data.cc
Step #6 - "compile-libfuzzer-introspector-x86_64": source-code/src/snappy/snappy_test_data.h
Step #6 - "compile-libfuzzer-introspector-x86_64": source-code/src/snappy/snappy_test_tool.cc
Step #6 - "compile-libfuzzer-introspector-x86_64": source-code/src/snappy/snappy_uncompress_fuzzer.cc
Step #6 - "compile-libfuzzer-introspector-x86_64": source-code/src/snappy/snappy_unittest.cc
Step #6 - "compile-libfuzzer-introspector-x86_64":
Step #6 - "compile-libfuzzer-introspector-x86_64": sent 177,608,199 bytes received 1,569 bytes 355,219,536.00 bytes/sec
Step #6 - "compile-libfuzzer-introspector-x86_64": total size is 177,559,160 speedup is 1.00
Step #6 - "compile-libfuzzer-introspector-x86_64": ---------------------------------------------------------------
Step #6 - "compile-libfuzzer-introspector-x86_64": CC=clang
Step #6 - "compile-libfuzzer-introspector-x86_64": CXX=clang++
Step #6 - "compile-libfuzzer-introspector-x86_64": CFLAGS=-O1 -fno-omit-frame-pointer -gline-tables-only -Wno-error=incompatible-function-pointer-types -Wno-error=int-conversion -Wno-error=deprecated-declarations -Wno-error=implicit-function-declaration -Wno-error=implicit-int -Wno-error=unknown-warning-option -Wno-error=vla-cxx-extension -DFUZZING_BUILD_MODE_UNSAFE_FOR_PRODUCTION -O0 -flto -fno-inline-functions -fuse-ld=gold -Wno-unused-command-line-argument -fsanitize=fuzzer-no-link -g
Step #6 - "compile-libfuzzer-introspector-x86_64": CXXFLAGS=-O1 -fno-omit-frame-pointer -gline-tables-only -Wno-error=incompatible-function-pointer-types -Wno-error=int-conversion -Wno-error=deprecated-declarations -Wno-error=implicit-function-declaration -Wno-error=implicit-int -Wno-error=unknown-warning-option -Wno-error=vla-cxx-extension -DFUZZING_BUILD_MODE_UNSAFE_FOR_PRODUCTION -O0 -flto -fno-inline-functions -fuse-ld=gold -Wno-unused-command-line-argument -fsanitize=fuzzer-no-link -stdlib=libc++ -g
Step #6 - "compile-libfuzzer-introspector-x86_64": RUSTFLAGS=-Cdebuginfo=2 -Cforce-frame-pointers
Step #6 - "compile-libfuzzer-introspector-x86_64": ---------------------------------------------------------------
Step #6 - "compile-libfuzzer-introspector-x86_64": + cd /src/snappy
Step #6 - "compile-libfuzzer-introspector-x86_64": + mkdir -p build
Step #6 - "compile-libfuzzer-introspector-x86_64": + cd build
Step #6 - "compile-libfuzzer-introspector-x86_64": + cmake -DSNAPPY_FUZZING_BUILD=ON -DSNAPPY_BUILD_TESTS=1 -DSNAPPY_BUILD_BENCHMARKS=0 ../
Step #6 - "compile-libfuzzer-introspector-x86_64": -- The C compiler identification is Clang 22.0.0
Step #6 - "compile-libfuzzer-introspector-x86_64": -- The CXX compiler identification is Clang 22.0.0
Step #6 - "compile-libfuzzer-introspector-x86_64": -- Detecting C compiler ABI info
Step #6 - "compile-libfuzzer-introspector-x86_64": -- Detecting C compiler ABI info - done
Step #6 - "compile-libfuzzer-introspector-x86_64": -- Check for working C compiler: /usr/local/bin/clang - skipped
Step #6 - "compile-libfuzzer-introspector-x86_64": -- Detecting C compile features
Step #6 - "compile-libfuzzer-introspector-x86_64": -- Detecting C compile features - done
Step #6 - "compile-libfuzzer-introspector-x86_64": -- Detecting CXX compiler ABI info
Step #6 - "compile-libfuzzer-introspector-x86_64": -- Detecting CXX compiler ABI info - done
Step #6 - "compile-libfuzzer-introspector-x86_64": -- Check for working CXX compiler: /usr/local/bin/clang++ - skipped
Step #6 - "compile-libfuzzer-introspector-x86_64": -- Detecting CXX compile features
Step #6 - "compile-libfuzzer-introspector-x86_64": -- Detecting CXX compile features - done
Step #6 - "compile-libfuzzer-introspector-x86_64": -- Looking for sys/mman.h
Step #6 - "compile-libfuzzer-introspector-x86_64": -- Looking for sys/mman.h - found
Step #6 - "compile-libfuzzer-introspector-x86_64": -- Looking for sys/resource.h
Step #6 - "compile-libfuzzer-introspector-x86_64": -- Looking for sys/resource.h - found
Step #6 - "compile-libfuzzer-introspector-x86_64": -- Looking for sys/time.h
Step #6 - "compile-libfuzzer-introspector-x86_64": -- Looking for sys/time.h - found
Step #6 - "compile-libfuzzer-introspector-x86_64": -- Looking for sys/uio.h
Step #6 - "compile-libfuzzer-introspector-x86_64": -- Looking for sys/uio.h - found
Step #6 - "compile-libfuzzer-introspector-x86_64": -- Looking for unistd.h
Step #6 - "compile-libfuzzer-introspector-x86_64": -- Looking for unistd.h - found
Step #6 - "compile-libfuzzer-introspector-x86_64": -- Looking for windows.h
Step #6 - "compile-libfuzzer-introspector-x86_64": -- Looking for windows.h - not found
Step #6 - "compile-libfuzzer-introspector-x86_64": -- Looking for zlibVersion in z
Step #6 - "compile-libfuzzer-introspector-x86_64": -- Looking for zlibVersion in z - found
Step #6 - "compile-libfuzzer-introspector-x86_64": -- Looking for lzo1x_1_15_compress in lzo2
Step #6 - "compile-libfuzzer-introspector-x86_64": -- Looking for lzo1x_1_15_compress in lzo2 - not found
Step #6 - "compile-libfuzzer-introspector-x86_64": -- Looking for LZ4_compress_default in lz4
Step #6 - "compile-libfuzzer-introspector-x86_64": -- Looking for LZ4_compress_default in lz4 - not found
Step #6 - "compile-libfuzzer-introspector-x86_64": -- Performing Test HAVE_VISUAL_STUDIO_ARCH_AVX
Step #6 - "compile-libfuzzer-introspector-x86_64": -- Performing Test HAVE_VISUAL_STUDIO_ARCH_AVX - Failed
Step #6 - "compile-libfuzzer-introspector-x86_64": -- Performing Test HAVE_VISUAL_STUDIO_ARCH_AVX2
Step #6 - "compile-libfuzzer-introspector-x86_64": -- Performing Test HAVE_VISUAL_STUDIO_ARCH_AVX2 - Failed
Step #6 - "compile-libfuzzer-introspector-x86_64": -- Performing Test HAVE_CLANG_MAVX
Step #6 - "compile-libfuzzer-introspector-x86_64": -- Performing Test HAVE_CLANG_MAVX - Success
Step #6 - "compile-libfuzzer-introspector-x86_64": -- Performing Test HAVE_CLANG_MBMI2
Step #6 - "compile-libfuzzer-introspector-x86_64": -- Performing Test HAVE_CLANG_MBMI2 - Success
Step #6 - "compile-libfuzzer-introspector-x86_64": -- Performing Test SNAPPY_HAVE_NO_MISSING_FIELD_INITIALIZERS
Step #6 - "compile-libfuzzer-introspector-x86_64": -- Performing Test SNAPPY_HAVE_NO_MISSING_FIELD_INITIALIZERS - Success
Step #6 - "compile-libfuzzer-introspector-x86_64": -- Performing Test SNAPPY_HAVE_NO_IMPLICIT_INT_FLOAT_CONVERSION
Step #6 - "compile-libfuzzer-introspector-x86_64": -- Performing Test SNAPPY_HAVE_NO_IMPLICIT_INT_FLOAT_CONVERSION - Success
Step #6 - "compile-libfuzzer-introspector-x86_64": -- Performing Test HAVE_BUILTIN_EXPECT
Step #6 - "compile-libfuzzer-introspector-x86_64": -- Performing Test HAVE_BUILTIN_EXPECT - Success
Step #6 - "compile-libfuzzer-introspector-x86_64": -- Performing Test HAVE_BUILTIN_CTZ
Step #6 - "compile-libfuzzer-introspector-x86_64": -- Performing Test HAVE_BUILTIN_CTZ - Success
Step #6 - "compile-libfuzzer-introspector-x86_64": -- Performing Test HAVE_BUILTIN_PREFETCH
Step #6 - "compile-libfuzzer-introspector-x86_64": -- Performing Test HAVE_BUILTIN_PREFETCH - Success
Step #6 - "compile-libfuzzer-introspector-x86_64": -- Performing Test HAVE_ATTRIBUTE_ALWAYS_INLINE
Step #6 - "compile-libfuzzer-introspector-x86_64": -- Performing Test HAVE_ATTRIBUTE_ALWAYS_INLINE - Success
Step #6 - "compile-libfuzzer-introspector-x86_64": -- Performing Test SNAPPY_HAVE_SSSE3
Step #6 - "compile-libfuzzer-introspector-x86_64": -- Performing Test SNAPPY_HAVE_SSSE3 - Failed
Step #6 - "compile-libfuzzer-introspector-x86_64": -- Performing Test SNAPPY_HAVE_X86_CRC32
Step #6 - "compile-libfuzzer-introspector-x86_64": -- Performing Test SNAPPY_HAVE_X86_CRC32 - Failed
Step #6 - "compile-libfuzzer-introspector-x86_64": -- Performing Test SNAPPY_HAVE_NEON_CRC32
Step #6 - "compile-libfuzzer-introspector-x86_64": -- Performing Test SNAPPY_HAVE_NEON_CRC32 - Failed
Step #6 - "compile-libfuzzer-introspector-x86_64": -- Performing Test SNAPPY_HAVE_BMI2
Step #6 - "compile-libfuzzer-introspector-x86_64": -- Performing Test SNAPPY_HAVE_BMI2 - Failed
Step #6 - "compile-libfuzzer-introspector-x86_64": -- Performing Test SNAPPY_HAVE_NEON
Step #6 - "compile-libfuzzer-introspector-x86_64": -- Performing Test SNAPPY_HAVE_NEON - Failed
Step #6 - "compile-libfuzzer-introspector-x86_64": -- Performing Test SNAPPY_RVV_1
Step #6 - "compile-libfuzzer-introspector-x86_64": -- Performing Test SNAPPY_RVV_1 - Failed
Step #6 - "compile-libfuzzer-introspector-x86_64": -- Performing Test SNAPPY_RVV_0_7
Step #6 - "compile-libfuzzer-introspector-x86_64": -- Performing Test SNAPPY_RVV_0_7 - Failed
Step #6 - "compile-libfuzzer-introspector-x86_64": -- Looking for mmap
Step #6 - "compile-libfuzzer-introspector-x86_64": -- Looking for mmap - found
Step #6 - "compile-libfuzzer-introspector-x86_64": -- Looking for sysconf
Step #6 - "compile-libfuzzer-introspector-x86_64": -- Looking for sysconf - found
Step #6 - "compile-libfuzzer-introspector-x86_64": -- Performing Test CMAKE_HAVE_LIBC_PTHREAD
Step #6 - "compile-libfuzzer-introspector-x86_64": -- Performing Test CMAKE_HAVE_LIBC_PTHREAD - Success
Step #6 - "compile-libfuzzer-introspector-x86_64": -- Found Threads: TRUE
Step #6 - "compile-libfuzzer-introspector-x86_64": -- Configuring done (4.5s)
Step #6 - "compile-libfuzzer-introspector-x86_64": -- Generating done (0.0s)
Step #6 - "compile-libfuzzer-introspector-x86_64": -- Build files have been written to: /src/snappy/build
Step #6 - "compile-libfuzzer-introspector-x86_64": + cmake --build .
Step #6 - "compile-libfuzzer-introspector-x86_64": [ 4%] [32mBuilding CXX object CMakeFiles/snappy.dir/snappy-c.cc.o[0m
Step #6 - "compile-libfuzzer-introspector-x86_64": [ 8%] [32mBuilding CXX object CMakeFiles/snappy.dir/snappy-sinksource.cc.o[0m
Step #6 - "compile-libfuzzer-introspector-x86_64": [ 12%] [32mBuilding CXX object CMakeFiles/snappy.dir/snappy-stubs-internal.cc.o[0m
Step #6 - "compile-libfuzzer-introspector-x86_64": [ 16%] [32mBuilding CXX object CMakeFiles/snappy.dir/snappy.cc.o[0m
Step #6 - "compile-libfuzzer-introspector-x86_64": [ 20%] [32m[1mLinking CXX static library libsnappy.a[0m
Step #6 - "compile-libfuzzer-introspector-x86_64": [ 20%] Built target snappy
Step #6 - "compile-libfuzzer-introspector-x86_64": [ 25%] [32mBuilding CXX object CMakeFiles/snappy_test_support.dir/snappy-test.cc.o[0m
Step #6 - "compile-libfuzzer-introspector-x86_64": [1m/src/snappy/snappy-test.cc:469:52: [0m[0;1;31merror: [0m[1mvariable 'dummyin' is uninitialized when passed as a const pointer argument here [-Werror,-Wuninitialized-const-pointer][0m
Step #6 - "compile-libfuzzer-introspector-x86_64": 469 | [0;34mif[0m ( UncompressChunkOrAll(&dummyout, &dummylen, &dummyin, [0;32m0[0m, Z_FINISH)[0m
Step #6 - "compile-libfuzzer-introspector-x86_64": | [0;1;32m ^~~~~~~
Step #6 - "compile-libfuzzer-introspector-x86_64": [0m1 error generated.
Step #6 - "compile-libfuzzer-introspector-x86_64": make[2]: *** [CMakeFiles/snappy_test_support.dir/build.make:76: CMakeFiles/snappy_test_support.dir/snappy-test.cc.o] Error 1
Step #6 - "compile-libfuzzer-introspector-x86_64": make[1]: *** [CMakeFiles/Makefile2:172: CMakeFiles/snappy_test_support.dir/all] Error 2
Step #6 - "compile-libfuzzer-introspector-x86_64": make: *** [Makefile:146: all] Error 2
Step #6 - "compile-libfuzzer-introspector-x86_64": ********************************************************************************\nFailed to build.\nTo reproduce, run:\npython infra/helper.py build_image snappy\npython infra/helper.py build_fuzzers --sanitizer introspector --engine libfuzzer --architecture x86_64 snappy\n********************************************************************************
Finished Step #6 - "compile-libfuzzer-introspector-x86_64"
ERROR: step exited with non-zero status: 1
Starting Step #7
Step #7: Already have image (with digest): gcr.io/cloud-builders/gsutil
Step #7: CommandException: 1 files/objects could not be removed.
Finished Step #7
Starting Step #8
Step #8: Already have image (with digest): gcr.io/cloud-builders/gsutil
Step #8: Copying file:///workspace/out/libfuzzer-introspector-x86_64/inspector/summary.json [Content-Type=application/json]...
Step #8: Copying file:///workspace/out/libfuzzer-introspector-x86_64/inspector/prism.js [Content-Type=text/javascript]...
Step #8: / [0/75 files][ 0.0 B/169.3 MiB] 0% Done
/ [0/75 files][ 0.0 B/169.3 MiB] 0% Done
Copying file:///workspace/out/libfuzzer-introspector-x86_64/inspector/all_tests.json [Content-Type=application/json]...
Step #8: / [0/75 files][ 0.0 B/169.3 MiB] 0% Done
Copying file:///workspace/out/libfuzzer-introspector-x86_64/inspector/custom.js [Content-Type=text/javascript]...
Step #8: / [0/75 files][ 8.1 KiB/169.3 MiB] 0% Done
Copying file:///workspace/out/libfuzzer-introspector-x86_64/inspector/fuzzerLogFile-snappy_compress_fuzzer.data [Content-Type=application/octet-stream]...
Step #8: / [0/75 files][ 60.9 KiB/169.3 MiB] 0% Done
Copying file:///workspace/out/libfuzzer-introspector-x86_64/inspector/result.json [Content-Type=application/json]...
Step #8: / [0/75 files][ 70.6 KiB/169.3 MiB] 0% Done
Copying file:///workspace/out/libfuzzer-introspector-x86_64/inspector/fuzzerLogFile-snappy_uncompress_fuzzer.data [Content-Type=application/octet-stream]...
Step #8: / [0/75 files][ 70.6 KiB/169.3 MiB] 0% Done
Copying file:///workspace/out/libfuzzer-introspector-x86_64/inspector/snappy_uncompress_fuzzer.cc_colormap.png [Content-Type=image/png]...
Step #8: / [0/75 files][ 70.6 KiB/169.3 MiB] 0% Done
/ [1/75 files][ 70.6 KiB/169.3 MiB] 0% Done
/ [2/75 files][ 70.6 KiB/169.3 MiB] 0% Done
/ [3/75 files][ 70.6 KiB/169.3 MiB] 0% Done
/ [4/75 files][ 70.6 KiB/169.3 MiB] 0% Done
Copying file:///workspace/out/libfuzzer-introspector-x86_64/inspector/fuzz_report.html [Content-Type=text/html]...
Step #8: Copying file:///workspace/out/libfuzzer-introspector-x86_64/inspector/all-files.json [Content-Type=application/json]...
Step #8: / [4/75 files][ 70.6 KiB/169.3 MiB] 0% Done
/ [4/75 files][ 70.6 KiB/169.3 MiB] 0% Done
/ [5/75 files][ 70.6 KiB/169.3 MiB] 0% Done
Copying file:///workspace/out/libfuzzer-introspector-x86_64/inspector/all_functions.js [Content-Type=text/javascript]...
Step #8: / [5/75 files][ 70.6 KiB/169.3 MiB] 0% Done
Copying file:///workspace/out/libfuzzer-introspector-x86_64/inspector/calltree_view_1.html [Content-Type=text/html]...
Step #8: / [5/75 files][ 1.1 MiB/169.3 MiB] 0% Done
/ [6/75 files][ 1.3 MiB/169.3 MiB] 0% Done
/ [7/75 files][ 1.3 MiB/169.3 MiB] 0% Done
/ [8/75 files][ 1.3 MiB/169.3 MiB] 0% Done
/ [9/75 files][ 1.3 MiB/169.3 MiB] 0% Done
/ [10/75 files][ 1.3 MiB/169.3 MiB] 0% Done
Copying file:///workspace/out/libfuzzer-introspector-x86_64/inspector/branch-blockers.json [Content-Type=application/json]...
Step #8: / [10/75 files][ 1.3 MiB/169.3 MiB] 0% Done
Copying file:///workspace/out/libfuzzer-introspector-x86_64/inspector/calltree.js [Content-Type=text/javascript]...
Step #8: / [10/75 files][ 1.3 MiB/169.3 MiB] 0% Done
Copying file:///workspace/out/libfuzzer-introspector-x86_64/inspector/fuzzer_table_data.js [Content-Type=text/javascript]...
Step #8: / [10/75 files][ 1.3 MiB/169.3 MiB] 0% Done
Copying file:///workspace/out/libfuzzer-introspector-x86_64/inspector/all_tests_with_xreference.json [Content-Type=application/json]...
Step #8: / [10/75 files][ 7.7 MiB/169.3 MiB] 4% Done
Copying file:///workspace/out/libfuzzer-introspector-x86_64/inspector/macro_block_info.json [Content-Type=application/json]...
Step #8: / [10/75 files][ 7.7 MiB/169.3 MiB] 4% Done
Copying file:///workspace/out/libfuzzer-introspector-x86_64/inspector/snappy_compress_fuzzer.cc_colormap.png [Content-Type=image/png]...
Step #8: / [10/75 files][ 7.7 MiB/169.3 MiB] 4% Done
/ [11/75 files][ 7.7 MiB/169.3 MiB] 4% Done
Copying file:///workspace/out/libfuzzer-introspector-x86_64/inspector/clike.js [Content-Type=text/javascript]...
Step #8: / [11/75 files][ 7.7 MiB/169.3 MiB] 4% Done
Copying file:///workspace/out/libfuzzer-introspector-x86_64/inspector/all-friendly-debug-types.json [Content-Type=application/json]...
Step #8: / [11/75 files][ 7.7 MiB/169.3 MiB] 4% Done
-
- [12/75 files][ 7.7 MiB/169.3 MiB] 4% Done
- [13/75 files][ 7.7 MiB/169.3 MiB] 4% Done
- [14/75 files][ 8.5 MiB/169.3 MiB] 5% Done
Copying file:///workspace/out/libfuzzer-introspector-x86_64/inspector/analysis_1.js [Content-Type=text/javascript]...
Step #8: - [14/75 files][ 8.7 MiB/169.3 MiB] 5% Done
Copying file:///workspace/out/libfuzzer-introspector-x86_64/inspector/full_type_defs.json [Content-Type=application/json]...
Step #8: - [14/75 files][ 8.7 MiB/169.3 MiB] 5% Done
Copying file:///workspace/out/libfuzzer-introspector-x86_64/inspector/fuzzerLogFile-snappy_uncompress_fuzzer.data.yaml [Content-Type=application/yaml]...
Step #8: - [14/75 files][ 8.7 MiB/169.3 MiB] 5% Done
Copying file:///workspace/out/libfuzzer-introspector-x86_64/inspector/prism.css [Content-Type=text/css]...
Step #8: - [14/75 files][ 8.7 MiB/169.3 MiB] 5% Done
Copying file:///workspace/out/libfuzzer-introspector-x86_64/inspector/calltree_view_0.html [Content-Type=text/html]...
Step #8: - [14/75 files][ 8.7 MiB/169.3 MiB] 5% Done
- [15/75 files][ 8.7 MiB/169.3 MiB] 5% Done
Copying file:///workspace/out/libfuzzer-introspector-x86_64/inspector/all-fuzz-introspector-functions.json [Content-Type=application/json]...
Step #8: - [15/75 files][ 8.7 MiB/169.3 MiB] 5% Done
Copying file:///workspace/out/libfuzzer-introspector-x86_64/inspector/test-files.json [Content-Type=application/json]...
Step #8: - [15/75 files][ 8.7 MiB/169.3 MiB] 5% Done
Copying file:///workspace/out/libfuzzer-introspector-x86_64/inspector/fuzzerLogFile-snappy_compress_fuzzer.data.yaml [Content-Type=application/yaml]...
Step #8: - [15/75 files][ 8.7 MiB/169.3 MiB] 5% Done
Copying file:///workspace/out/libfuzzer-introspector-x86_64/inspector/all_debug_info.json [Content-Type=application/json]...
Step #8: - [15/75 files][ 8.7 MiB/169.3 MiB] 5% Done
Copying file:///workspace/out/libfuzzer-introspector-x86_64/inspector/styles.css [Content-Type=text/css]...
Step #8: - [15/75 files][ 8.7 MiB/169.3 MiB] 5% Done
- [16/75 files][ 8.7 MiB/169.3 MiB] 5% Done
Copying file:///workspace/out/libfuzzer-introspector-x86_64/inspector/source-code/src/snappy/snappy_uncompress_fuzzer.cc [Content-Type=text/x-c++src]...
Step #8: - [16/75 files][ 8.7 MiB/169.3 MiB] 5% Done
Copying file:///workspace/out/libfuzzer-introspector-x86_64/inspector/source-code/src/snappy/snappy-internal.h [Content-Type=text/x-chdr]...
Step #8: - [16/75 files][ 8.7 MiB/169.3 MiB] 5% Done
- [17/75 files][ 8.7 MiB/169.3 MiB] 5% Done
Copying file:///workspace/out/libfuzzer-introspector-x86_64/inspector/source-code/src/snappy/snappy-sinksource.h [Content-Type=text/x-chdr]...
Step #8: Copying file:///workspace/out/libfuzzer-introspector-x86_64/inspector/source-code/src/snappy/snappy-sinksource.cc [Content-Type=text/x-c++src]...
Step #8: - [17/75 files][ 8.7 MiB/169.3 MiB] 5% Done
- [17/75 files][ 8.7 MiB/169.3 MiB] 5% Done
Copying file:///workspace/out/libfuzzer-introspector-x86_64/inspector/source-code/src/snappy/snappy_compress_fuzzer.cc [Content-Type=text/x-c++src]...
Step #8: - [17/75 files][ 8.7 MiB/169.3 MiB] 5% Done
- [18/75 files][ 8.7 MiB/169.3 MiB] 5% Done
Copying file:///workspace/out/libfuzzer-introspector-x86_64/inspector/source-code/src/snappy/snappy-stubs-internal.cc [Content-Type=text/x-c++src]...
Step #8: - [18/75 files][ 8.7 MiB/169.3 MiB] 5% Done
Copying file:///workspace/out/libfuzzer-introspector-x86_64/inspector/source-code/src/snappy/snappy-test.cc [Content-Type=text/x-c++src]...
Step #8: - [19/75 files][ 8.7 MiB/169.3 MiB] 5% Done
- [19/75 files][ 8.7 MiB/169.3 MiB] 5% Done
Copying file:///workspace/out/libfuzzer-introspector-x86_64/inspector/source-code/src/snappy/snappy-c.cc [Content-Type=text/x-c++src]...
Step #8: - [19/75 files][ 8.7 MiB/169.3 MiB] 5% Done
Copying file:///workspace/out/libfuzzer-introspector-x86_64/inspector/source-code/src/snappy/snappy.h [Content-Type=text/x-chdr]...
Step #8: - [19/75 files][ 8.7 MiB/169.3 MiB] 5% Done
Copying file:///workspace/out/libfuzzer-introspector-x86_64/inspector/source-code/src/snappy/snappy_test_data.h [Content-Type=text/x-chdr]...
Step #8: - [19/75 files][ 8.7 MiB/169.3 MiB] 5% Done
- [20/75 files][ 8.7 MiB/169.3 MiB] 5% Done
Copying file:///workspace/out/libfuzzer-introspector-x86_64/inspector/source-code/src/snappy/snappy_benchmark.cc [Content-Type=text/x-c++src]...
Step #8: - [20/75 files][ 8.7 MiB/169.3 MiB] 5% Done
Copying file:///workspace/out/libfuzzer-introspector-x86_64/inspector/source-code/src/snappy/snappy.cc [Content-Type=text/x-c++src]...
Step #8: - [20/75 files][ 8.7 MiB/169.3 MiB] 5% Done
Copying file:///workspace/out/libfuzzer-introspector-x86_64/inspector/source-code/src/snappy/snappy-c.h [Content-Type=text/x-chdr]...
Step #8: - [20/75 files][ 9.3 MiB/169.3 MiB] 5% Done
Copying file:///workspace/out/libfuzzer-introspector-x86_64/inspector/source-code/src/snappy/snappy_unittest.cc [Content-Type=text/x-c++src]...
Step #8: - [20/75 files][ 9.3 MiB/169.3 MiB] 5% Done
Copying file:///workspace/out/libfuzzer-introspector-x86_64/inspector/source-code/src/snappy/snappy-test.h [Content-Type=text/x-chdr]...
Step #8: - [20/75 files][ 9.3 MiB/169.3 MiB] 5% Done
Copying file:///workspace/out/libfuzzer-introspector-x86_64/inspector/source-code/src/snappy/snappy_test_tool.cc [Content-Type=text/x-c++src]...
Step #8: - [20/75 files][ 16.0 MiB/169.3 MiB] 9% Done
Copying file:///workspace/out/libfuzzer-introspector-x86_64/inspector/source-code/src/snappy/snappy_test_data.cc [Content-Type=text/x-c++src]...
Step #8: - [20/75 files][ 17.1 MiB/169.3 MiB] 10% Done
Copying file:///workspace/out/libfuzzer-introspector-x86_64/inspector/source-code/src/snappy/snappy-stubs-internal.h [Content-Type=text/x-chdr]...
Step #8: - [20/75 files][ 18.1 MiB/169.3 MiB] 10% Done
Copying file:///workspace/out/libfuzzer-introspector-x86_64/inspector/light/all_tests.json [Content-Type=application/json]...
Step #8: Copying file:///workspace/out/libfuzzer-introspector-x86_64/inspector/light/all_pairs.json [Content-Type=application/json]...
Step #8: - [20/75 files][ 18.4 MiB/169.3 MiB] 10% Done
- [20/75 files][ 18.4 MiB/169.3 MiB] 10% Done
Copying file:///workspace/out/libfuzzer-introspector-x86_64/inspector/light/all_files.json [Content-Type=application/json]...
Step #8: - [20/75 files][ 18.6 MiB/169.3 MiB] 10% Done
Copying file:///workspace/out/libfuzzer-introspector-x86_64/inspector/light/source_files/src/snappy/snappy_uncompress_fuzzer.cc [Content-Type=text/x-c++src]...
Step #8: - [20/75 files][ 19.1 MiB/169.3 MiB] 11% Done
Copying file:///workspace/out/libfuzzer-introspector-x86_64/inspector/light/source_files/src/snappy/snappy-sinksource.h [Content-Type=text/x-chdr]...
Step #8: - [20/75 files][ 19.4 MiB/169.3 MiB] 11% Done
Copying file:///workspace/out/libfuzzer-introspector-x86_64/inspector/light/source_files/src/snappy/snappy-internal.h [Content-Type=text/x-chdr]...
Step #8: - [20/75 files][ 19.7 MiB/169.3 MiB] 11% Done
Copying file:///workspace/out/libfuzzer-introspector-x86_64/inspector/light/source_files/src/snappy/snappy-sinksource.cc [Content-Type=text/x-c++src]...
Step #8: - [20/75 files][ 19.9 MiB/169.3 MiB] 11% Done
Copying file:///workspace/out/libfuzzer-introspector-x86_64/inspector/light/source_files/src/snappy/snappy_compress_fuzzer.cc [Content-Type=text/x-c++src]...
Step #8: - [20/75 files][ 20.9 MiB/169.3 MiB] 12% Done
Copying file:///workspace/out/libfuzzer-introspector-x86_64/inspector/light/source_files/src/snappy/snappy-stubs-internal.cc [Content-Type=text/x-c++src]...
Step #8: - [20/75 files][ 21.5 MiB/169.3 MiB] 12% Done
Copying file:///workspace/out/libfuzzer-introspector-x86_64/inspector/light/source_files/src/snappy/snappy-test.cc [Content-Type=text/x-c++src]...
Step #8: Copying file:///workspace/out/libfuzzer-introspector-x86_64/inspector/light/source_files/src/snappy/snappy-c.cc [Content-Type=text/x-c++src]...
Step #8: - [20/75 files][ 22.2 MiB/169.3 MiB] 13% Done
- [20/75 files][ 22.2 MiB/169.3 MiB] 13% Done
Copying file:///workspace/out/libfuzzer-introspector-x86_64/inspector/light/source_files/src/snappy/snappy.h [Content-Type=text/x-chdr]...
Step #8: - [20/75 files][ 22.5 MiB/169.3 MiB] 13% Done
Copying file:///workspace/out/libfuzzer-introspector-x86_64/inspector/light/source_files/src/snappy/snappy_test_data.h [Content-Type=text/x-chdr]...
Step #8: - [21/75 files][ 23.5 MiB/169.3 MiB] 13% Done
- [21/75 files][ 23.5 MiB/169.3 MiB] 13% Done
Copying file:///workspace/out/libfuzzer-introspector-x86_64/inspector/light/source_files/src/snappy/snappy_benchmark.cc [Content-Type=text/x-c++src]...
Step #8: Copying file:///workspace/out/libfuzzer-introspector-x86_64/inspector/light/source_files/src/snappy/snappy.cc [Content-Type=text/x-c++src]...
Step #8: Copying file:///workspace/out/libfuzzer-introspector-x86_64/inspector/light/source_files/src/snappy/snappy-c.h [Content-Type=text/x-chdr]...
Step #8: - [21/75 files][ 24.3 MiB/169.3 MiB] 14% Done
- [21/75 files][ 24.3 MiB/169.3 MiB] 14% Done
- [21/75 files][ 24.6 MiB/169.3 MiB] 14% Done
Copying file:///workspace/out/libfuzzer-introspector-x86_64/inspector/light/source_files/src/snappy/snappy_unittest.cc [Content-Type=text/x-c++src]...
Step #8: - [21/75 files][ 24.8 MiB/169.3 MiB] 14% Done
Copying file:///workspace/out/libfuzzer-introspector-x86_64/inspector/light/source_files/src/snappy/snappy-test.h [Content-Type=text/x-chdr]...
Step #8: - [21/75 files][ 26.1 MiB/169.3 MiB] 15% Done
- [22/75 files][ 26.1 MiB/169.3 MiB] 15% Done
Copying file:///workspace/out/libfuzzer-introspector-x86_64/inspector/light/source_files/src/snappy/snappy_test_tool.cc [Content-Type=text/x-c++src]...
Step #8: - [22/75 files][ 26.6 MiB/169.3 MiB] 15% Done
Copying file:///workspace/out/libfuzzer-introspector-x86_64/inspector/second-frontend-run/fuzzerLogFile-snappy_uncompress_fuzzer.data [Content-Type=application/octet-stream]...
Step #8: - [22/75 files][ 26.9 MiB/169.3 MiB] 15% Done
Copying file:///workspace/out/libfuzzer-introspector-x86_64/inspector/light/source_files/src/snappy/snappy_test_data.cc [Content-Type=text/x-c++src]...
Step #8: Copying file:///workspace/out/libfuzzer-introspector-x86_64/inspector/light/source_files/src/snappy/snappy-stubs-internal.h [Content-Type=text/x-chdr]...
Step #8: - [22/75 files][ 27.2 MiB/169.3 MiB] 16% Done
- [22/75 files][ 27.2 MiB/169.3 MiB] 16% Done
Copying file:///workspace/out/libfuzzer-introspector-x86_64/inspector/second-frontend-run/macro_block_info.json [Content-Type=application/json]...
Step #8: - [22/75 files][ 27.4 MiB/169.3 MiB] 16% Done
Copying file:///workspace/out/libfuzzer-introspector-x86_64/inspector/second-frontend-run/fuzzerLogFile-snappy_compress_fuzzer.data [Content-Type=application/octet-stream]...
Step #8: - [22/75 files][ 27.4 MiB/169.3 MiB] 16% Done
Copying file:///workspace/out/libfuzzer-introspector-x86_64/inspector/second-frontend-run/fuzzerLogFile-snappy_uncompress_fuzzer.data.yaml [Content-Type=application/yaml]...
Step #8: - [22/75 files][ 27.9 MiB/169.3 MiB] 16% Done
Copying file:///workspace/out/libfuzzer-introspector-x86_64/inspector/second-frontend-run/full_type_defs.json [Content-Type=application/json]...
Step #8: - [22/75 files][ 28.5 MiB/169.3 MiB] 16% Done
Copying file:///workspace/out/libfuzzer-introspector-x86_64/inspector/second-frontend-run/fuzzerLogFile-snappy_compress_fuzzer.data.yaml [Content-Type=application/yaml]...
Step #8: - [22/75 files][ 29.2 MiB/169.3 MiB] 17% Done
- [23/75 files][ 31.6 MiB/169.3 MiB] 18% Done
- [24/75 files][ 33.9 MiB/169.3 MiB] 20% Done
- [25/75 files][ 34.1 MiB/169.3 MiB] 20% Done
- [26/75 files][ 34.4 MiB/169.3 MiB] 20% Done
- [27/75 files][ 34.4 MiB/169.3 MiB] 20% Done
- [28/75 files][ 37.2 MiB/169.3 MiB] 21% Done
- [29/75 files][ 38.8 MiB/169.3 MiB] 22% Done
- [30/75 files][ 41.2 MiB/169.3 MiB] 24% Done
- [31/75 files][ 44.0 MiB/169.3 MiB] 26% Done
- [32/75 files][ 44.5 MiB/169.3 MiB] 26% Done
- [33/75 files][ 46.9 MiB/169.3 MiB] 27% Done
- [34/75 files][ 50.0 MiB/169.3 MiB] 29% Done
- [35/75 files][ 52.9 MiB/169.3 MiB] 31% Done
\
\ [36/75 files][ 53.7 MiB/169.3 MiB] 31% Done
\ [37/75 files][ 56.7 MiB/169.3 MiB] 33% Done
\ [38/75 files][ 57.8 MiB/169.3 MiB] 34% Done
\ [39/75 files][ 58.0 MiB/169.3 MiB] 34% Done
\ [40/75 files][ 58.0 MiB/169.3 MiB] 34% Done
\ [41/75 files][ 65.2 MiB/169.3 MiB] 38% Done
\ [42/75 files][ 71.2 MiB/169.3 MiB] 42% Done
\ [43/75 files][ 74.3 MiB/169.3 MiB] 43% Done
\ [44/75 files][ 74.9 MiB/169.3 MiB] 44% Done
\ [45/75 files][ 78.2 MiB/169.3 MiB] 46% Done
\ [46/75 files][ 78.7 MiB/169.3 MiB] 46% Done
\ [47/75 files][ 84.2 MiB/169.3 MiB] 49% Done
\ [48/75 files][ 84.2 MiB/169.3 MiB] 49% Done
\ [49/75 files][ 86.2 MiB/169.3 MiB] 50% Done
\ [50/75 files][ 90.4 MiB/169.3 MiB] 53% Done
\ [51/75 files][ 92.4 MiB/169.3 MiB] 54% Done
\ [52/75 files][ 98.9 MiB/169.3 MiB] 58% Done
\ [53/75 files][ 99.4 MiB/169.3 MiB] 58% Done
\ [54/75 files][103.0 MiB/169.3 MiB] 60% Done
\ [55/75 files][103.8 MiB/169.3 MiB] 61% Done
\ [56/75 files][106.4 MiB/169.3 MiB] 62% Done
\ [57/75 files][108.2 MiB/169.3 MiB] 63% Done
\ [58/75 files][112.0 MiB/169.3 MiB] 66% Done
\ [59/75 files][114.1 MiB/169.3 MiB] 67% Done
\ [60/75 files][114.6 MiB/169.3 MiB] 67% Done
\ [61/75 files][118.8 MiB/169.3 MiB] 70% Done
\ [62/75 files][119.0 MiB/169.3 MiB] 70% Done
\ [63/75 files][140.9 MiB/169.3 MiB] 83% Done
\ [64/75 files][141.2 MiB/169.3 MiB] 83% Done
\ [65/75 files][141.7 MiB/169.3 MiB] 83% Done
\ [66/75 files][143.0 MiB/169.3 MiB] 84% Done
\ [67/75 files][144.5 MiB/169.3 MiB] 85% Done
|
| [68/75 files][148.9 MiB/169.3 MiB] 87% Done
| [69/75 files][148.9 MiB/169.3 MiB] 87% Done
| [70/75 files][150.7 MiB/169.3 MiB] 88% Done
| [71/75 files][151.5 MiB/169.3 MiB] 89% Done
| [72/75 files][154.0 MiB/169.3 MiB] 90% Done
| [73/75 files][155.6 MiB/169.3 MiB] 91% Done
| [74/75 files][162.3 MiB/169.3 MiB] 95% Done
| [75/75 files][169.3 MiB/169.3 MiB] 100% Done
Step #8: Operation completed over 75 objects/169.3 MiB.
Finished Step #8
PUSH
DONE