starting build "d2331626-1685-4b3f-9dc9-333a0d81f513"
FETCHSOURCE
BUILD
Starting Step #0
Step #0: Pulling image: gcr.io/oss-fuzz-base/base-runner
Step #0: Using default tag: latest
Step #0: latest: Pulling from oss-fuzz-base/base-runner
Step #0: b549f31133a9: Pulling fs layer
Step #0: 6dd5961d692b: Pulling fs layer
Step #0: 9a9658e25b8a: Pulling fs layer
Step #0: 5d60ec70c20d: Pulling fs layer
Step #0: ff388d9cd466: Pulling fs layer
Step #0: 0e330732cb88: Pulling fs layer
Step #0: 3c2904c43bda: Pulling fs layer
Step #0: 366632b35e63: Pulling fs layer
Step #0: 1aedc44270b1: Pulling fs layer
Step #0: 0d580866ea8b: Pulling fs layer
Step #0: 91190ca803aa: Pulling fs layer
Step #0: 3ad4026f9f6e: Pulling fs layer
Step #0: dd8a09b1be24: Pulling fs layer
Step #0: 35e0db39a9dc: Pulling fs layer
Step #0: 3998413321fa: Pulling fs layer
Step #0: 00161eb232f6: Pulling fs layer
Step #0: 127e32126fca: Pulling fs layer
Step #0: 86a22806df93: Pulling fs layer
Step #0: e72a111e7049: Pulling fs layer
Step #0: 3ec388a76e37: Pulling fs layer
Step #0: 27c68bb86a84: Pulling fs layer
Step #0: 44904d9e53a8: Pulling fs layer
Step #0: cb10c9e5f303: Pulling fs layer
Step #0: 6550fcc68c4e: Pulling fs layer
Step #0: 7b985a36cc25: Pulling fs layer
Step #0: a108b351174b: Pulling fs layer
Step #0: 35e0db39a9dc: Waiting
Step #0: 3998413321fa: Waiting
Step #0: 44904d9e53a8: Waiting
Step #0: 00161eb232f6: Waiting
Step #0: 5d60ec70c20d: Waiting
Step #0: cb10c9e5f303: Waiting
Step #0: ff388d9cd466: Waiting
Step #0: 127e32126fca: Waiting
Step #0: 6550fcc68c4e: Waiting
Step #0: 0e330732cb88: Waiting
Step #0: 86a22806df93: Waiting
Step #0: 3c2904c43bda: Waiting
Step #0: e72a111e7049: Waiting
Step #0: 7b985a36cc25: Waiting
Step #0: 3ec388a76e37: Waiting
Step #0: a108b351174b: Waiting
Step #0: 27c68bb86a84: Waiting
Step #0: 91190ca803aa: Waiting
Step #0: 3ad4026f9f6e: Waiting
Step #0: 1aedc44270b1: Waiting
Step #0: 366632b35e63: Waiting
Step #0: 0d580866ea8b: Waiting
Step #0: dd8a09b1be24: Waiting
Step #0: 9a9658e25b8a: Verifying Checksum
Step #0: 9a9658e25b8a: Download complete
Step #0: 5d60ec70c20d: Download complete
Step #0: b549f31133a9: Verifying Checksum
Step #0: b549f31133a9: Download complete
Step #0: 0e330732cb88: Verifying Checksum
Step #0: 0e330732cb88: Download complete
Step #0: ff388d9cd466: Verifying Checksum
Step #0: ff388d9cd466: Download complete
Step #0: 3c2904c43bda: Download complete
Step #0: 366632b35e63: Verifying Checksum
Step #0: 366632b35e63: Download complete
Step #0: 6dd5961d692b: Verifying Checksum
Step #0: 6dd5961d692b: Download complete
Step #0: 0d580866ea8b: Verifying Checksum
Step #0: 0d580866ea8b: Download complete
Step #0: 91190ca803aa: Download complete
Step #0: 3ad4026f9f6e: Verifying Checksum
Step #0: 3ad4026f9f6e: Download complete
Step #0: 1aedc44270b1: Verifying Checksum
Step #0: 1aedc44270b1: Download complete
Step #0: 35e0db39a9dc: Verifying Checksum
Step #0: 35e0db39a9dc: Download complete
Step #0: b549f31133a9: Pull complete
Step #0: 3998413321fa: Verifying Checksum
Step #0: 3998413321fa: Download complete
Step #0: 00161eb232f6: Verifying Checksum
Step #0: 00161eb232f6: Download complete
Step #0: 86a22806df93: Download complete
Step #0: dd8a09b1be24: Verifying Checksum
Step #0: dd8a09b1be24: Download complete
Step #0: 127e32126fca: Verifying Checksum
Step #0: 127e32126fca: Download complete
Step #0: 3ec388a76e37: Verifying Checksum
Step #0: 3ec388a76e37: Download complete
Step #0: 27c68bb86a84: Verifying Checksum
Step #0: 27c68bb86a84: Download complete
Step #0: 44904d9e53a8: Verifying Checksum
Step #0: 44904d9e53a8: Download complete
Step #0: cb10c9e5f303: Verifying Checksum
Step #0: cb10c9e5f303: Download complete
Step #0: 6550fcc68c4e: Verifying Checksum
Step #0: 6550fcc68c4e: Download complete
Step #0: 7b985a36cc25: Download complete
Step #0: a108b351174b: Verifying Checksum
Step #0: a108b351174b: Download complete
Step #0: e72a111e7049: Verifying Checksum
Step #0: e72a111e7049: Download complete
Step #0: 6dd5961d692b: Pull complete
Step #0: 9a9658e25b8a: Pull complete
Step #0: 5d60ec70c20d: Pull complete
Step #0: ff388d9cd466: Pull complete
Step #0: 0e330732cb88: Pull complete
Step #0: 3c2904c43bda: Pull complete
Step #0: 366632b35e63: Pull complete
Step #0: 1aedc44270b1: Pull complete
Step #0: 0d580866ea8b: Pull complete
Step #0: 91190ca803aa: Pull complete
Step #0: 3ad4026f9f6e: Pull complete
Step #0: dd8a09b1be24: Pull complete
Step #0: 35e0db39a9dc: Pull complete
Step #0: 3998413321fa: Pull complete
Step #0: 00161eb232f6: Pull complete
Step #0: 127e32126fca: Pull complete
Step #0: 86a22806df93: Pull complete
Step #0: e72a111e7049: Pull complete
Step #0: 3ec388a76e37: Pull complete
Step #0: 27c68bb86a84: Pull complete
Step #0: 44904d9e53a8: Pull complete
Step #0: cb10c9e5f303: Pull complete
Step #0: 6550fcc68c4e: Pull complete
Step #0: 7b985a36cc25: Pull complete
Step #0: a108b351174b: Pull complete
Step #0: Digest: sha256:2e2166699ad170a4bd913ba6b8acd26e88247d3d106f38fe7a6161f70cbe65a0
Step #0: Status: Downloaded newer image for gcr.io/oss-fuzz-base/base-runner:latest
Step #0: gcr.io/oss-fuzz-base/base-runner:latest
Finished Step #0
Starting Step #1
Step #1: Already have image (with digest): gcr.io/cloud-builders/gsutil
Step #1: CommandException: No URLs matched: gs://oss-fuzz-coverage/leveldb/textcov_reports/20250328/*
Step #1: CommandException: 1 file/object could not be transferred.
Finished Step #1
ERROR: step exited with non-zero status: 1
Starting Step #2
Step #2: Already have image (with digest): gcr.io/oss-fuzz-base/base-runner
Step #2: total 0
Finished Step #2
Starting Step #3
Step #3: Already have image (with digest): gcr.io/cloud-builders/git
Step #3: Cloning into 'oss-fuzz'...
Finished Step #3
Starting Step #4 - "build-0e0c5fc8-8e05-45ac-8b9a-5bf482e8f750"
Step #4 - "build-0e0c5fc8-8e05-45ac-8b9a-5bf482e8f750": Already have image (with digest): gcr.io/cloud-builders/docker
Step #4 - "build-0e0c5fc8-8e05-45ac-8b9a-5bf482e8f750": Sending build context to Docker daemon 11.78kB
Step #4 - "build-0e0c5fc8-8e05-45ac-8b9a-5bf482e8f750": Step 1/7 : FROM gcr.io/oss-fuzz-base/base-builder
Step #4 - "build-0e0c5fc8-8e05-45ac-8b9a-5bf482e8f750": latest: Pulling from oss-fuzz-base/base-builder
Step #4 - "build-0e0c5fc8-8e05-45ac-8b9a-5bf482e8f750": b549f31133a9: Already exists
Step #4 - "build-0e0c5fc8-8e05-45ac-8b9a-5bf482e8f750": 6dd5961d692b: Already exists
Step #4 - "build-0e0c5fc8-8e05-45ac-8b9a-5bf482e8f750": 9a9658e25b8a: Already exists
Step #4 - "build-0e0c5fc8-8e05-45ac-8b9a-5bf482e8f750": 82182e8f92cb: Pulling fs layer
Step #4 - "build-0e0c5fc8-8e05-45ac-8b9a-5bf482e8f750": 1810409b6ceb: Pulling fs layer
Step #4 - "build-0e0c5fc8-8e05-45ac-8b9a-5bf482e8f750": 578bed952942: Pulling fs layer
Step #4 - "build-0e0c5fc8-8e05-45ac-8b9a-5bf482e8f750": 031922ef1ad8: Pulling fs layer
Step #4 - "build-0e0c5fc8-8e05-45ac-8b9a-5bf482e8f750": 4634f64188b3: Pulling fs layer
Step #4 - "build-0e0c5fc8-8e05-45ac-8b9a-5bf482e8f750": b0e1c4265b07: Pulling fs layer
Step #4 - "build-0e0c5fc8-8e05-45ac-8b9a-5bf482e8f750": fa68df18bc87: Pulling fs layer
Step #4 - "build-0e0c5fc8-8e05-45ac-8b9a-5bf482e8f750": 61b80708dca3: Pulling fs layer
Step #4 - "build-0e0c5fc8-8e05-45ac-8b9a-5bf482e8f750": 18f751c0abd3: Pulling fs layer
Step #4 - "build-0e0c5fc8-8e05-45ac-8b9a-5bf482e8f750": bc7d87156ef0: Pulling fs layer
Step #4 - "build-0e0c5fc8-8e05-45ac-8b9a-5bf482e8f750": d9f6afa96ced: Pulling fs layer
Step #4 - "build-0e0c5fc8-8e05-45ac-8b9a-5bf482e8f750": 0d4a5fc0bc78: Pulling fs layer
Step #4 - "build-0e0c5fc8-8e05-45ac-8b9a-5bf482e8f750": 045e14ded8ab: Pulling fs layer
Step #4 - "build-0e0c5fc8-8e05-45ac-8b9a-5bf482e8f750": 8ce3bef6e352: Pulling fs layer
Step #4 - "build-0e0c5fc8-8e05-45ac-8b9a-5bf482e8f750": ce5d28093142: Pulling fs layer
Step #4 - "build-0e0c5fc8-8e05-45ac-8b9a-5bf482e8f750": 8dfb94c34e3c: Pulling fs layer
Step #4 - "build-0e0c5fc8-8e05-45ac-8b9a-5bf482e8f750": 3eb70e7a6cfd: Pulling fs layer
Step #4 - "build-0e0c5fc8-8e05-45ac-8b9a-5bf482e8f750": f1c042e217d3: Pulling fs layer
Step #4 - "build-0e0c5fc8-8e05-45ac-8b9a-5bf482e8f750": 87b16c091ffd: Pulling fs layer
Step #4 - "build-0e0c5fc8-8e05-45ac-8b9a-5bf482e8f750": 495e8b60812c: Pulling fs layer
Step #4 - "build-0e0c5fc8-8e05-45ac-8b9a-5bf482e8f750": 138bd700ca70: Pulling fs layer
Step #4 - "build-0e0c5fc8-8e05-45ac-8b9a-5bf482e8f750": 490cb0d67cad: Pulling fs layer
Step #4 - "build-0e0c5fc8-8e05-45ac-8b9a-5bf482e8f750": db7240b611b7: Pulling fs layer
Step #4 - "build-0e0c5fc8-8e05-45ac-8b9a-5bf482e8f750": c85610d7ecf2: Pulling fs layer
Step #4 - "build-0e0c5fc8-8e05-45ac-8b9a-5bf482e8f750": baafaeca26cf: Pulling fs layer
Step #4 - "build-0e0c5fc8-8e05-45ac-8b9a-5bf482e8f750": 2cfd06514306: Pulling fs layer
Step #4 - "build-0e0c5fc8-8e05-45ac-8b9a-5bf482e8f750": 1cf70f5c2db3: Pulling fs layer
Step #4 - "build-0e0c5fc8-8e05-45ac-8b9a-5bf482e8f750": 7d2f4ffe73be: Pulling fs layer
Step #4 - "build-0e0c5fc8-8e05-45ac-8b9a-5bf482e8f750": 44ca07238137: Pulling fs layer
Step #4 - "build-0e0c5fc8-8e05-45ac-8b9a-5bf482e8f750": c9f7989cf0cc: Pulling fs layer
Step #4 - "build-0e0c5fc8-8e05-45ac-8b9a-5bf482e8f750": 177d37e3b2f2: Pulling fs layer
Step #4 - "build-0e0c5fc8-8e05-45ac-8b9a-5bf482e8f750": b0e1c4265b07: Waiting
Step #4 - "build-0e0c5fc8-8e05-45ac-8b9a-5bf482e8f750": fa68df18bc87: Waiting
Step #4 - "build-0e0c5fc8-8e05-45ac-8b9a-5bf482e8f750": 495e8b60812c: Waiting
Step #4 - "build-0e0c5fc8-8e05-45ac-8b9a-5bf482e8f750": 61b80708dca3: Waiting
Step #4 - "build-0e0c5fc8-8e05-45ac-8b9a-5bf482e8f750": 138bd700ca70: Waiting
Step #4 - "build-0e0c5fc8-8e05-45ac-8b9a-5bf482e8f750": 490cb0d67cad: Waiting
Step #4 - "build-0e0c5fc8-8e05-45ac-8b9a-5bf482e8f750": 18f751c0abd3: Waiting
Step #4 - "build-0e0c5fc8-8e05-45ac-8b9a-5bf482e8f750": db7240b611b7: Waiting
Step #4 - "build-0e0c5fc8-8e05-45ac-8b9a-5bf482e8f750": c85610d7ecf2: Waiting
Step #4 - "build-0e0c5fc8-8e05-45ac-8b9a-5bf482e8f750": baafaeca26cf: Waiting
Step #4 - "build-0e0c5fc8-8e05-45ac-8b9a-5bf482e8f750": 8dfb94c34e3c: Waiting
Step #4 - "build-0e0c5fc8-8e05-45ac-8b9a-5bf482e8f750": 3eb70e7a6cfd: Waiting
Step #4 - "build-0e0c5fc8-8e05-45ac-8b9a-5bf482e8f750": bc7d87156ef0: Waiting
Step #4 - "build-0e0c5fc8-8e05-45ac-8b9a-5bf482e8f750": f1c042e217d3: Waiting
Step #4 - "build-0e0c5fc8-8e05-45ac-8b9a-5bf482e8f750": 031922ef1ad8: Waiting
Step #4 - "build-0e0c5fc8-8e05-45ac-8b9a-5bf482e8f750": 87b16c091ffd: Waiting
Step #4 - "build-0e0c5fc8-8e05-45ac-8b9a-5bf482e8f750": d9f6afa96ced: Waiting
Step #4 - "build-0e0c5fc8-8e05-45ac-8b9a-5bf482e8f750": 2cfd06514306: Waiting
Step #4 - "build-0e0c5fc8-8e05-45ac-8b9a-5bf482e8f750": c9f7989cf0cc: Waiting
Step #4 - "build-0e0c5fc8-8e05-45ac-8b9a-5bf482e8f750": 0d4a5fc0bc78: Waiting
Step #4 - "build-0e0c5fc8-8e05-45ac-8b9a-5bf482e8f750": 8ce3bef6e352: Waiting
Step #4 - "build-0e0c5fc8-8e05-45ac-8b9a-5bf482e8f750": ce5d28093142: Waiting
Step #4 - "build-0e0c5fc8-8e05-45ac-8b9a-5bf482e8f750": 4634f64188b3: Waiting
Step #4 - "build-0e0c5fc8-8e05-45ac-8b9a-5bf482e8f750": 1cf70f5c2db3: Waiting
Step #4 - "build-0e0c5fc8-8e05-45ac-8b9a-5bf482e8f750": 44ca07238137: Waiting
Step #4 - "build-0e0c5fc8-8e05-45ac-8b9a-5bf482e8f750": 7d2f4ffe73be: Waiting
Step #4 - "build-0e0c5fc8-8e05-45ac-8b9a-5bf482e8f750": 177d37e3b2f2: Waiting
Step #4 - "build-0e0c5fc8-8e05-45ac-8b9a-5bf482e8f750": 578bed952942: Download complete
Step #4 - "build-0e0c5fc8-8e05-45ac-8b9a-5bf482e8f750": 1810409b6ceb: Verifying Checksum
Step #4 - "build-0e0c5fc8-8e05-45ac-8b9a-5bf482e8f750": 1810409b6ceb: Download complete
Step #4 - "build-0e0c5fc8-8e05-45ac-8b9a-5bf482e8f750": 4634f64188b3: Verifying Checksum
Step #4 - "build-0e0c5fc8-8e05-45ac-8b9a-5bf482e8f750": 4634f64188b3: Download complete
Step #4 - "build-0e0c5fc8-8e05-45ac-8b9a-5bf482e8f750": 82182e8f92cb: Verifying Checksum
Step #4 - "build-0e0c5fc8-8e05-45ac-8b9a-5bf482e8f750": 82182e8f92cb: Download complete
Step #4 - "build-0e0c5fc8-8e05-45ac-8b9a-5bf482e8f750": b0e1c4265b07: Verifying Checksum
Step #4 - "build-0e0c5fc8-8e05-45ac-8b9a-5bf482e8f750": b0e1c4265b07: Download complete
Step #4 - "build-0e0c5fc8-8e05-45ac-8b9a-5bf482e8f750": 61b80708dca3: Verifying Checksum
Step #4 - "build-0e0c5fc8-8e05-45ac-8b9a-5bf482e8f750": 61b80708dca3: Download complete
Step #4 - "build-0e0c5fc8-8e05-45ac-8b9a-5bf482e8f750": 18f751c0abd3: Verifying Checksum
Step #4 - "build-0e0c5fc8-8e05-45ac-8b9a-5bf482e8f750": 18f751c0abd3: Download complete
Step #4 - "build-0e0c5fc8-8e05-45ac-8b9a-5bf482e8f750": bc7d87156ef0: Verifying Checksum
Step #4 - "build-0e0c5fc8-8e05-45ac-8b9a-5bf482e8f750": bc7d87156ef0: Download complete
Step #4 - "build-0e0c5fc8-8e05-45ac-8b9a-5bf482e8f750": d9f6afa96ced: Verifying Checksum
Step #4 - "build-0e0c5fc8-8e05-45ac-8b9a-5bf482e8f750": d9f6afa96ced: Download complete
Step #4 - "build-0e0c5fc8-8e05-45ac-8b9a-5bf482e8f750": 82182e8f92cb: Pull complete
Step #4 - "build-0e0c5fc8-8e05-45ac-8b9a-5bf482e8f750": 0d4a5fc0bc78: Verifying Checksum
Step #4 - "build-0e0c5fc8-8e05-45ac-8b9a-5bf482e8f750": 0d4a5fc0bc78: Download complete
Step #4 - "build-0e0c5fc8-8e05-45ac-8b9a-5bf482e8f750": 045e14ded8ab: Verifying Checksum
Step #4 - "build-0e0c5fc8-8e05-45ac-8b9a-5bf482e8f750": 045e14ded8ab: Download complete
Step #4 - "build-0e0c5fc8-8e05-45ac-8b9a-5bf482e8f750": fa68df18bc87: Verifying Checksum
Step #4 - "build-0e0c5fc8-8e05-45ac-8b9a-5bf482e8f750": fa68df18bc87: Download complete
Step #4 - "build-0e0c5fc8-8e05-45ac-8b9a-5bf482e8f750": 8ce3bef6e352: Verifying Checksum
Step #4 - "build-0e0c5fc8-8e05-45ac-8b9a-5bf482e8f750": 8ce3bef6e352: Download complete
Step #4 - "build-0e0c5fc8-8e05-45ac-8b9a-5bf482e8f750": 1810409b6ceb: Pull complete
Step #4 - "build-0e0c5fc8-8e05-45ac-8b9a-5bf482e8f750": ce5d28093142: Verifying Checksum
Step #4 - "build-0e0c5fc8-8e05-45ac-8b9a-5bf482e8f750": ce5d28093142: Download complete
Step #4 - "build-0e0c5fc8-8e05-45ac-8b9a-5bf482e8f750": 578bed952942: Pull complete
Step #4 - "build-0e0c5fc8-8e05-45ac-8b9a-5bf482e8f750": 8dfb94c34e3c: Download complete
Step #4 - "build-0e0c5fc8-8e05-45ac-8b9a-5bf482e8f750": 3eb70e7a6cfd: Verifying Checksum
Step #4 - "build-0e0c5fc8-8e05-45ac-8b9a-5bf482e8f750": 3eb70e7a6cfd: Download complete
Step #4 - "build-0e0c5fc8-8e05-45ac-8b9a-5bf482e8f750": f1c042e217d3: Verifying Checksum
Step #4 - "build-0e0c5fc8-8e05-45ac-8b9a-5bf482e8f750": f1c042e217d3: Download complete
Step #4 - "build-0e0c5fc8-8e05-45ac-8b9a-5bf482e8f750": 87b16c091ffd: Verifying Checksum
Step #4 - "build-0e0c5fc8-8e05-45ac-8b9a-5bf482e8f750": 87b16c091ffd: Download complete
Step #4 - "build-0e0c5fc8-8e05-45ac-8b9a-5bf482e8f750": 031922ef1ad8: Verifying Checksum
Step #4 - "build-0e0c5fc8-8e05-45ac-8b9a-5bf482e8f750": 031922ef1ad8: Download complete
Step #4 - "build-0e0c5fc8-8e05-45ac-8b9a-5bf482e8f750": 138bd700ca70: Verifying Checksum
Step #4 - "build-0e0c5fc8-8e05-45ac-8b9a-5bf482e8f750": 138bd700ca70: Download complete
Step #4 - "build-0e0c5fc8-8e05-45ac-8b9a-5bf482e8f750": 495e8b60812c: Verifying Checksum
Step #4 - "build-0e0c5fc8-8e05-45ac-8b9a-5bf482e8f750": 495e8b60812c: Download complete
Step #4 - "build-0e0c5fc8-8e05-45ac-8b9a-5bf482e8f750": 490cb0d67cad: Verifying Checksum
Step #4 - "build-0e0c5fc8-8e05-45ac-8b9a-5bf482e8f750": 490cb0d67cad: Download complete
Step #4 - "build-0e0c5fc8-8e05-45ac-8b9a-5bf482e8f750": db7240b611b7: Download complete
Step #4 - "build-0e0c5fc8-8e05-45ac-8b9a-5bf482e8f750": c85610d7ecf2: Download complete
Step #4 - "build-0e0c5fc8-8e05-45ac-8b9a-5bf482e8f750": baafaeca26cf: Verifying Checksum
Step #4 - "build-0e0c5fc8-8e05-45ac-8b9a-5bf482e8f750": baafaeca26cf: Download complete
Step #4 - "build-0e0c5fc8-8e05-45ac-8b9a-5bf482e8f750": 2cfd06514306: Verifying Checksum
Step #4 - "build-0e0c5fc8-8e05-45ac-8b9a-5bf482e8f750": 2cfd06514306: Download complete
Step #4 - "build-0e0c5fc8-8e05-45ac-8b9a-5bf482e8f750": 7d2f4ffe73be: Verifying Checksum
Step #4 - "build-0e0c5fc8-8e05-45ac-8b9a-5bf482e8f750": 7d2f4ffe73be: Download complete
Step #4 - "build-0e0c5fc8-8e05-45ac-8b9a-5bf482e8f750": 1cf70f5c2db3: Verifying Checksum
Step #4 - "build-0e0c5fc8-8e05-45ac-8b9a-5bf482e8f750": 1cf70f5c2db3: Download complete
Step #4 - "build-0e0c5fc8-8e05-45ac-8b9a-5bf482e8f750": 177d37e3b2f2: Verifying Checksum
Step #4 - "build-0e0c5fc8-8e05-45ac-8b9a-5bf482e8f750": 177d37e3b2f2: Download complete
Step #4 - "build-0e0c5fc8-8e05-45ac-8b9a-5bf482e8f750": 44ca07238137: Verifying Checksum
Step #4 - "build-0e0c5fc8-8e05-45ac-8b9a-5bf482e8f750": 44ca07238137: Download complete
Step #4 - "build-0e0c5fc8-8e05-45ac-8b9a-5bf482e8f750": c9f7989cf0cc: Download complete
Step #4 - "build-0e0c5fc8-8e05-45ac-8b9a-5bf482e8f750": 031922ef1ad8: Pull complete
Step #4 - "build-0e0c5fc8-8e05-45ac-8b9a-5bf482e8f750": 4634f64188b3: Pull complete
Step #4 - "build-0e0c5fc8-8e05-45ac-8b9a-5bf482e8f750": b0e1c4265b07: Pull complete
Step #4 - "build-0e0c5fc8-8e05-45ac-8b9a-5bf482e8f750": fa68df18bc87: Pull complete
Step #4 - "build-0e0c5fc8-8e05-45ac-8b9a-5bf482e8f750": 61b80708dca3: Pull complete
Step #4 - "build-0e0c5fc8-8e05-45ac-8b9a-5bf482e8f750": 18f751c0abd3: Pull complete
Step #4 - "build-0e0c5fc8-8e05-45ac-8b9a-5bf482e8f750": bc7d87156ef0: Pull complete
Step #4 - "build-0e0c5fc8-8e05-45ac-8b9a-5bf482e8f750": d9f6afa96ced: Pull complete
Step #4 - "build-0e0c5fc8-8e05-45ac-8b9a-5bf482e8f750": 0d4a5fc0bc78: Pull complete
Step #4 - "build-0e0c5fc8-8e05-45ac-8b9a-5bf482e8f750": 045e14ded8ab: Pull complete
Step #4 - "build-0e0c5fc8-8e05-45ac-8b9a-5bf482e8f750": 8ce3bef6e352: Pull complete
Step #4 - "build-0e0c5fc8-8e05-45ac-8b9a-5bf482e8f750": ce5d28093142: Pull complete
Step #4 - "build-0e0c5fc8-8e05-45ac-8b9a-5bf482e8f750": 8dfb94c34e3c: Pull complete
Step #4 - "build-0e0c5fc8-8e05-45ac-8b9a-5bf482e8f750": 3eb70e7a6cfd: Pull complete
Step #4 - "build-0e0c5fc8-8e05-45ac-8b9a-5bf482e8f750": f1c042e217d3: Pull complete
Step #4 - "build-0e0c5fc8-8e05-45ac-8b9a-5bf482e8f750": 87b16c091ffd: Pull complete
Step #4 - "build-0e0c5fc8-8e05-45ac-8b9a-5bf482e8f750": 495e8b60812c: Pull complete
Step #4 - "build-0e0c5fc8-8e05-45ac-8b9a-5bf482e8f750": 138bd700ca70: Pull complete
Step #4 - "build-0e0c5fc8-8e05-45ac-8b9a-5bf482e8f750": 490cb0d67cad: Pull complete
Step #4 - "build-0e0c5fc8-8e05-45ac-8b9a-5bf482e8f750": db7240b611b7: Pull complete
Step #4 - "build-0e0c5fc8-8e05-45ac-8b9a-5bf482e8f750": c85610d7ecf2: Pull complete
Step #4 - "build-0e0c5fc8-8e05-45ac-8b9a-5bf482e8f750": baafaeca26cf: Pull complete
Step #4 - "build-0e0c5fc8-8e05-45ac-8b9a-5bf482e8f750": 2cfd06514306: Pull complete
Step #4 - "build-0e0c5fc8-8e05-45ac-8b9a-5bf482e8f750": 1cf70f5c2db3: Pull complete
Step #4 - "build-0e0c5fc8-8e05-45ac-8b9a-5bf482e8f750": 7d2f4ffe73be: Pull complete
Step #4 - "build-0e0c5fc8-8e05-45ac-8b9a-5bf482e8f750": 44ca07238137: Pull complete
Step #4 - "build-0e0c5fc8-8e05-45ac-8b9a-5bf482e8f750": c9f7989cf0cc: Pull complete
Step #4 - "build-0e0c5fc8-8e05-45ac-8b9a-5bf482e8f750": 177d37e3b2f2: Pull complete
Step #4 - "build-0e0c5fc8-8e05-45ac-8b9a-5bf482e8f750": Digest: sha256:7478e98725150719636bccc644be68a257b758c9835cc8314616d9c3fc533309
Step #4 - "build-0e0c5fc8-8e05-45ac-8b9a-5bf482e8f750": Status: Downloaded newer image for gcr.io/oss-fuzz-base/base-builder:latest
Step #4 - "build-0e0c5fc8-8e05-45ac-8b9a-5bf482e8f750": ---> 6afc04b4c557
Step #4 - "build-0e0c5fc8-8e05-45ac-8b9a-5bf482e8f750": Step 2/7 : RUN apt-get update && apt-get install -y build-essential cmake gettext make
Step #4 - "build-0e0c5fc8-8e05-45ac-8b9a-5bf482e8f750": ---> Running in ab4428950204
Step #4 - "build-0e0c5fc8-8e05-45ac-8b9a-5bf482e8f750": Get:1 http://security.ubuntu.com/ubuntu focal-security InRelease [128 kB]
Step #4 - "build-0e0c5fc8-8e05-45ac-8b9a-5bf482e8f750": Hit:2 http://archive.ubuntu.com/ubuntu focal InRelease
Step #4 - "build-0e0c5fc8-8e05-45ac-8b9a-5bf482e8f750": Get:3 http://archive.ubuntu.com/ubuntu focal-updates InRelease [128 kB]
Step #4 - "build-0e0c5fc8-8e05-45ac-8b9a-5bf482e8f750": Get:4 http://archive.ubuntu.com/ubuntu focal-backports InRelease [128 kB]
Step #4 - "build-0e0c5fc8-8e05-45ac-8b9a-5bf482e8f750": Fetched 383 kB in 1s (624 kB/s)
Step #4 - "build-0e0c5fc8-8e05-45ac-8b9a-5bf482e8f750": Reading package lists...
Step #4 - "build-0e0c5fc8-8e05-45ac-8b9a-5bf482e8f750": Reading package lists...
Step #4 - "build-0e0c5fc8-8e05-45ac-8b9a-5bf482e8f750": Building dependency tree...
Step #4 - "build-0e0c5fc8-8e05-45ac-8b9a-5bf482e8f750": Reading state information...
Step #4 - "build-0e0c5fc8-8e05-45ac-8b9a-5bf482e8f750": make is already the newest version (4.2.1-1.2).
Step #4 - "build-0e0c5fc8-8e05-45ac-8b9a-5bf482e8f750": make set to manually installed.
Step #4 - "build-0e0c5fc8-8e05-45ac-8b9a-5bf482e8f750": build-essential is already the newest version (12.8ubuntu1.1).
Step #4 - "build-0e0c5fc8-8e05-45ac-8b9a-5bf482e8f750": The following additional packages will be installed:
Step #4 - "build-0e0c5fc8-8e05-45ac-8b9a-5bf482e8f750": cmake-data gettext-base libarchive13 libcroco3 libglib2.0-0 libglib2.0-data
Step #4 - "build-0e0c5fc8-8e05-45ac-8b9a-5bf482e8f750": libicu66 libjsoncpp1 librhash0 libuv1 libxml2 shared-mime-info xdg-user-dirs
Step #4 - "build-0e0c5fc8-8e05-45ac-8b9a-5bf482e8f750": Suggested packages:
Step #4 - "build-0e0c5fc8-8e05-45ac-8b9a-5bf482e8f750": cmake-doc ninja-build gettext-doc autopoint libasprintf-dev libgettextpo-dev
Step #4 - "build-0e0c5fc8-8e05-45ac-8b9a-5bf482e8f750": lrzip
Step #4 - "build-0e0c5fc8-8e05-45ac-8b9a-5bf482e8f750": The following NEW packages will be installed:
Step #4 - "build-0e0c5fc8-8e05-45ac-8b9a-5bf482e8f750": cmake cmake-data gettext gettext-base libarchive13 libcroco3 libglib2.0-0
Step #4 - "build-0e0c5fc8-8e05-45ac-8b9a-5bf482e8f750": libglib2.0-data libicu66 libjsoncpp1 librhash0 libuv1 libxml2
Step #4 - "build-0e0c5fc8-8e05-45ac-8b9a-5bf482e8f750": shared-mime-info xdg-user-dirs
Step #4 - "build-0e0c5fc8-8e05-45ac-8b9a-5bf482e8f750": 0 upgraded, 15 newly installed, 0 to remove and 0 not upgraded.
Step #4 - "build-0e0c5fc8-8e05-45ac-8b9a-5bf482e8f750": Need to get 17.8 MB of archives.
Step #4 - "build-0e0c5fc8-8e05-45ac-8b9a-5bf482e8f750": After this operation, 77.0 MB of additional disk space will be used.
Step #4 - "build-0e0c5fc8-8e05-45ac-8b9a-5bf482e8f750": Get:1 http://archive.ubuntu.com/ubuntu focal-updates/main amd64 libglib2.0-0 amd64 2.64.6-1~ubuntu20.04.8 [1289 kB]
Step #4 - "build-0e0c5fc8-8e05-45ac-8b9a-5bf482e8f750": Get:2 http://archive.ubuntu.com/ubuntu focal-updates/main amd64 libglib2.0-data all 2.64.6-1~ubuntu20.04.8 [5848 B]
Step #4 - "build-0e0c5fc8-8e05-45ac-8b9a-5bf482e8f750": Get:3 http://archive.ubuntu.com/ubuntu focal-updates/main amd64 libicu66 amd64 66.1-2ubuntu2.1 [8515 kB]
Step #4 - "build-0e0c5fc8-8e05-45ac-8b9a-5bf482e8f750": Get:4 http://archive.ubuntu.com/ubuntu focal-updates/main amd64 libxml2 amd64 2.9.10+dfsg-5ubuntu0.20.04.9 [641 kB]
Step #4 - "build-0e0c5fc8-8e05-45ac-8b9a-5bf482e8f750": Get:5 http://archive.ubuntu.com/ubuntu focal/main amd64 shared-mime-info amd64 1.15-1 [430 kB]
Step #4 - "build-0e0c5fc8-8e05-45ac-8b9a-5bf482e8f750": Get:6 http://archive.ubuntu.com/ubuntu focal/main amd64 xdg-user-dirs amd64 0.17-2ubuntu1 [48.3 kB]
Step #4 - "build-0e0c5fc8-8e05-45ac-8b9a-5bf482e8f750": Get:7 http://archive.ubuntu.com/ubuntu focal/main amd64 gettext-base amd64 0.19.8.1-10build1 [50.2 kB]
Step #4 - "build-0e0c5fc8-8e05-45ac-8b9a-5bf482e8f750": Get:8 http://archive.ubuntu.com/ubuntu focal-updates/main amd64 libuv1 amd64 1.34.2-1ubuntu1.5 [80.9 kB]
Step #4 - "build-0e0c5fc8-8e05-45ac-8b9a-5bf482e8f750": Get:9 http://archive.ubuntu.com/ubuntu focal-updates/main amd64 cmake-data all 3.16.3-1ubuntu1.20.04.1 [1613 kB]
Step #4 - "build-0e0c5fc8-8e05-45ac-8b9a-5bf482e8f750": Get:10 http://archive.ubuntu.com/ubuntu focal-updates/main amd64 libarchive13 amd64 3.4.0-2ubuntu1.4 [327 kB]
Step #4 - "build-0e0c5fc8-8e05-45ac-8b9a-5bf482e8f750": Get:11 http://archive.ubuntu.com/ubuntu focal/main amd64 libjsoncpp1 amd64 1.7.4-3.1ubuntu2 [75.6 kB]
Step #4 - "build-0e0c5fc8-8e05-45ac-8b9a-5bf482e8f750": Get:12 http://archive.ubuntu.com/ubuntu focal/main amd64 librhash0 amd64 1.3.9-1 [113 kB]
Step #4 - "build-0e0c5fc8-8e05-45ac-8b9a-5bf482e8f750": Get:13 http://archive.ubuntu.com/ubuntu focal-updates/main amd64 cmake amd64 3.16.3-1ubuntu1.20.04.1 [3668 kB]
Step #4 - "build-0e0c5fc8-8e05-45ac-8b9a-5bf482e8f750": Get:14 http://archive.ubuntu.com/ubuntu focal-updates/main amd64 libcroco3 amd64 0.6.13-1ubuntu0.1 [82.4 kB]
Step #4 - "build-0e0c5fc8-8e05-45ac-8b9a-5bf482e8f750": Get:15 http://archive.ubuntu.com/ubuntu focal/main amd64 gettext amd64 0.19.8.1-10build1 [895 kB]
Step #4 - "build-0e0c5fc8-8e05-45ac-8b9a-5bf482e8f750": [91mdebconf: delaying package configuration, since apt-utils is not installed
Step #4 - "build-0e0c5fc8-8e05-45ac-8b9a-5bf482e8f750": [0mFetched 17.8 MB in 2s (9598 kB/s)
Step #4 - "build-0e0c5fc8-8e05-45ac-8b9a-5bf482e8f750": Selecting previously unselected package libglib2.0-0:amd64.
Step #4 - "build-0e0c5fc8-8e05-45ac-8b9a-5bf482e8f750": (Reading database ...
(Reading database ... 5%
(Reading database ... 10%
(Reading database ... 15%
(Reading database ... 20%
(Reading database ... 25%
(Reading database ... 30%
(Reading database ... 35%
(Reading database ... 40%
(Reading database ... 45%
(Reading database ... 50%
(Reading database ... 55%
(Reading database ... 60%
(Reading database ... 65%
(Reading database ... 70%
(Reading database ... 75%
(Reading database ... 80%
(Reading database ... 85%
(Reading database ... 90%
(Reading database ... 95%
(Reading database ... 100%
(Reading database ... 17394 files and directories currently installed.)
Step #4 - "build-0e0c5fc8-8e05-45ac-8b9a-5bf482e8f750": Preparing to unpack .../00-libglib2.0-0_2.64.6-1~ubuntu20.04.8_amd64.deb ...
Step #4 - "build-0e0c5fc8-8e05-45ac-8b9a-5bf482e8f750": Unpacking libglib2.0-0:amd64 (2.64.6-1~ubuntu20.04.8) ...
Step #4 - "build-0e0c5fc8-8e05-45ac-8b9a-5bf482e8f750": Selecting previously unselected package libglib2.0-data.
Step #4 - "build-0e0c5fc8-8e05-45ac-8b9a-5bf482e8f750": Preparing to unpack .../01-libglib2.0-data_2.64.6-1~ubuntu20.04.8_all.deb ...
Step #4 - "build-0e0c5fc8-8e05-45ac-8b9a-5bf482e8f750": Unpacking libglib2.0-data (2.64.6-1~ubuntu20.04.8) ...
Step #4 - "build-0e0c5fc8-8e05-45ac-8b9a-5bf482e8f750": Selecting previously unselected package libicu66:amd64.
Step #4 - "build-0e0c5fc8-8e05-45ac-8b9a-5bf482e8f750": Preparing to unpack .../02-libicu66_66.1-2ubuntu2.1_amd64.deb ...
Step #4 - "build-0e0c5fc8-8e05-45ac-8b9a-5bf482e8f750": Unpacking libicu66:amd64 (66.1-2ubuntu2.1) ...
Step #4 - "build-0e0c5fc8-8e05-45ac-8b9a-5bf482e8f750": Selecting previously unselected package libxml2:amd64.
Step #4 - "build-0e0c5fc8-8e05-45ac-8b9a-5bf482e8f750": Preparing to unpack .../03-libxml2_2.9.10+dfsg-5ubuntu0.20.04.9_amd64.deb ...
Step #4 - "build-0e0c5fc8-8e05-45ac-8b9a-5bf482e8f750": Unpacking libxml2:amd64 (2.9.10+dfsg-5ubuntu0.20.04.9) ...
Step #4 - "build-0e0c5fc8-8e05-45ac-8b9a-5bf482e8f750": Selecting previously unselected package shared-mime-info.
Step #4 - "build-0e0c5fc8-8e05-45ac-8b9a-5bf482e8f750": Preparing to unpack .../04-shared-mime-info_1.15-1_amd64.deb ...
Step #4 - "build-0e0c5fc8-8e05-45ac-8b9a-5bf482e8f750": Unpacking shared-mime-info (1.15-1) ...
Step #4 - "build-0e0c5fc8-8e05-45ac-8b9a-5bf482e8f750": Selecting previously unselected package xdg-user-dirs.
Step #4 - "build-0e0c5fc8-8e05-45ac-8b9a-5bf482e8f750": Preparing to unpack .../05-xdg-user-dirs_0.17-2ubuntu1_amd64.deb ...
Step #4 - "build-0e0c5fc8-8e05-45ac-8b9a-5bf482e8f750": Unpacking xdg-user-dirs (0.17-2ubuntu1) ...
Step #4 - "build-0e0c5fc8-8e05-45ac-8b9a-5bf482e8f750": Selecting previously unselected package gettext-base.
Step #4 - "build-0e0c5fc8-8e05-45ac-8b9a-5bf482e8f750": Preparing to unpack .../06-gettext-base_0.19.8.1-10build1_amd64.deb ...
Step #4 - "build-0e0c5fc8-8e05-45ac-8b9a-5bf482e8f750": Unpacking gettext-base (0.19.8.1-10build1) ...
Step #4 - "build-0e0c5fc8-8e05-45ac-8b9a-5bf482e8f750": Selecting previously unselected package libuv1:amd64.
Step #4 - "build-0e0c5fc8-8e05-45ac-8b9a-5bf482e8f750": Preparing to unpack .../07-libuv1_1.34.2-1ubuntu1.5_amd64.deb ...
Step #4 - "build-0e0c5fc8-8e05-45ac-8b9a-5bf482e8f750": Unpacking libuv1:amd64 (1.34.2-1ubuntu1.5) ...
Step #4 - "build-0e0c5fc8-8e05-45ac-8b9a-5bf482e8f750": Selecting previously unselected package cmake-data.
Step #4 - "build-0e0c5fc8-8e05-45ac-8b9a-5bf482e8f750": Preparing to unpack .../08-cmake-data_3.16.3-1ubuntu1.20.04.1_all.deb ...
Step #4 - "build-0e0c5fc8-8e05-45ac-8b9a-5bf482e8f750": Unpacking cmake-data (3.16.3-1ubuntu1.20.04.1) ...
Step #4 - "build-0e0c5fc8-8e05-45ac-8b9a-5bf482e8f750": Selecting previously unselected package libarchive13:amd64.
Step #4 - "build-0e0c5fc8-8e05-45ac-8b9a-5bf482e8f750": Preparing to unpack .../09-libarchive13_3.4.0-2ubuntu1.4_amd64.deb ...
Step #4 - "build-0e0c5fc8-8e05-45ac-8b9a-5bf482e8f750": Unpacking libarchive13:amd64 (3.4.0-2ubuntu1.4) ...
Step #4 - "build-0e0c5fc8-8e05-45ac-8b9a-5bf482e8f750": Selecting previously unselected package libjsoncpp1:amd64.
Step #4 - "build-0e0c5fc8-8e05-45ac-8b9a-5bf482e8f750": Preparing to unpack .../10-libjsoncpp1_1.7.4-3.1ubuntu2_amd64.deb ...
Step #4 - "build-0e0c5fc8-8e05-45ac-8b9a-5bf482e8f750": Unpacking libjsoncpp1:amd64 (1.7.4-3.1ubuntu2) ...
Step #4 - "build-0e0c5fc8-8e05-45ac-8b9a-5bf482e8f750": Selecting previously unselected package librhash0:amd64.
Step #4 - "build-0e0c5fc8-8e05-45ac-8b9a-5bf482e8f750": Preparing to unpack .../11-librhash0_1.3.9-1_amd64.deb ...
Step #4 - "build-0e0c5fc8-8e05-45ac-8b9a-5bf482e8f750": Unpacking librhash0:amd64 (1.3.9-1) ...
Step #4 - "build-0e0c5fc8-8e05-45ac-8b9a-5bf482e8f750": Selecting previously unselected package cmake.
Step #4 - "build-0e0c5fc8-8e05-45ac-8b9a-5bf482e8f750": Preparing to unpack .../12-cmake_3.16.3-1ubuntu1.20.04.1_amd64.deb ...
Step #4 - "build-0e0c5fc8-8e05-45ac-8b9a-5bf482e8f750": Unpacking cmake (3.16.3-1ubuntu1.20.04.1) ...
Step #4 - "build-0e0c5fc8-8e05-45ac-8b9a-5bf482e8f750": Selecting previously unselected package libcroco3:amd64.
Step #4 - "build-0e0c5fc8-8e05-45ac-8b9a-5bf482e8f750": Preparing to unpack .../13-libcroco3_0.6.13-1ubuntu0.1_amd64.deb ...
Step #4 - "build-0e0c5fc8-8e05-45ac-8b9a-5bf482e8f750": Unpacking libcroco3:amd64 (0.6.13-1ubuntu0.1) ...
Step #4 - "build-0e0c5fc8-8e05-45ac-8b9a-5bf482e8f750": Selecting previously unselected package gettext.
Step #4 - "build-0e0c5fc8-8e05-45ac-8b9a-5bf482e8f750": Preparing to unpack .../14-gettext_0.19.8.1-10build1_amd64.deb ...
Step #4 - "build-0e0c5fc8-8e05-45ac-8b9a-5bf482e8f750": Unpacking gettext (0.19.8.1-10build1) ...
Step #4 - "build-0e0c5fc8-8e05-45ac-8b9a-5bf482e8f750": Setting up xdg-user-dirs (0.17-2ubuntu1) ...
Step #4 - "build-0e0c5fc8-8e05-45ac-8b9a-5bf482e8f750": Setting up libglib2.0-0:amd64 (2.64.6-1~ubuntu20.04.8) ...
Step #4 - "build-0e0c5fc8-8e05-45ac-8b9a-5bf482e8f750": No schema files found: doing nothing.
Step #4 - "build-0e0c5fc8-8e05-45ac-8b9a-5bf482e8f750": Setting up libicu66:amd64 (66.1-2ubuntu2.1) ...
Step #4 - "build-0e0c5fc8-8e05-45ac-8b9a-5bf482e8f750": Setting up gettext-base (0.19.8.1-10build1) ...
Step #4 - "build-0e0c5fc8-8e05-45ac-8b9a-5bf482e8f750": Setting up libglib2.0-data (2.64.6-1~ubuntu20.04.8) ...
Step #4 - "build-0e0c5fc8-8e05-45ac-8b9a-5bf482e8f750": Setting up libuv1:amd64 (1.34.2-1ubuntu1.5) ...
Step #4 - "build-0e0c5fc8-8e05-45ac-8b9a-5bf482e8f750": Setting up librhash0:amd64 (1.3.9-1) ...
Step #4 - "build-0e0c5fc8-8e05-45ac-8b9a-5bf482e8f750": Setting up cmake-data (3.16.3-1ubuntu1.20.04.1) ...
Step #4 - "build-0e0c5fc8-8e05-45ac-8b9a-5bf482e8f750": Setting up libxml2:amd64 (2.9.10+dfsg-5ubuntu0.20.04.9) ...
Step #4 - "build-0e0c5fc8-8e05-45ac-8b9a-5bf482e8f750": Setting up libjsoncpp1:amd64 (1.7.4-3.1ubuntu2) ...
Step #4 - "build-0e0c5fc8-8e05-45ac-8b9a-5bf482e8f750": Setting up libarchive13:amd64 (3.4.0-2ubuntu1.4) ...
Step #4 - "build-0e0c5fc8-8e05-45ac-8b9a-5bf482e8f750": Setting up shared-mime-info (1.15-1) ...
Step #4 - "build-0e0c5fc8-8e05-45ac-8b9a-5bf482e8f750": Setting up libcroco3:amd64 (0.6.13-1ubuntu0.1) ...
Step #4 - "build-0e0c5fc8-8e05-45ac-8b9a-5bf482e8f750": Setting up cmake (3.16.3-1ubuntu1.20.04.1) ...
Step #4 - "build-0e0c5fc8-8e05-45ac-8b9a-5bf482e8f750": Setting up gettext (0.19.8.1-10build1) ...
Step #4 - "build-0e0c5fc8-8e05-45ac-8b9a-5bf482e8f750": Processing triggers for libc-bin (2.31-0ubuntu9.17) ...
Step #4 - "build-0e0c5fc8-8e05-45ac-8b9a-5bf482e8f750": Removing intermediate container ab4428950204
Step #4 - "build-0e0c5fc8-8e05-45ac-8b9a-5bf482e8f750": ---> 04c459bc5eee
Step #4 - "build-0e0c5fc8-8e05-45ac-8b9a-5bf482e8f750": Step 3/7 : RUN git clone --recurse-submodules https://github.com/google/leveldb.git
Step #4 - "build-0e0c5fc8-8e05-45ac-8b9a-5bf482e8f750": ---> Running in 4a546b9e381f
Step #4 - "build-0e0c5fc8-8e05-45ac-8b9a-5bf482e8f750": [91mCloning into 'leveldb'...
Step #4 - "build-0e0c5fc8-8e05-45ac-8b9a-5bf482e8f750": [0m[91mSubmodule 'third_party/benchmark' (https://github.com/google/benchmark) registered for path 'third_party/benchmark'
Step #4 - "build-0e0c5fc8-8e05-45ac-8b9a-5bf482e8f750": [0m[91mSubmodule 'third_party/googletest' (https://github.com/google/googletest.git) registered for path 'third_party/googletest'
Step #4 - "build-0e0c5fc8-8e05-45ac-8b9a-5bf482e8f750": [0m[91mCloning into '/src/leveldb/third_party/benchmark'...
Step #4 - "build-0e0c5fc8-8e05-45ac-8b9a-5bf482e8f750": [0m[91mCloning into '/src/leveldb/third_party/googletest'...
Step #4 - "build-0e0c5fc8-8e05-45ac-8b9a-5bf482e8f750": [0mSubmodule path 'third_party/benchmark': checked out 'f7547e29ccaed7b64ef4f7495ecfff1c9f6f3d03'
Step #4 - "build-0e0c5fc8-8e05-45ac-8b9a-5bf482e8f750": Submodule path 'third_party/googletest': checked out '662fe38e44900c007eccb65a5d2ea19df7bd520e'
Step #4 - "build-0e0c5fc8-8e05-45ac-8b9a-5bf482e8f750": Removing intermediate container 4a546b9e381f
Step #4 - "build-0e0c5fc8-8e05-45ac-8b9a-5bf482e8f750": ---> 970024201d2e
Step #4 - "build-0e0c5fc8-8e05-45ac-8b9a-5bf482e8f750": Step 4/7 : WORKDIR $SRC/
Step #4 - "build-0e0c5fc8-8e05-45ac-8b9a-5bf482e8f750": ---> Running in ab7e9aefbbe0
Step #4 - "build-0e0c5fc8-8e05-45ac-8b9a-5bf482e8f750": Removing intermediate container ab7e9aefbbe0
Step #4 - "build-0e0c5fc8-8e05-45ac-8b9a-5bf482e8f750": ---> 0c9f75f426eb
Step #4 - "build-0e0c5fc8-8e05-45ac-8b9a-5bf482e8f750": Step 5/7 : COPY build.sh $SRC/
Step #4 - "build-0e0c5fc8-8e05-45ac-8b9a-5bf482e8f750": ---> af0f1e850cd8
Step #4 - "build-0e0c5fc8-8e05-45ac-8b9a-5bf482e8f750": Step 6/7 : COPY *.cc $SRC/leveldb/
Step #4 - "build-0e0c5fc8-8e05-45ac-8b9a-5bf482e8f750": ---> 474ba4609a2b
Step #4 - "build-0e0c5fc8-8e05-45ac-8b9a-5bf482e8f750": Step 7/7 : COPY *.options $SRC/
Step #4 - "build-0e0c5fc8-8e05-45ac-8b9a-5bf482e8f750": ---> 2250412856dd
Step #4 - "build-0e0c5fc8-8e05-45ac-8b9a-5bf482e8f750": Successfully built 2250412856dd
Step #4 - "build-0e0c5fc8-8e05-45ac-8b9a-5bf482e8f750": Successfully tagged gcr.io/oss-fuzz/leveldb:latest
Step #4 - "build-0e0c5fc8-8e05-45ac-8b9a-5bf482e8f750": Successfully tagged us-central1-docker.pkg.dev/oss-fuzz/unsafe/leveldb:latest
Finished Step #4 - "build-0e0c5fc8-8e05-45ac-8b9a-5bf482e8f750"
Starting Step #5 - "srcmap"
Step #5 - "srcmap": Already have image: gcr.io/oss-fuzz/leveldb
Step #5 - "srcmap": ++ tempfile
Step #5 - "srcmap": + SRCMAP=/tmp/fileP7jixN
Step #5 - "srcmap": + echo '{}'
Step #5 - "srcmap": + PATHS_TO_SCAN=/src
Step #5 - "srcmap": + [[ c++ == \g\o ]]
Step #5 - "srcmap": ++ find /src -name .git -type d
Step #5 - "srcmap": + for DOT_GIT_DIR in $(find $PATHS_TO_SCAN -name ".git" -type d)
Step #5 - "srcmap": ++ dirname /src/leveldb/.git
Step #5 - "srcmap": + GIT_DIR=/src/leveldb
Step #5 - "srcmap": + cd /src/leveldb
Step #5 - "srcmap": ++ git config --get remote.origin.url
Step #5 - "srcmap": + GIT_URL=https://github.com/google/leveldb.git
Step #5 - "srcmap": ++ git rev-parse HEAD
Step #5 - "srcmap": + GIT_REV=ac691084fdc5546421a55b25e7653d450e5a25fb
Step #5 - "srcmap": + jq_inplace /tmp/fileP7jixN '."/src/leveldb" = { type: "git", url: "https://github.com/google/leveldb.git", rev: "ac691084fdc5546421a55b25e7653d450e5a25fb" }'
Step #5 - "srcmap": ++ tempfile
Step #5 - "srcmap": + F=/tmp/filekMVOla
Step #5 - "srcmap": + cat /tmp/fileP7jixN
Step #5 - "srcmap": + jq '."/src/leveldb" = { type: "git", url: "https://github.com/google/leveldb.git", rev: "ac691084fdc5546421a55b25e7653d450e5a25fb" }'
Step #5 - "srcmap": + mv /tmp/filekMVOla /tmp/fileP7jixN
Step #5 - "srcmap": ++ find /src -name .svn -type d
Step #5 - "srcmap": ++ find /src -name .hg -type d
Step #5 - "srcmap": + '[' '' '!=' '' ']'
Step #5 - "srcmap": + cat /tmp/fileP7jixN
Step #5 - "srcmap": + rm /tmp/fileP7jixN
Step #5 - "srcmap": {
Step #5 - "srcmap": "/src/leveldb": {
Step #5 - "srcmap": "type": "git",
Step #5 - "srcmap": "url": "https://github.com/google/leveldb.git",
Step #5 - "srcmap": "rev": "ac691084fdc5546421a55b25e7653d450e5a25fb"
Step #5 - "srcmap": }
Step #5 - "srcmap": }
Finished Step #5 - "srcmap"
Starting Step #6 - "compile-libfuzzer-introspector-x86_64"
Step #6 - "compile-libfuzzer-introspector-x86_64": Already have image (with digest): gcr.io/cloud-builders/docker
Step #6 - "compile-libfuzzer-introspector-x86_64": ---------------------------------------------------------------
Step #6 - "compile-libfuzzer-introspector-x86_64": vm.mmap_rnd_bits = 28
Step #6 - "compile-libfuzzer-introspector-x86_64": Compiling libFuzzer to /usr/lib/libFuzzingEngine.a... done.
Step #6 - "compile-libfuzzer-introspector-x86_64":
Reading package lists... 0%
Reading package lists... 0%
Reading package lists... 0%
Reading package lists... 2%
Reading package lists... 2%
Reading package lists... 4%
Reading package lists... 4%
Reading package lists... 4%
Reading package lists... 4%
Reading package lists... 5%
Reading package lists... 5%
Reading package lists... 29%
Reading package lists... 29%
Reading package lists... 42%
Reading package lists... 42%
Reading package lists... 42%
Reading package lists... 42%
Reading package lists... 42%
Reading package lists... 42%
Reading package lists... 53%
Reading package lists... 53%
Reading package lists... 55%
Reading package lists... 55%
Reading package lists... 56%
Reading package lists... 66%
Reading package lists... 66%
Reading package lists... 66%
Reading package lists... 66%
Reading package lists... 70%
Reading package lists... 70%
Reading package lists... 72%
Reading package lists... 72%
Reading package lists... 72%
Reading package lists... 72%
Reading package lists... 72%
Reading package lists... 72%
Reading package lists... 72%
Reading package lists... 72%
Reading package lists... 72%
Reading package lists... 72%
Reading package lists... 72%
Reading package lists... 72%
Reading package lists... 72%
Reading package lists... 72%
Reading package lists... 82%
Reading package lists... 82%
Reading package lists... 84%
Reading package lists... 84%
Reading package lists... 94%
Reading package lists... 94%
Reading package lists... 94%
Reading package lists... 94%
Reading package lists... 97%
Reading package lists... 97%
Reading package lists... 99%
Reading package lists... 99%
Reading package lists... 99%
Reading package lists... 99%
Reading package lists... 99%
Reading package lists... 99%
Reading package lists... Done
Step #6 - "compile-libfuzzer-introspector-x86_64":
Building dependency tree... 0%
Building dependency tree... 0%
Building dependency tree... 50%
Building dependency tree... 50%
Building dependency tree
Step #6 - "compile-libfuzzer-introspector-x86_64":
Reading state information... 0%
Reading state information... 0%
Reading state information... Done
Step #6 - "compile-libfuzzer-introspector-x86_64": The following additional packages will be installed:
Step #6 - "compile-libfuzzer-introspector-x86_64": libjpeg-turbo8 libjpeg-turbo8-dev libjpeg8 libjpeg8-dev libyaml-0-2
Step #6 - "compile-libfuzzer-introspector-x86_64": Suggested packages:
Step #6 - "compile-libfuzzer-introspector-x86_64": libyaml-doc
Step #6 - "compile-libfuzzer-introspector-x86_64": The following NEW packages will be installed:
Step #6 - "compile-libfuzzer-introspector-x86_64": libjpeg-dev libjpeg-turbo8 libjpeg-turbo8-dev libjpeg8 libjpeg8-dev
Step #6 - "compile-libfuzzer-introspector-x86_64": libyaml-0-2 libyaml-dev zlib1g-dev
Step #6 - "compile-libfuzzer-introspector-x86_64": 0 upgraded, 8 newly installed, 0 to remove and 0 not upgraded.
Step #6 - "compile-libfuzzer-introspector-x86_64": Need to get 624 kB of archives.
Step #6 - "compile-libfuzzer-introspector-x86_64": After this operation, 2657 kB of additional disk space will be used.
Step #6 - "compile-libfuzzer-introspector-x86_64":
0% [Working]
Get:1 http://archive.ubuntu.com/ubuntu focal/main amd64 libyaml-0-2 amd64 0.2.2-1 [48.9 kB]
Step #6 - "compile-libfuzzer-introspector-x86_64":
2% [1 libyaml-0-2 12.7 kB/48.9 kB 26%]
9% [Working]
Get:2 http://archive.ubuntu.com/ubuntu focal-updates/main amd64 libjpeg-turbo8 amd64 2.0.3-0ubuntu1.20.04.3 [118 kB]
Step #6 - "compile-libfuzzer-introspector-x86_64":
9% [2 libjpeg-turbo8 2604 B/118 kB 2%]
26% [Waiting for headers]
Get:3 http://archive.ubuntu.com/ubuntu focal-updates/main amd64 libjpeg-turbo8-dev amd64 2.0.3-0ubuntu1.20.04.3 [238 kB]
Step #6 - "compile-libfuzzer-introspector-x86_64":
27% [3 libjpeg-turbo8-dev 1552 B/238 kB 1%]
59% [Waiting for headers]
Get:4 http://archive.ubuntu.com/ubuntu focal/main amd64 libjpeg8 amd64 8c-2ubuntu8 [2194 B]
Step #6 - "compile-libfuzzer-introspector-x86_64":
59% [4 libjpeg8 424 B/2194 B 19%]
62% [Waiting for headers]
Get:5 http://archive.ubuntu.com/ubuntu focal/main amd64 libjpeg8-dev amd64 8c-2ubuntu8 [1552 B]
Step #6 - "compile-libfuzzer-introspector-x86_64":
62% [5 libjpeg8-dev 838 B/1552 B 54%]
65% [Waiting for headers]
Get:6 http://archive.ubuntu.com/ubuntu focal/main amd64 libjpeg-dev amd64 8c-2ubuntu8 [1546 B]
Step #6 - "compile-libfuzzer-introspector-x86_64":
65% [6 libjpeg-dev 0 B/1546 B 0%]
68% [Waiting for headers]
Get:7 http://archive.ubuntu.com/ubuntu focal-updates/main amd64 zlib1g-dev amd64 1:1.2.11.dfsg-2ubuntu1.5 [155 kB]
Step #6 - "compile-libfuzzer-introspector-x86_64":
68% [7 zlib1g-dev 1058 B/155 kB 1%]
90% [Waiting for headers]
Get:8 http://archive.ubuntu.com/ubuntu focal/main amd64 libyaml-dev amd64 0.2.2-1 [58.2 kB]
Step #6 - "compile-libfuzzer-introspector-x86_64":
90% [8 libyaml-dev 2670 B/58.2 kB 5%]
100% [Working]
Fetched 624 kB in 1s (665 kB/s)
Step #6 - "compile-libfuzzer-introspector-x86_64": debconf: delaying package configuration, since apt-utils is not installed
Step #6 - "compile-libfuzzer-introspector-x86_64": Selecting previously unselected package libyaml-0-2:amd64.
Step #6 - "compile-libfuzzer-introspector-x86_64": (Reading database ...
(Reading database ... 5%
(Reading database ... 10%
(Reading database ... 15%
(Reading database ... 20%
(Reading database ... 25%
(Reading database ... 30%
(Reading database ... 35%
(Reading database ... 40%
(Reading database ... 45%
(Reading database ... 50%
(Reading database ... 55%
(Reading database ... 60%
(Reading database ... 65%
(Reading database ... 70%
(Reading database ... 75%
(Reading database ... 80%
(Reading database ... 85%
(Reading database ... 90%
(Reading database ... 95%
(Reading database ... 100%
(Reading database ... 20787 files and directories currently installed.)
Step #6 - "compile-libfuzzer-introspector-x86_64": Preparing to unpack .../0-libyaml-0-2_0.2.2-1_amd64.deb ...
Step #6 - "compile-libfuzzer-introspector-x86_64": Unpacking libyaml-0-2:amd64 (0.2.2-1) ...
Step #6 - "compile-libfuzzer-introspector-x86_64": Selecting previously unselected package libjpeg-turbo8:amd64.
Step #6 - "compile-libfuzzer-introspector-x86_64": Preparing to unpack .../1-libjpeg-turbo8_2.0.3-0ubuntu1.20.04.3_amd64.deb ...
Step #6 - "compile-libfuzzer-introspector-x86_64": Unpacking libjpeg-turbo8:amd64 (2.0.3-0ubuntu1.20.04.3) ...
Step #6 - "compile-libfuzzer-introspector-x86_64": Selecting previously unselected package libjpeg-turbo8-dev:amd64.
Step #6 - "compile-libfuzzer-introspector-x86_64": Preparing to unpack .../2-libjpeg-turbo8-dev_2.0.3-0ubuntu1.20.04.3_amd64.deb ...
Step #6 - "compile-libfuzzer-introspector-x86_64": Unpacking libjpeg-turbo8-dev:amd64 (2.0.3-0ubuntu1.20.04.3) ...
Step #6 - "compile-libfuzzer-introspector-x86_64": Selecting previously unselected package libjpeg8:amd64.
Step #6 - "compile-libfuzzer-introspector-x86_64": Preparing to unpack .../3-libjpeg8_8c-2ubuntu8_amd64.deb ...
Step #6 - "compile-libfuzzer-introspector-x86_64": Unpacking libjpeg8:amd64 (8c-2ubuntu8) ...
Step #6 - "compile-libfuzzer-introspector-x86_64": Selecting previously unselected package libjpeg8-dev:amd64.
Step #6 - "compile-libfuzzer-introspector-x86_64": Preparing to unpack .../4-libjpeg8-dev_8c-2ubuntu8_amd64.deb ...
Step #6 - "compile-libfuzzer-introspector-x86_64": Unpacking libjpeg8-dev:amd64 (8c-2ubuntu8) ...
Step #6 - "compile-libfuzzer-introspector-x86_64": Selecting previously unselected package libjpeg-dev:amd64.
Step #6 - "compile-libfuzzer-introspector-x86_64": Preparing to unpack .../5-libjpeg-dev_8c-2ubuntu8_amd64.deb ...
Step #6 - "compile-libfuzzer-introspector-x86_64": Unpacking libjpeg-dev:amd64 (8c-2ubuntu8) ...
Step #6 - "compile-libfuzzer-introspector-x86_64": Selecting previously unselected package zlib1g-dev:amd64.
Step #6 - "compile-libfuzzer-introspector-x86_64": Preparing to unpack .../6-zlib1g-dev_1%3a1.2.11.dfsg-2ubuntu1.5_amd64.deb ...
Step #6 - "compile-libfuzzer-introspector-x86_64": Unpacking zlib1g-dev:amd64 (1:1.2.11.dfsg-2ubuntu1.5) ...
Step #6 - "compile-libfuzzer-introspector-x86_64": Selecting previously unselected package libyaml-dev:amd64.
Step #6 - "compile-libfuzzer-introspector-x86_64": Preparing to unpack .../7-libyaml-dev_0.2.2-1_amd64.deb ...
Step #6 - "compile-libfuzzer-introspector-x86_64": Unpacking libyaml-dev:amd64 (0.2.2-1) ...
Step #6 - "compile-libfuzzer-introspector-x86_64": Setting up libyaml-0-2:amd64 (0.2.2-1) ...
Step #6 - "compile-libfuzzer-introspector-x86_64": Setting up libjpeg-turbo8:amd64 (2.0.3-0ubuntu1.20.04.3) ...
Step #6 - "compile-libfuzzer-introspector-x86_64": Setting up zlib1g-dev:amd64 (1:1.2.11.dfsg-2ubuntu1.5) ...
Step #6 - "compile-libfuzzer-introspector-x86_64": Setting up libjpeg8:amd64 (8c-2ubuntu8) ...
Step #6 - "compile-libfuzzer-introspector-x86_64": Setting up libjpeg-turbo8-dev:amd64 (2.0.3-0ubuntu1.20.04.3) ...
Step #6 - "compile-libfuzzer-introspector-x86_64": Setting up libyaml-dev:amd64 (0.2.2-1) ...
Step #6 - "compile-libfuzzer-introspector-x86_64": Setting up libjpeg8-dev:amd64 (8c-2ubuntu8) ...
Step #6 - "compile-libfuzzer-introspector-x86_64": Setting up libjpeg-dev:amd64 (8c-2ubuntu8) ...
Step #6 - "compile-libfuzzer-introspector-x86_64": Processing triggers for libc-bin (2.31-0ubuntu9.17) ...
Step #6 - "compile-libfuzzer-introspector-x86_64": Requirement already satisfied: pip in /usr/local/lib/python3.10/site-packages (25.0.1)
Step #6 - "compile-libfuzzer-introspector-x86_64": Requirement already satisfied: setuptools in /usr/local/lib/python3.10/site-packages (65.5.0)
Step #6 - "compile-libfuzzer-introspector-x86_64": Collecting setuptools
Step #6 - "compile-libfuzzer-introspector-x86_64": Downloading setuptools-78.1.0-py3-none-any.whl.metadata (6.6 kB)
Step #6 - "compile-libfuzzer-introspector-x86_64": Downloading setuptools-78.1.0-py3-none-any.whl (1.3 MB)
Step #6 - "compile-libfuzzer-introspector-x86_64": [?25l [90m━━━━━━━━━━━━━━━━━━━━━━━━━━━━━━━━━━━━━━━━[0m [32m0.0/1.3 MB[0m [31m?[0m eta [36m-:--:--[0m
[2K [90m━━━━━━━━━━━━━━━━━━━━━━━━━━━━━━━━━━━━━━━━[0m [32m1.3/1.3 MB[0m [31m30.6 MB/s[0m eta [36m0:00:00[0m
Step #6 - "compile-libfuzzer-introspector-x86_64": [?25hInstalling collected packages: setuptools
Step #6 - "compile-libfuzzer-introspector-x86_64": Attempting uninstall: setuptools
Step #6 - "compile-libfuzzer-introspector-x86_64": Found existing installation: setuptools 65.5.0
Step #6 - "compile-libfuzzer-introspector-x86_64": Uninstalling setuptools-65.5.0:
Step #6 - "compile-libfuzzer-introspector-x86_64": Successfully uninstalled setuptools-65.5.0
Step #6 - "compile-libfuzzer-introspector-x86_64": Successfully installed setuptools-78.1.0
Step #6 - "compile-libfuzzer-introspector-x86_64": [33mWARNING: Running pip as the 'root' user can result in broken permissions and conflicting behaviour with the system package manager, possibly rendering your system unusable. It is recommended to use a virtual environment instead: https://pip.pypa.io/warnings/venv. Use the --root-user-action option if you know what you are doing and want to suppress this warning.[0m[33m
Step #6 - "compile-libfuzzer-introspector-x86_64": [0mCollecting cxxfilt
Step #6 - "compile-libfuzzer-introspector-x86_64": Downloading cxxfilt-0.3.0-py2.py3-none-any.whl.metadata (3.5 kB)
Step #6 - "compile-libfuzzer-introspector-x86_64": Collecting pyyaml
Step #6 - "compile-libfuzzer-introspector-x86_64": Downloading PyYAML-6.0.2-cp310-cp310-manylinux_2_17_x86_64.manylinux2014_x86_64.whl.metadata (2.1 kB)
Step #6 - "compile-libfuzzer-introspector-x86_64": Collecting beautifulsoup4
Step #6 - "compile-libfuzzer-introspector-x86_64": Downloading beautifulsoup4-4.13.3-py3-none-any.whl.metadata (3.8 kB)
Step #6 - "compile-libfuzzer-introspector-x86_64": Collecting lxml
Step #6 - "compile-libfuzzer-introspector-x86_64": Downloading lxml-5.3.1-cp310-cp310-manylinux_2_28_x86_64.whl.metadata (3.7 kB)
Step #6 - "compile-libfuzzer-introspector-x86_64": Collecting soupsieve
Step #6 - "compile-libfuzzer-introspector-x86_64": Downloading soupsieve-2.6-py3-none-any.whl.metadata (4.6 kB)
Step #6 - "compile-libfuzzer-introspector-x86_64": Collecting rust-demangler
Step #6 - "compile-libfuzzer-introspector-x86_64": Downloading rust_demangler-1.0-py3-none-any.whl.metadata (866 bytes)
Step #6 - "compile-libfuzzer-introspector-x86_64": Collecting typing-extensions>=4.0.0 (from beautifulsoup4)
Step #6 - "compile-libfuzzer-introspector-x86_64": Downloading typing_extensions-4.13.0-py3-none-any.whl.metadata (3.0 kB)
Step #6 - "compile-libfuzzer-introspector-x86_64": Downloading cxxfilt-0.3.0-py2.py3-none-any.whl (4.6 kB)
Step #6 - "compile-libfuzzer-introspector-x86_64": Downloading PyYAML-6.0.2-cp310-cp310-manylinux_2_17_x86_64.manylinux2014_x86_64.whl (751 kB)
Step #6 - "compile-libfuzzer-introspector-x86_64": [?25l [90m━━━━━━━━━━━━━━━━━━━━━━━━━━━━━━━━━━━━━━━━[0m [32m0.0/751.2 kB[0m [31m?[0m eta [36m-:--:--[0m
[2K [90m━━━━━━━━━━━━━━━━━━━━━━━━━━━━━━━━━━━━━━━━[0m [32m751.2/751.2 kB[0m [31m21.2 MB/s[0m eta [36m0:00:00[0m
Step #6 - "compile-libfuzzer-introspector-x86_64": [?25hDownloading beautifulsoup4-4.13.3-py3-none-any.whl (186 kB)
Step #6 - "compile-libfuzzer-introspector-x86_64": Downloading lxml-5.3.1-cp310-cp310-manylinux_2_28_x86_64.whl (5.2 MB)
Step #6 - "compile-libfuzzer-introspector-x86_64": [?25l [90m━━━━━━━━━━━━━━━━━━━━━━━━━━━━━━━━━━━━━━━━[0m [32m0.0/5.2 MB[0m [31m?[0m eta [36m-:--:--[0m
[2K [90m━━━━━━━━━━━━━━━━━━━━━━━━━━━━━━━━━━━━━━━━[0m [32m5.2/5.2 MB[0m [31m105.7 MB/s[0m eta [36m0:00:00[0m
Step #6 - "compile-libfuzzer-introspector-x86_64": [?25hDownloading soupsieve-2.6-py3-none-any.whl (36 kB)
Step #6 - "compile-libfuzzer-introspector-x86_64": Downloading rust_demangler-1.0-py3-none-any.whl (8.3 kB)
Step #6 - "compile-libfuzzer-introspector-x86_64": Downloading typing_extensions-4.13.0-py3-none-any.whl (45 kB)
Step #6 - "compile-libfuzzer-introspector-x86_64": Installing collected packages: rust-demangler, cxxfilt, typing-extensions, soupsieve, pyyaml, lxml, beautifulsoup4
Step #6 - "compile-libfuzzer-introspector-x86_64": Successfully installed beautifulsoup4-4.13.3 cxxfilt-0.3.0 lxml-5.3.1 pyyaml-6.0.2 rust-demangler-1.0 soupsieve-2.6 typing-extensions-4.13.0
Step #6 - "compile-libfuzzer-introspector-x86_64": [33mWARNING: Running pip as the 'root' user can result in broken permissions and conflicting behaviour with the system package manager, possibly rendering your system unusable. It is recommended to use a virtual environment instead: https://pip.pypa.io/warnings/venv. Use the --root-user-action option if you know what you are doing and want to suppress this warning.[0m[33m
Step #6 - "compile-libfuzzer-introspector-x86_64": [0mCollecting matplotlib
Step #6 - "compile-libfuzzer-introspector-x86_64": Downloading matplotlib-3.10.1-cp310-cp310-manylinux_2_17_x86_64.manylinux2014_x86_64.whl.metadata (11 kB)
Step #6 - "compile-libfuzzer-introspector-x86_64": Collecting contourpy>=1.0.1 (from matplotlib)
Step #6 - "compile-libfuzzer-introspector-x86_64": Downloading contourpy-1.3.1-cp310-cp310-manylinux_2_17_x86_64.manylinux2014_x86_64.whl.metadata (5.4 kB)
Step #6 - "compile-libfuzzer-introspector-x86_64": Collecting cycler>=0.10 (from matplotlib)
Step #6 - "compile-libfuzzer-introspector-x86_64": Downloading cycler-0.12.1-py3-none-any.whl.metadata (3.8 kB)
Step #6 - "compile-libfuzzer-introspector-x86_64": Collecting fonttools>=4.22.0 (from matplotlib)
Step #6 - "compile-libfuzzer-introspector-x86_64": Downloading fonttools-4.56.0-cp310-cp310-manylinux_2_17_x86_64.manylinux2014_x86_64.whl.metadata (101 kB)
Step #6 - "compile-libfuzzer-introspector-x86_64": Collecting kiwisolver>=1.3.1 (from matplotlib)
Step #6 - "compile-libfuzzer-introspector-x86_64": Downloading kiwisolver-1.4.8-cp310-cp310-manylinux_2_12_x86_64.manylinux2010_x86_64.whl.metadata (6.2 kB)
Step #6 - "compile-libfuzzer-introspector-x86_64": Collecting numpy>=1.23 (from matplotlib)
Step #6 - "compile-libfuzzer-introspector-x86_64": Downloading numpy-2.2.4-cp310-cp310-manylinux_2_17_x86_64.manylinux2014_x86_64.whl.metadata (62 kB)
Step #6 - "compile-libfuzzer-introspector-x86_64": Collecting packaging>=20.0 (from matplotlib)
Step #6 - "compile-libfuzzer-introspector-x86_64": Downloading packaging-24.2-py3-none-any.whl.metadata (3.2 kB)
Step #6 - "compile-libfuzzer-introspector-x86_64": Collecting pillow>=8 (from matplotlib)
Step #6 - "compile-libfuzzer-introspector-x86_64": Downloading pillow-11.1.0-cp310-cp310-manylinux_2_28_x86_64.whl.metadata (9.1 kB)
Step #6 - "compile-libfuzzer-introspector-x86_64": Collecting pyparsing>=2.3.1 (from matplotlib)
Step #6 - "compile-libfuzzer-introspector-x86_64": Downloading pyparsing-3.2.3-py3-none-any.whl.metadata (5.0 kB)
Step #6 - "compile-libfuzzer-introspector-x86_64": Collecting python-dateutil>=2.7 (from matplotlib)
Step #6 - "compile-libfuzzer-introspector-x86_64": Downloading python_dateutil-2.9.0.post0-py2.py3-none-any.whl.metadata (8.4 kB)
Step #6 - "compile-libfuzzer-introspector-x86_64": Requirement already satisfied: six>=1.5 in /usr/local/lib/python3.10/site-packages (from python-dateutil>=2.7->matplotlib) (1.15.0)
Step #6 - "compile-libfuzzer-introspector-x86_64": Downloading matplotlib-3.10.1-cp310-cp310-manylinux_2_17_x86_64.manylinux2014_x86_64.whl (8.6 MB)
Step #6 - "compile-libfuzzer-introspector-x86_64": [?25l [90m━━━━━━━━━━━━━━━━━━━━━━━━━━━━━━━━━━━━━━━━[0m [32m0.0/8.6 MB[0m [31m?[0m eta [36m-:--:--[0m
[2K [90m━━━━━━━━━━━━━━━━━━━━━━━━━━━━━━━━━━━━━━━━[0m [32m8.6/8.6 MB[0m [31m101.7 MB/s[0m eta [36m0:00:00[0m
Step #6 - "compile-libfuzzer-introspector-x86_64": [?25hDownloading contourpy-1.3.1-cp310-cp310-manylinux_2_17_x86_64.manylinux2014_x86_64.whl (324 kB)
Step #6 - "compile-libfuzzer-introspector-x86_64": Downloading cycler-0.12.1-py3-none-any.whl (8.3 kB)
Step #6 - "compile-libfuzzer-introspector-x86_64": Downloading fonttools-4.56.0-cp310-cp310-manylinux_2_17_x86_64.manylinux2014_x86_64.whl (4.6 MB)
Step #6 - "compile-libfuzzer-introspector-x86_64": [?25l [90m━━━━━━━━━━━━━━━━━━━━━━━━━━━━━━━━━━━━━━━━[0m [32m0.0/4.6 MB[0m [31m?[0m eta [36m-:--:--[0m
[2K [90m━━━━━━━━━━━━━━━━━━━━━━━━━━━━━━━━━━━━━━━━[0m [32m4.6/4.6 MB[0m [31m100.1 MB/s[0m eta [36m0:00:00[0m
Step #6 - "compile-libfuzzer-introspector-x86_64": [?25hDownloading kiwisolver-1.4.8-cp310-cp310-manylinux_2_12_x86_64.manylinux2010_x86_64.whl (1.6 MB)
Step #6 - "compile-libfuzzer-introspector-x86_64": [?25l [90m━━━━━━━━━━━━━━━━━━━━━━━━━━━━━━━━━━━━━━━━[0m [32m0.0/1.6 MB[0m [31m?[0m eta [36m-:--:--[0m
[2K [90m━━━━━━━━━━━━━━━━━━━━━━━━━━━━━━━━━━━━━━━━[0m [32m1.6/1.6 MB[0m [31m86.3 MB/s[0m eta [36m0:00:00[0m
Step #6 - "compile-libfuzzer-introspector-x86_64": [?25hDownloading numpy-2.2.4-cp310-cp310-manylinux_2_17_x86_64.manylinux2014_x86_64.whl (16.4 MB)
Step #6 - "compile-libfuzzer-introspector-x86_64": [?25l [90m━━━━━━━━━━━━━━━━━━━━━━━━━━━━━━━━━━━━━━━━[0m [32m0.0/16.4 MB[0m [31m?[0m eta [36m-:--:--[0m
[2K [90m━━━━━━━━━━━━━━━━━━━━━━━━━━━━━━━━━━━━━━━━[0m [32m16.4/16.4 MB[0m [31m148.8 MB/s[0m eta [36m0:00:00[0m
Step #6 - "compile-libfuzzer-introspector-x86_64": [?25hDownloading packaging-24.2-py3-none-any.whl (65 kB)
Step #6 - "compile-libfuzzer-introspector-x86_64": Downloading pillow-11.1.0-cp310-cp310-manylinux_2_28_x86_64.whl (4.5 MB)
Step #6 - "compile-libfuzzer-introspector-x86_64": [?25l [90m━━━━━━━━━━━━━━━━━━━━━━━━━━━━━━━━━━━━━━━━[0m [32m0.0/4.5 MB[0m [31m?[0m eta [36m-:--:--[0m
[2K [90m━━━━━━━━━━━━━━━━━━━━━━━━━━━━━━━━━━━━━━━━[0m [32m4.5/4.5 MB[0m [31m130.2 MB/s[0m eta [36m0:00:00[0m
Step #6 - "compile-libfuzzer-introspector-x86_64": [?25hDownloading pyparsing-3.2.3-py3-none-any.whl (111 kB)
Step #6 - "compile-libfuzzer-introspector-x86_64": Downloading python_dateutil-2.9.0.post0-py2.py3-none-any.whl (229 kB)
Step #6 - "compile-libfuzzer-introspector-x86_64": Installing collected packages: python-dateutil, pyparsing, pillow, packaging, numpy, kiwisolver, fonttools, cycler, contourpy, matplotlib
Step #6 - "compile-libfuzzer-introspector-x86_64": Successfully installed contourpy-1.3.1 cycler-0.12.1 fonttools-4.56.0 kiwisolver-1.4.8 matplotlib-3.10.1 numpy-2.2.4 packaging-24.2 pillow-11.1.0 pyparsing-3.2.3 python-dateutil-2.9.0.post0
Step #6 - "compile-libfuzzer-introspector-x86_64": [33mWARNING: Running pip as the 'root' user can result in broken permissions and conflicting behaviour with the system package manager, possibly rendering your system unusable. It is recommended to use a virtual environment instead: https://pip.pypa.io/warnings/venv. Use the --root-user-action option if you know what you are doing and want to suppress this warning.[0m[33m
Step #6 - "compile-libfuzzer-introspector-x86_64": [0m/fuzz-introspector/src /src
Step #6 - "compile-libfuzzer-introspector-x86_64": Obtaining file:///fuzz-introspector/src
Step #6 - "compile-libfuzzer-introspector-x86_64": Installing build dependencies ... [?25l- \ | / done
Step #6 - "compile-libfuzzer-introspector-x86_64": [?25h Checking if build backend supports build_editable ... [?25ldone
Step #6 - "compile-libfuzzer-introspector-x86_64": [?25h Getting requirements to build editable ... [?25l- done
Step #6 - "compile-libfuzzer-introspector-x86_64": [?25h Preparing editable metadata (pyproject.toml) ... [?25l- done
Step #6 - "compile-libfuzzer-introspector-x86_64": [?25hCollecting beautifulsoup4==4.10.0 (from fuzz-introspector==0.1.10)
Step #6 - "compile-libfuzzer-introspector-x86_64": Downloading beautifulsoup4-4.10.0-py3-none-any.whl.metadata (3.5 kB)
Step #6 - "compile-libfuzzer-introspector-x86_64": Requirement already satisfied: cxxfilt==0.3.0 in /usr/local/lib/python3.10/site-packages (from fuzz-introspector==0.1.10) (0.3.0)
Step #6 - "compile-libfuzzer-introspector-x86_64": Collecting lxml==4.9.1 (from fuzz-introspector==0.1.10)
Step #6 - "compile-libfuzzer-introspector-x86_64": Downloading lxml-4.9.1-cp310-cp310-manylinux_2_17_x86_64.manylinux2014_x86_64.manylinux_2_24_x86_64.whl.metadata (3.3 kB)
Step #6 - "compile-libfuzzer-introspector-x86_64": Collecting matplotlib==3.10.0 (from fuzz-introspector==0.1.10)
Step #6 - "compile-libfuzzer-introspector-x86_64": Downloading matplotlib-3.10.0-cp310-cp310-manylinux_2_17_x86_64.manylinux2014_x86_64.whl.metadata (11 kB)
Step #6 - "compile-libfuzzer-introspector-x86_64": Collecting PyYAML==6.0.1 (from fuzz-introspector==0.1.10)
Step #6 - "compile-libfuzzer-introspector-x86_64": Downloading PyYAML-6.0.1-cp310-cp310-manylinux_2_17_x86_64.manylinux2014_x86_64.whl.metadata (2.1 kB)
Step #6 - "compile-libfuzzer-introspector-x86_64": Collecting soupsieve==2.2.1 (from fuzz-introspector==0.1.10)
Step #6 - "compile-libfuzzer-introspector-x86_64": Downloading soupsieve-2.2.1-py3-none-any.whl.metadata (5.5 kB)
Step #6 - "compile-libfuzzer-introspector-x86_64": Collecting yapf==0.40.1 (from fuzz-introspector==0.1.10)
Step #6 - "compile-libfuzzer-introspector-x86_64": Downloading yapf-0.40.1-py3-none-any.whl.metadata (35 kB)
Step #6 - "compile-libfuzzer-introspector-x86_64": Collecting flake8 (from fuzz-introspector==0.1.10)
Step #6 - "compile-libfuzzer-introspector-x86_64": Downloading flake8-7.1.2-py2.py3-none-any.whl.metadata (3.8 kB)
Step #6 - "compile-libfuzzer-introspector-x86_64": Collecting pep8 (from fuzz-introspector==0.1.10)
Step #6 - "compile-libfuzzer-introspector-x86_64": Downloading pep8-1.7.1-py2.py3-none-any.whl.metadata (22 kB)
Step #6 - "compile-libfuzzer-introspector-x86_64": Collecting mypy (from fuzz-introspector==0.1.10)
Step #6 - "compile-libfuzzer-introspector-x86_64": Downloading mypy-1.15.0-cp310-cp310-manylinux_2_17_x86_64.manylinux2014_x86_64.manylinux_2_28_x86_64.whl.metadata (2.1 kB)
Step #6 - "compile-libfuzzer-introspector-x86_64": Collecting psutil (from fuzz-introspector==0.1.10)
Step #6 - "compile-libfuzzer-introspector-x86_64": Downloading psutil-7.0.0-cp36-abi3-manylinux_2_12_x86_64.manylinux2010_x86_64.manylinux_2_17_x86_64.manylinux2014_x86_64.whl.metadata (22 kB)
Step #6 - "compile-libfuzzer-introspector-x86_64": Collecting toml (from fuzz-introspector==0.1.10)
Step #6 - "compile-libfuzzer-introspector-x86_64": Downloading toml-0.10.2-py2.py3-none-any.whl.metadata (7.1 kB)
Step #6 - "compile-libfuzzer-introspector-x86_64": Collecting pytest (from fuzz-introspector==0.1.10)
Step #6 - "compile-libfuzzer-introspector-x86_64": Downloading pytest-8.3.5-py3-none-any.whl.metadata (7.6 kB)
Step #6 - "compile-libfuzzer-introspector-x86_64": Collecting sphinx==6.0.0 (from fuzz-introspector==0.1.10)
Step #6 - "compile-libfuzzer-introspector-x86_64": Downloading sphinx-6.0.0-py3-none-any.whl.metadata (6.2 kB)
Step #6 - "compile-libfuzzer-introspector-x86_64": Collecting sphinx_rtd_theme (from fuzz-introspector==0.1.10)
Step #6 - "compile-libfuzzer-introspector-x86_64": Downloading sphinx_rtd_theme-3.0.2-py2.py3-none-any.whl.metadata (4.4 kB)
Step #6 - "compile-libfuzzer-introspector-x86_64": Collecting configparser (from fuzz-introspector==0.1.10)
Step #6 - "compile-libfuzzer-introspector-x86_64": Downloading configparser-7.2.0-py3-none-any.whl.metadata (5.5 kB)
Step #6 - "compile-libfuzzer-introspector-x86_64": Collecting coverage (from fuzz-introspector==0.1.10)
Step #6 - "compile-libfuzzer-introspector-x86_64": Downloading coverage-7.7.1-cp310-cp310-manylinux_2_5_x86_64.manylinux1_x86_64.manylinux_2_17_x86_64.manylinux2014_x86_64.whl.metadata (8.5 kB)
Step #6 - "compile-libfuzzer-introspector-x86_64": Collecting atheris (from fuzz-introspector==0.1.10)
Step #6 - "compile-libfuzzer-introspector-x86_64": Downloading atheris-2.3.0-cp310-cp310-manylinux_2_17_x86_64.manylinux2014_x86_64.whl.metadata (17 kB)
Step #6 - "compile-libfuzzer-introspector-x86_64": Requirement already satisfied: setuptools>=65.5.1 in /usr/local/lib/python3.10/site-packages (from fuzz-introspector==0.1.10) (78.1.0)
Step #6 - "compile-libfuzzer-introspector-x86_64": Collecting tqdm (from fuzz-introspector==0.1.10)
Step #6 - "compile-libfuzzer-introspector-x86_64": Downloading tqdm-4.67.1-py3-none-any.whl.metadata (57 kB)
Step #6 - "compile-libfuzzer-introspector-x86_64": Requirement already satisfied: rust-demangler in /usr/local/lib/python3.10/site-packages (from fuzz-introspector==0.1.10) (1.0)
Step #6 - "compile-libfuzzer-introspector-x86_64": Collecting numpy==2.1.0 (from fuzz-introspector==0.1.10)
Step #6 - "compile-libfuzzer-introspector-x86_64": Downloading numpy-2.1.0-cp310-cp310-manylinux_2_17_x86_64.manylinux2014_x86_64.whl.metadata (60 kB)
Step #6 - "compile-libfuzzer-introspector-x86_64": Collecting tree-sitter==0.23.2 (from fuzz-introspector==0.1.10)
Step #6 - "compile-libfuzzer-introspector-x86_64": Downloading tree_sitter-0.23.2-cp310-cp310-manylinux_2_17_x86_64.manylinux2014_x86_64.whl.metadata (9.8 kB)
Step #6 - "compile-libfuzzer-introspector-x86_64": Collecting tree-sitter-python==0.23.6 (from fuzz-introspector==0.1.10)
Step #6 - "compile-libfuzzer-introspector-x86_64": Downloading tree_sitter_python-0.23.6-cp39-abi3-manylinux_2_5_x86_64.manylinux1_x86_64.manylinux_2_17_x86_64.manylinux2014_x86_64.whl.metadata (1.9 kB)
Step #6 - "compile-libfuzzer-introspector-x86_64": Collecting networkx (from fuzz-introspector==0.1.10)
Step #6 - "compile-libfuzzer-introspector-x86_64": Downloading networkx-3.4.2-py3-none-any.whl.metadata (6.3 kB)
Step #6 - "compile-libfuzzer-introspector-x86_64": Collecting tree-sitter-languages==1.10.2 (from fuzz-introspector==0.1.10)
Step #6 - "compile-libfuzzer-introspector-x86_64": Downloading tree_sitter_languages-1.10.2-cp310-cp310-manylinux_2_17_x86_64.manylinux2014_x86_64.whl.metadata (10 kB)
Step #6 - "compile-libfuzzer-introspector-x86_64": Collecting tree-sitter-c==0.23.4 (from fuzz-introspector==0.1.10)
Step #6 - "compile-libfuzzer-introspector-x86_64": Downloading tree_sitter_c-0.23.4-cp39-abi3-manylinux_2_5_x86_64.manylinux1_x86_64.manylinux_2_17_x86_64.manylinux2014_x86_64.whl.metadata (1.7 kB)
Step #6 - "compile-libfuzzer-introspector-x86_64": Collecting tree-sitter-cpp==0.23.4 (from fuzz-introspector==0.1.10)
Step #6 - "compile-libfuzzer-introspector-x86_64": Downloading tree_sitter_cpp-0.23.4-cp39-abi3-manylinux_2_17_x86_64.manylinux2014_x86_64.whl.metadata (1.8 kB)
Step #6 - "compile-libfuzzer-introspector-x86_64": Collecting tree-sitter-go==0.23.4 (from fuzz-introspector==0.1.10)
Step #6 - "compile-libfuzzer-introspector-x86_64": Downloading tree_sitter_go-0.23.4-cp39-abi3-manylinux_2_5_x86_64.manylinux1_x86_64.manylinux_2_17_x86_64.manylinux2014_x86_64.whl.metadata (1.7 kB)
Step #6 - "compile-libfuzzer-introspector-x86_64": Collecting tree-sitter-java==0.23.5 (from fuzz-introspector==0.1.10)
Step #6 - "compile-libfuzzer-introspector-x86_64": Downloading tree_sitter_java-0.23.5-cp39-abi3-manylinux_2_5_x86_64.manylinux1_x86_64.manylinux_2_17_x86_64.manylinux2014_x86_64.whl.metadata (1.7 kB)
Step #6 - "compile-libfuzzer-introspector-x86_64": Collecting tree-sitter-rust==0.23.2 (from fuzz-introspector==0.1.10)
Step #6 - "compile-libfuzzer-introspector-x86_64": Downloading tree_sitter_rust-0.23.2-cp39-abi3-manylinux_2_5_x86_64.manylinux1_x86_64.manylinux_2_17_x86_64.manylinux2014_x86_64.whl.metadata (2.8 kB)
Step #6 - "compile-libfuzzer-introspector-x86_64": Requirement already satisfied: contourpy>=1.0.1 in /usr/local/lib/python3.10/site-packages (from matplotlib==3.10.0->fuzz-introspector==0.1.10) (1.3.1)
Step #6 - "compile-libfuzzer-introspector-x86_64": Requirement already satisfied: cycler>=0.10 in /usr/local/lib/python3.10/site-packages (from matplotlib==3.10.0->fuzz-introspector==0.1.10) (0.12.1)
Step #6 - "compile-libfuzzer-introspector-x86_64": Requirement already satisfied: fonttools>=4.22.0 in /usr/local/lib/python3.10/site-packages (from matplotlib==3.10.0->fuzz-introspector==0.1.10) (4.56.0)
Step #6 - "compile-libfuzzer-introspector-x86_64": Requirement already satisfied: kiwisolver>=1.3.1 in /usr/local/lib/python3.10/site-packages (from matplotlib==3.10.0->fuzz-introspector==0.1.10) (1.4.8)
Step #6 - "compile-libfuzzer-introspector-x86_64": Requirement already satisfied: packaging>=20.0 in /usr/local/lib/python3.10/site-packages (from matplotlib==3.10.0->fuzz-introspector==0.1.10) (24.2)
Step #6 - "compile-libfuzzer-introspector-x86_64": Requirement already satisfied: pillow>=8 in /usr/local/lib/python3.10/site-packages (from matplotlib==3.10.0->fuzz-introspector==0.1.10) (11.1.0)
Step #6 - "compile-libfuzzer-introspector-x86_64": Requirement already satisfied: pyparsing>=2.3.1 in /usr/local/lib/python3.10/site-packages (from matplotlib==3.10.0->fuzz-introspector==0.1.10) (3.2.3)
Step #6 - "compile-libfuzzer-introspector-x86_64": Requirement already satisfied: python-dateutil>=2.7 in /usr/local/lib/python3.10/site-packages (from matplotlib==3.10.0->fuzz-introspector==0.1.10) (2.9.0.post0)
Step #6 - "compile-libfuzzer-introspector-x86_64": Collecting sphinxcontrib-applehelp (from sphinx==6.0.0->fuzz-introspector==0.1.10)
Step #6 - "compile-libfuzzer-introspector-x86_64": Downloading sphinxcontrib_applehelp-2.0.0-py3-none-any.whl.metadata (2.3 kB)
Step #6 - "compile-libfuzzer-introspector-x86_64": Collecting sphinxcontrib-devhelp (from sphinx==6.0.0->fuzz-introspector==0.1.10)
Step #6 - "compile-libfuzzer-introspector-x86_64": Downloading sphinxcontrib_devhelp-2.0.0-py3-none-any.whl.metadata (2.3 kB)
Step #6 - "compile-libfuzzer-introspector-x86_64": Collecting sphinxcontrib-jsmath (from sphinx==6.0.0->fuzz-introspector==0.1.10)
Step #6 - "compile-libfuzzer-introspector-x86_64": Downloading sphinxcontrib_jsmath-1.0.1-py2.py3-none-any.whl.metadata (1.4 kB)
Step #6 - "compile-libfuzzer-introspector-x86_64": Collecting sphinxcontrib-htmlhelp>=2.0.0 (from sphinx==6.0.0->fuzz-introspector==0.1.10)
Step #6 - "compile-libfuzzer-introspector-x86_64": Downloading sphinxcontrib_htmlhelp-2.1.0-py3-none-any.whl.metadata (2.3 kB)
Step #6 - "compile-libfuzzer-introspector-x86_64": Collecting sphinxcontrib-serializinghtml>=1.1.5 (from sphinx==6.0.0->fuzz-introspector==0.1.10)
Step #6 - "compile-libfuzzer-introspector-x86_64": Downloading sphinxcontrib_serializinghtml-2.0.0-py3-none-any.whl.metadata (2.4 kB)
Step #6 - "compile-libfuzzer-introspector-x86_64": Collecting sphinxcontrib-qthelp (from sphinx==6.0.0->fuzz-introspector==0.1.10)
Step #6 - "compile-libfuzzer-introspector-x86_64": Downloading sphinxcontrib_qthelp-2.0.0-py3-none-any.whl.metadata (2.3 kB)
Step #6 - "compile-libfuzzer-introspector-x86_64": Collecting Jinja2>=3.0 (from sphinx==6.0.0->fuzz-introspector==0.1.10)
Step #6 - "compile-libfuzzer-introspector-x86_64": Downloading jinja2-3.1.6-py3-none-any.whl.metadata (2.9 kB)
Step #6 - "compile-libfuzzer-introspector-x86_64": Collecting Pygments>=2.12 (from sphinx==6.0.0->fuzz-introspector==0.1.10)
Step #6 - "compile-libfuzzer-introspector-x86_64": Downloading pygments-2.19.1-py3-none-any.whl.metadata (2.5 kB)
Step #6 - "compile-libfuzzer-introspector-x86_64": Collecting docutils<0.20,>=0.18 (from sphinx==6.0.0->fuzz-introspector==0.1.10)
Step #6 - "compile-libfuzzer-introspector-x86_64": Downloading docutils-0.19-py3-none-any.whl.metadata (2.7 kB)
Step #6 - "compile-libfuzzer-introspector-x86_64": Collecting snowballstemmer>=2.0 (from sphinx==6.0.0->fuzz-introspector==0.1.10)
Step #6 - "compile-libfuzzer-introspector-x86_64": Downloading snowballstemmer-2.2.0-py2.py3-none-any.whl.metadata (6.5 kB)
Step #6 - "compile-libfuzzer-introspector-x86_64": Collecting babel>=2.9 (from sphinx==6.0.0->fuzz-introspector==0.1.10)
Step #6 - "compile-libfuzzer-introspector-x86_64": Downloading babel-2.17.0-py3-none-any.whl.metadata (2.0 kB)
Step #6 - "compile-libfuzzer-introspector-x86_64": Collecting alabaster<0.8,>=0.7 (from sphinx==6.0.0->fuzz-introspector==0.1.10)
Step #6 - "compile-libfuzzer-introspector-x86_64": Downloading alabaster-0.7.16-py3-none-any.whl.metadata (2.9 kB)
Step #6 - "compile-libfuzzer-introspector-x86_64": Collecting imagesize>=1.3 (from sphinx==6.0.0->fuzz-introspector==0.1.10)
Step #6 - "compile-libfuzzer-introspector-x86_64": Downloading imagesize-1.4.1-py2.py3-none-any.whl.metadata (1.5 kB)
Step #6 - "compile-libfuzzer-introspector-x86_64": Collecting requests>=2.25.0 (from sphinx==6.0.0->fuzz-introspector==0.1.10)
Step #6 - "compile-libfuzzer-introspector-x86_64": Downloading requests-2.32.3-py3-none-any.whl.metadata (4.6 kB)
Step #6 - "compile-libfuzzer-introspector-x86_64": Collecting importlib-metadata>=6.6.0 (from yapf==0.40.1->fuzz-introspector==0.1.10)
Step #6 - "compile-libfuzzer-introspector-x86_64": Downloading importlib_metadata-8.6.1-py3-none-any.whl.metadata (4.7 kB)
Step #6 - "compile-libfuzzer-introspector-x86_64": Collecting platformdirs>=3.5.1 (from yapf==0.40.1->fuzz-introspector==0.1.10)
Step #6 - "compile-libfuzzer-introspector-x86_64": Downloading platformdirs-4.3.7-py3-none-any.whl.metadata (11 kB)
Step #6 - "compile-libfuzzer-introspector-x86_64": Collecting tomli>=2.0.1 (from yapf==0.40.1->fuzz-introspector==0.1.10)
Step #6 - "compile-libfuzzer-introspector-x86_64": Using cached tomli-2.2.1-py3-none-any.whl.metadata (10 kB)
Step #6 - "compile-libfuzzer-introspector-x86_64": Collecting mccabe<0.8.0,>=0.7.0 (from flake8->fuzz-introspector==0.1.10)
Step #6 - "compile-libfuzzer-introspector-x86_64": Downloading mccabe-0.7.0-py2.py3-none-any.whl.metadata (5.0 kB)
Step #6 - "compile-libfuzzer-introspector-x86_64": Collecting pycodestyle<2.13.0,>=2.12.0 (from flake8->fuzz-introspector==0.1.10)
Step #6 - "compile-libfuzzer-introspector-x86_64": Downloading pycodestyle-2.12.1-py2.py3-none-any.whl.metadata (4.5 kB)
Step #6 - "compile-libfuzzer-introspector-x86_64": Collecting pyflakes<3.3.0,>=3.2.0 (from flake8->fuzz-introspector==0.1.10)
Step #6 - "compile-libfuzzer-introspector-x86_64": Downloading pyflakes-3.2.0-py2.py3-none-any.whl.metadata (3.5 kB)
Step #6 - "compile-libfuzzer-introspector-x86_64": Requirement already satisfied: typing_extensions>=4.6.0 in /usr/local/lib/python3.10/site-packages (from mypy->fuzz-introspector==0.1.10) (4.13.0)
Step #6 - "compile-libfuzzer-introspector-x86_64": Collecting mypy_extensions>=1.0.0 (from mypy->fuzz-introspector==0.1.10)
Step #6 - "compile-libfuzzer-introspector-x86_64": Downloading mypy_extensions-1.0.0-py3-none-any.whl.metadata (1.1 kB)
Step #6 - "compile-libfuzzer-introspector-x86_64": Collecting exceptiongroup>=1.0.0rc8 (from pytest->fuzz-introspector==0.1.10)
Step #6 - "compile-libfuzzer-introspector-x86_64": Downloading exceptiongroup-1.2.2-py3-none-any.whl.metadata (6.6 kB)
Step #6 - "compile-libfuzzer-introspector-x86_64": Collecting iniconfig (from pytest->fuzz-introspector==0.1.10)
Step #6 - "compile-libfuzzer-introspector-x86_64": Downloading iniconfig-2.1.0-py3-none-any.whl.metadata (2.7 kB)
Step #6 - "compile-libfuzzer-introspector-x86_64": Collecting pluggy<2,>=1.5 (from pytest->fuzz-introspector==0.1.10)
Step #6 - "compile-libfuzzer-introspector-x86_64": Downloading pluggy-1.5.0-py3-none-any.whl.metadata (4.8 kB)
Step #6 - "compile-libfuzzer-introspector-x86_64": Collecting sphinxcontrib-jquery<5,>=4 (from sphinx_rtd_theme->fuzz-introspector==0.1.10)
Step #6 - "compile-libfuzzer-introspector-x86_64": Downloading sphinxcontrib_jquery-4.1-py2.py3-none-any.whl.metadata (2.6 kB)
Step #6 - "compile-libfuzzer-introspector-x86_64": Collecting zipp>=3.20 (from importlib-metadata>=6.6.0->yapf==0.40.1->fuzz-introspector==0.1.10)
Step #6 - "compile-libfuzzer-introspector-x86_64": Downloading zipp-3.21.0-py3-none-any.whl.metadata (3.7 kB)
Step #6 - "compile-libfuzzer-introspector-x86_64": Collecting MarkupSafe>=2.0 (from Jinja2>=3.0->sphinx==6.0.0->fuzz-introspector==0.1.10)
Step #6 - "compile-libfuzzer-introspector-x86_64": Downloading MarkupSafe-3.0.2-cp310-cp310-manylinux_2_17_x86_64.manylinux2014_x86_64.whl.metadata (4.0 kB)
Step #6 - "compile-libfuzzer-introspector-x86_64": Requirement already satisfied: six>=1.5 in /usr/local/lib/python3.10/site-packages (from python-dateutil>=2.7->matplotlib==3.10.0->fuzz-introspector==0.1.10) (1.15.0)
Step #6 - "compile-libfuzzer-introspector-x86_64": Collecting charset-normalizer<4,>=2 (from requests>=2.25.0->sphinx==6.0.0->fuzz-introspector==0.1.10)
Step #6 - "compile-libfuzzer-introspector-x86_64": Downloading charset_normalizer-3.4.1-cp310-cp310-manylinux_2_17_x86_64.manylinux2014_x86_64.whl.metadata (35 kB)
Step #6 - "compile-libfuzzer-introspector-x86_64": Collecting idna<4,>=2.5 (from requests>=2.25.0->sphinx==6.0.0->fuzz-introspector==0.1.10)
Step #6 - "compile-libfuzzer-introspector-x86_64": Downloading idna-3.10-py3-none-any.whl.metadata (10 kB)
Step #6 - "compile-libfuzzer-introspector-x86_64": Collecting urllib3<3,>=1.21.1 (from requests>=2.25.0->sphinx==6.0.0->fuzz-introspector==0.1.10)
Step #6 - "compile-libfuzzer-introspector-x86_64": Downloading urllib3-2.3.0-py3-none-any.whl.metadata (6.5 kB)
Step #6 - "compile-libfuzzer-introspector-x86_64": Collecting certifi>=2017.4.17 (from requests>=2.25.0->sphinx==6.0.0->fuzz-introspector==0.1.10)
Step #6 - "compile-libfuzzer-introspector-x86_64": Downloading certifi-2025.1.31-py3-none-any.whl.metadata (2.5 kB)
Step #6 - "compile-libfuzzer-introspector-x86_64": Downloading beautifulsoup4-4.10.0-py3-none-any.whl (97 kB)
Step #6 - "compile-libfuzzer-introspector-x86_64": Downloading lxml-4.9.1-cp310-cp310-manylinux_2_17_x86_64.manylinux2014_x86_64.manylinux_2_24_x86_64.whl (6.9 MB)
Step #6 - "compile-libfuzzer-introspector-x86_64": [?25l [90m━━━━━━━━━━━━━━━━━━━━━━━━━━━━━━━━━━━━━━━━[0m [32m0.0/6.9 MB[0m [31m?[0m eta [36m-:--:--[0m
[2K [90m━━━━━━━━━━━━━━━━━━━━━━━━━━━━━━━━━━━━━━━━[0m [32m6.9/6.9 MB[0m [31m93.1 MB/s[0m eta [36m0:00:00[0m
Step #6 - "compile-libfuzzer-introspector-x86_64": [?25hDownloading matplotlib-3.10.0-cp310-cp310-manylinux_2_17_x86_64.manylinux2014_x86_64.whl (8.6 MB)
Step #6 - "compile-libfuzzer-introspector-x86_64": [?25l [90m━━━━━━━━━━━━━━━━━━━━━━━━━━━━━━━━━━━━━━━━[0m [32m0.0/8.6 MB[0m [31m?[0m eta [36m-:--:--[0m
[2K [90m━━━━━━━━━━━━━━━━━━━━━━━━━━━━━━━━━━━━━━━━[0m [32m8.6/8.6 MB[0m [31m136.1 MB/s[0m eta [36m0:00:00[0m
Step #6 - "compile-libfuzzer-introspector-x86_64": [?25hDownloading numpy-2.1.0-cp310-cp310-manylinux_2_17_x86_64.manylinux2014_x86_64.whl (16.3 MB)
Step #6 - "compile-libfuzzer-introspector-x86_64": [?25l [90m━━━━━━━━━━━━━━━━━━━━━━━━━━━━━━━━━━━━━━━━[0m [32m0.0/16.3 MB[0m [31m?[0m eta [36m-:--:--[0m
[2K [90m━━━━━━━━━━━━━━━━━━━━━━━━━━━━━━━━━━━━━━━━[0m [32m16.3/16.3 MB[0m [31m158.6 MB/s[0m eta [36m0:00:00[0m
Step #6 - "compile-libfuzzer-introspector-x86_64": [?25hDownloading PyYAML-6.0.1-cp310-cp310-manylinux_2_17_x86_64.manylinux2014_x86_64.whl (705 kB)
Step #6 - "compile-libfuzzer-introspector-x86_64": [?25l [90m━━━━━━━━━━━━━━━━━━━━━━━━━━━━━━━━━━━━━━━━[0m [32m0.0/705.5 kB[0m [31m?[0m eta [36m-:--:--[0m
[2K [90m━━━━━━━━━━━━━━━━━━━━━━━━━━━━━━━━━━━━━━━━[0m [32m705.5/705.5 kB[0m [31m38.1 MB/s[0m eta [36m0:00:00[0m
Step #6 - "compile-libfuzzer-introspector-x86_64": [?25hDownloading soupsieve-2.2.1-py3-none-any.whl (33 kB)
Step #6 - "compile-libfuzzer-introspector-x86_64": Downloading sphinx-6.0.0-py3-none-any.whl (3.0 MB)
Step #6 - "compile-libfuzzer-introspector-x86_64": [?25l [90m━━━━━━━━━━━━━━━━━━━━━━━━━━━━━━━━━━━━━━━━[0m [32m0.0/3.0 MB[0m [31m?[0m eta [36m-:--:--[0m
[2K [90m━━━━━━━━━━━━━━━━━━━━━━━━━━━━━━━━━━━━━━━━[0m [32m3.0/3.0 MB[0m [31m131.0 MB/s[0m eta [36m0:00:00[0m
Step #6 - "compile-libfuzzer-introspector-x86_64": [?25hDownloading tree_sitter-0.23.2-cp310-cp310-manylinux_2_17_x86_64.manylinux2014_x86_64.whl (566 kB)
Step #6 - "compile-libfuzzer-introspector-x86_64": [?25l [90m━━━━━━━━━━━━━━━━━━━━━━━━━━━━━━━━━━━━━━━━[0m [32m0.0/566.6 kB[0m [31m?[0m eta [36m-:--:--[0m
[2K [90m━━━━━━━━━━━━━━━━━━━━━━━━━━━━━━━━━━━━━━━━[0m [32m566.6/566.6 kB[0m [31m33.3 MB/s[0m eta [36m0:00:00[0m
Step #6 - "compile-libfuzzer-introspector-x86_64": [?25hDownloading tree_sitter_c-0.23.4-cp39-abi3-manylinux_2_5_x86_64.manylinux1_x86_64.manylinux_2_17_x86_64.manylinux2014_x86_64.whl (98 kB)
Step #6 - "compile-libfuzzer-introspector-x86_64": Downloading tree_sitter_cpp-0.23.4-cp39-abi3-manylinux_2_17_x86_64.manylinux2014_x86_64.whl (316 kB)
Step #6 - "compile-libfuzzer-introspector-x86_64": Downloading tree_sitter_go-0.23.4-cp39-abi3-manylinux_2_5_x86_64.manylinux1_x86_64.manylinux_2_17_x86_64.manylinux2014_x86_64.whl (65 kB)
Step #6 - "compile-libfuzzer-introspector-x86_64": Downloading tree_sitter_java-0.23.5-cp39-abi3-manylinux_2_5_x86_64.manylinux1_x86_64.manylinux_2_17_x86_64.manylinux2014_x86_64.whl (84 kB)
Step #6 - "compile-libfuzzer-introspector-x86_64": Downloading tree_sitter_languages-1.10.2-cp310-cp310-manylinux_2_17_x86_64.manylinux2014_x86_64.whl (8.4 MB)
Step #6 - "compile-libfuzzer-introspector-x86_64": [?25l [90m━━━━━━━━━━━━━━━━━━━━━━━━━━━━━━━━━━━━━━━━[0m [32m0.0/8.4 MB[0m [31m?[0m eta [36m-:--:--[0m
[2K [90m━━━━━━━━━━━━━━━━━━━━━━━━━━━━━━━━━━━━━━━━[0m [32m8.4/8.4 MB[0m [31m126.6 MB/s[0m eta [36m0:00:00[0m
Step #6 - "compile-libfuzzer-introspector-x86_64": [?25hDownloading tree_sitter_python-0.23.6-cp39-abi3-manylinux_2_5_x86_64.manylinux1_x86_64.manylinux_2_17_x86_64.manylinux2014_x86_64.whl (112 kB)
Step #6 - "compile-libfuzzer-introspector-x86_64": Downloading tree_sitter_rust-0.23.2-cp39-abi3-manylinux_2_5_x86_64.manylinux1_x86_64.manylinux_2_17_x86_64.manylinux2014_x86_64.whl (157 kB)
Step #6 - "compile-libfuzzer-introspector-x86_64": Downloading yapf-0.40.1-py3-none-any.whl (250 kB)
Step #6 - "compile-libfuzzer-introspector-x86_64": Downloading atheris-2.3.0-cp310-cp310-manylinux_2_17_x86_64.manylinux2014_x86_64.whl (30.9 MB)
Step #6 - "compile-libfuzzer-introspector-x86_64": [?25l [90m━━━━━━━━━━━━━━━━━━━━━━━━━━━━━━━━━━━━━━━━[0m [32m0.0/30.9 MB[0m [31m?[0m eta [36m-:--:--[0m
[2K [90m━━━━━━━━━━━━━━━━━━━━━━━━━━━━━━━━━━━━━━━━[0m [32m30.9/30.9 MB[0m [31m157.4 MB/s[0m eta [36m0:00:00[0m
Step #6 - "compile-libfuzzer-introspector-x86_64": [?25hDownloading configparser-7.2.0-py3-none-any.whl (17 kB)
Step #6 - "compile-libfuzzer-introspector-x86_64": Downloading coverage-7.7.1-cp310-cp310-manylinux_2_5_x86_64.manylinux1_x86_64.manylinux_2_17_x86_64.manylinux2014_x86_64.whl (239 kB)
Step #6 - "compile-libfuzzer-introspector-x86_64": Downloading flake8-7.1.2-py2.py3-none-any.whl (57 kB)
Step #6 - "compile-libfuzzer-introspector-x86_64": Downloading mypy-1.15.0-cp310-cp310-manylinux_2_17_x86_64.manylinux2014_x86_64.manylinux_2_28_x86_64.whl (12.4 MB)
Step #6 - "compile-libfuzzer-introspector-x86_64": [?25l [90m━━━━━━━━━━━━━━━━━━━━━━━━━━━━━━━━━━━━━━━━[0m [32m0.0/12.4 MB[0m [31m?[0m eta [36m-:--:--[0m
[2K [90m━━━━━━━━━━━━━━━━━━━━━━━━━━━━━━━━━━━━━━━━[0m [32m12.4/12.4 MB[0m [31m133.9 MB/s[0m eta [36m0:00:00[0m
Step #6 - "compile-libfuzzer-introspector-x86_64": [?25hDownloading networkx-3.4.2-py3-none-any.whl (1.7 MB)
Step #6 - "compile-libfuzzer-introspector-x86_64": [?25l [90m━━━━━━━━━━━━━━━━━━━━━━━━━━━━━━━━━━━━━━━━[0m [32m0.0/1.7 MB[0m [31m?[0m eta [36m-:--:--[0m
[2K [90m━━━━━━━━━━━━━━━━━━━━━━━━━━━━━━━━━━━━━━━━[0m [32m1.7/1.7 MB[0m [31m86.7 MB/s[0m eta [36m0:00:00[0m
Step #6 - "compile-libfuzzer-introspector-x86_64": [?25hDownloading pep8-1.7.1-py2.py3-none-any.whl (41 kB)
Step #6 - "compile-libfuzzer-introspector-x86_64": Downloading psutil-7.0.0-cp36-abi3-manylinux_2_12_x86_64.manylinux2010_x86_64.manylinux_2_17_x86_64.manylinux2014_x86_64.whl (277 kB)
Step #6 - "compile-libfuzzer-introspector-x86_64": Downloading pytest-8.3.5-py3-none-any.whl (343 kB)
Step #6 - "compile-libfuzzer-introspector-x86_64": Downloading sphinx_rtd_theme-3.0.2-py2.py3-none-any.whl (7.7 MB)
Step #6 - "compile-libfuzzer-introspector-x86_64": [?25l [90m━━━━━━━━━━━━━━━━━━━━━━━━━━━━━━━━━━━━━━━━[0m [32m0.0/7.7 MB[0m [31m?[0m eta [36m-:--:--[0m
[2K [90m━━━━━━━━━━━━━━━━━━━━━━━━━━━━━━━━━━━━━━━━[0m [32m7.7/7.7 MB[0m [31m136.1 MB/s[0m eta [36m0:00:00[0m
Step #6 - "compile-libfuzzer-introspector-x86_64": [?25hDownloading toml-0.10.2-py2.py3-none-any.whl (16 kB)
Step #6 - "compile-libfuzzer-introspector-x86_64": Downloading tqdm-4.67.1-py3-none-any.whl (78 kB)
Step #6 - "compile-libfuzzer-introspector-x86_64": Downloading alabaster-0.7.16-py3-none-any.whl (13 kB)
Step #6 - "compile-libfuzzer-introspector-x86_64": Downloading babel-2.17.0-py3-none-any.whl (10.2 MB)
Step #6 - "compile-libfuzzer-introspector-x86_64": [?25l [90m━━━━━━━━━━━━━━━━━━━━━━━━━━━━━━━━━━━━━━━━[0m [32m0.0/10.2 MB[0m [31m?[0m eta [36m-:--:--[0m
[2K [90m━━━━━━━━━━━━━━━━━━━━━━━━━━━━━━━━━━━━━━━━[0m [32m10.2/10.2 MB[0m [31m133.9 MB/s[0m eta [36m0:00:00[0m
Step #6 - "compile-libfuzzer-introspector-x86_64": [?25hDownloading docutils-0.19-py3-none-any.whl (570 kB)
Step #6 - "compile-libfuzzer-introspector-x86_64": [?25l [90m━━━━━━━━━━━━━━━━━━━━━━━━━━━━━━━━━━━━━━━━[0m [32m0.0/570.5 kB[0m [31m?[0m eta [36m-:--:--[0m
[2K [90m━━━━━━━━━━━━━━━━━━━━━━━━━━━━━━━━━━━━━━━━[0m [32m570.5/570.5 kB[0m [31m32.7 MB/s[0m eta [36m0:00:00[0m
Step #6 - "compile-libfuzzer-introspector-x86_64": [?25hDownloading exceptiongroup-1.2.2-py3-none-any.whl (16 kB)
Step #6 - "compile-libfuzzer-introspector-x86_64": Downloading imagesize-1.4.1-py2.py3-none-any.whl (8.8 kB)
Step #6 - "compile-libfuzzer-introspector-x86_64": Downloading importlib_metadata-8.6.1-py3-none-any.whl (26 kB)
Step #6 - "compile-libfuzzer-introspector-x86_64": Downloading jinja2-3.1.6-py3-none-any.whl (134 kB)
Step #6 - "compile-libfuzzer-introspector-x86_64": Downloading mccabe-0.7.0-py2.py3-none-any.whl (7.3 kB)
Step #6 - "compile-libfuzzer-introspector-x86_64": Downloading mypy_extensions-1.0.0-py3-none-any.whl (4.7 kB)
Step #6 - "compile-libfuzzer-introspector-x86_64": Downloading platformdirs-4.3.7-py3-none-any.whl (18 kB)
Step #6 - "compile-libfuzzer-introspector-x86_64": Downloading pluggy-1.5.0-py3-none-any.whl (20 kB)
Step #6 - "compile-libfuzzer-introspector-x86_64": Downloading pycodestyle-2.12.1-py2.py3-none-any.whl (31 kB)
Step #6 - "compile-libfuzzer-introspector-x86_64": Downloading pyflakes-3.2.0-py2.py3-none-any.whl (62 kB)
Step #6 - "compile-libfuzzer-introspector-x86_64": Downloading pygments-2.19.1-py3-none-any.whl (1.2 MB)
Step #6 - "compile-libfuzzer-introspector-x86_64": [?25l [90m━━━━━━━━━━━━━━━━━━━━━━━━━━━━━━━━━━━━━━━━[0m [32m0.0/1.2 MB[0m [31m?[0m eta [36m-:--:--[0m
[2K [90m━━━━━━━━━━━━━━━━━━━━━━━━━━━━━━━━━━━━━━━━[0m [32m1.2/1.2 MB[0m [31m74.0 MB/s[0m eta [36m0:00:00[0m
Step #6 - "compile-libfuzzer-introspector-x86_64": [?25hDownloading requests-2.32.3-py3-none-any.whl (64 kB)
Step #6 - "compile-libfuzzer-introspector-x86_64": Downloading snowballstemmer-2.2.0-py2.py3-none-any.whl (93 kB)
Step #6 - "compile-libfuzzer-introspector-x86_64": Downloading sphinxcontrib_htmlhelp-2.1.0-py3-none-any.whl (98 kB)
Step #6 - "compile-libfuzzer-introspector-x86_64": Downloading sphinxcontrib_jquery-4.1-py2.py3-none-any.whl (121 kB)
Step #6 - "compile-libfuzzer-introspector-x86_64": Downloading sphinxcontrib_serializinghtml-2.0.0-py3-none-any.whl (92 kB)
Step #6 - "compile-libfuzzer-introspector-x86_64": Using cached tomli-2.2.1-py3-none-any.whl (14 kB)
Step #6 - "compile-libfuzzer-introspector-x86_64": Downloading iniconfig-2.1.0-py3-none-any.whl (6.0 kB)
Step #6 - "compile-libfuzzer-introspector-x86_64": Downloading sphinxcontrib_applehelp-2.0.0-py3-none-any.whl (119 kB)
Step #6 - "compile-libfuzzer-introspector-x86_64": Downloading sphinxcontrib_devhelp-2.0.0-py3-none-any.whl (82 kB)
Step #6 - "compile-libfuzzer-introspector-x86_64": Downloading sphinxcontrib_jsmath-1.0.1-py2.py3-none-any.whl (5.1 kB)
Step #6 - "compile-libfuzzer-introspector-x86_64": Downloading sphinxcontrib_qthelp-2.0.0-py3-none-any.whl (88 kB)
Step #6 - "compile-libfuzzer-introspector-x86_64": Downloading certifi-2025.1.31-py3-none-any.whl (166 kB)
Step #6 - "compile-libfuzzer-introspector-x86_64": Downloading charset_normalizer-3.4.1-cp310-cp310-manylinux_2_17_x86_64.manylinux2014_x86_64.whl (146 kB)
Step #6 - "compile-libfuzzer-introspector-x86_64": Downloading idna-3.10-py3-none-any.whl (70 kB)
Step #6 - "compile-libfuzzer-introspector-x86_64": Downloading MarkupSafe-3.0.2-cp310-cp310-manylinux_2_17_x86_64.manylinux2014_x86_64.whl (20 kB)
Step #6 - "compile-libfuzzer-introspector-x86_64": Downloading urllib3-2.3.0-py3-none-any.whl (128 kB)
Step #6 - "compile-libfuzzer-introspector-x86_64": Downloading zipp-3.21.0-py3-none-any.whl (9.6 kB)
Step #6 - "compile-libfuzzer-introspector-x86_64": Building wheels for collected packages: fuzz-introspector
Step #6 - "compile-libfuzzer-introspector-x86_64": Building editable for fuzz-introspector (pyproject.toml) ... [?25l- done
Step #6 - "compile-libfuzzer-introspector-x86_64": [?25h Created wheel for fuzz-introspector: filename=fuzz_introspector-0.1.10-0.editable-py3-none-any.whl size=3911 sha256=86f4f57d944e20e0157e4d5119aac93cce0c03442b10db3e5b91ca232d0fc5f0
Step #6 - "compile-libfuzzer-introspector-x86_64": Stored in directory: /tmp/pip-ephem-wheel-cache-wqood5s7/wheels/ce/ec/9e/e0f680466f0d02256e58f72aba9efaf05145b62b6274f28ccb
Step #6 - "compile-libfuzzer-introspector-x86_64": Successfully built fuzz-introspector
Step #6 - "compile-libfuzzer-introspector-x86_64": Installing collected packages: snowballstemmer, pep8, atheris, zipp, urllib3, tree-sitter-rust, tree-sitter-python, tree-sitter-java, tree-sitter-go, tree-sitter-cpp, tree-sitter-c, tree-sitter, tqdm, tomli, toml, sphinxcontrib-serializinghtml, sphinxcontrib-qthelp, sphinxcontrib-jsmath, sphinxcontrib-htmlhelp, sphinxcontrib-devhelp, sphinxcontrib-applehelp, soupsieve, PyYAML, Pygments, pyflakes, pycodestyle, psutil, pluggy, platformdirs, numpy, networkx, mypy_extensions, mccabe, MarkupSafe, lxml, iniconfig, imagesize, idna, exceptiongroup, docutils, coverage, configparser, charset-normalizer, certifi, babel, alabaster, tree-sitter-languages, requests, pytest, mypy, Jinja2, importlib-metadata, flake8, beautifulsoup4, yapf, sphinx, matplotlib, sphinxcontrib-jquery, sphinx_rtd_theme, fuzz-introspector
Step #6 - "compile-libfuzzer-introspector-x86_64": Attempting uninstall: soupsieve
Step #6 - "compile-libfuzzer-introspector-x86_64": Found existing installation: soupsieve 2.6
Step #6 - "compile-libfuzzer-introspector-x86_64": Uninstalling soupsieve-2.6:
Step #6 - "compile-libfuzzer-introspector-x86_64": Successfully uninstalled soupsieve-2.6
Step #6 - "compile-libfuzzer-introspector-x86_64": Attempting uninstall: PyYAML
Step #6 - "compile-libfuzzer-introspector-x86_64": Found existing installation: PyYAML 6.0.2
Step #6 - "compile-libfuzzer-introspector-x86_64": Uninstalling PyYAML-6.0.2:
Step #6 - "compile-libfuzzer-introspector-x86_64": Successfully uninstalled PyYAML-6.0.2
Step #6 - "compile-libfuzzer-introspector-x86_64": Attempting uninstall: numpy
Step #6 - "compile-libfuzzer-introspector-x86_64": Found existing installation: numpy 2.2.4
Step #6 - "compile-libfuzzer-introspector-x86_64": Uninstalling numpy-2.2.4:
Step #6 - "compile-libfuzzer-introspector-x86_64": Successfully uninstalled numpy-2.2.4
Step #6 - "compile-libfuzzer-introspector-x86_64": Attempting uninstall: lxml
Step #6 - "compile-libfuzzer-introspector-x86_64": Found existing installation: lxml 5.3.1
Step #6 - "compile-libfuzzer-introspector-x86_64": Uninstalling lxml-5.3.1:
Step #6 - "compile-libfuzzer-introspector-x86_64": Successfully uninstalled lxml-5.3.1
Step #6 - "compile-libfuzzer-introspector-x86_64": Attempting uninstall: beautifulsoup4
Step #6 - "compile-libfuzzer-introspector-x86_64": Found existing installation: beautifulsoup4 4.13.3
Step #6 - "compile-libfuzzer-introspector-x86_64": Uninstalling beautifulsoup4-4.13.3:
Step #6 - "compile-libfuzzer-introspector-x86_64": Successfully uninstalled beautifulsoup4-4.13.3
Step #6 - "compile-libfuzzer-introspector-x86_64": Attempting uninstall: matplotlib
Step #6 - "compile-libfuzzer-introspector-x86_64": Found existing installation: matplotlib 3.10.1
Step #6 - "compile-libfuzzer-introspector-x86_64": Uninstalling matplotlib-3.10.1:
Step #6 - "compile-libfuzzer-introspector-x86_64": Successfully uninstalled matplotlib-3.10.1
Step #6 - "compile-libfuzzer-introspector-x86_64": Successfully installed Jinja2-3.1.6 MarkupSafe-3.0.2 PyYAML-6.0.1 Pygments-2.19.1 alabaster-0.7.16 atheris-2.3.0 babel-2.17.0 beautifulsoup4-4.10.0 certifi-2025.1.31 charset-normalizer-3.4.1 configparser-7.2.0 coverage-7.7.1 docutils-0.19 exceptiongroup-1.2.2 flake8-7.1.2 fuzz-introspector-0.1.10 idna-3.10 imagesize-1.4.1 importlib-metadata-8.6.1 iniconfig-2.1.0 lxml-4.9.1 matplotlib-3.10.0 mccabe-0.7.0 mypy-1.15.0 mypy_extensions-1.0.0 networkx-3.4.2 numpy-2.1.0 pep8-1.7.1 platformdirs-4.3.7 pluggy-1.5.0 psutil-7.0.0 pycodestyle-2.12.1 pyflakes-3.2.0 pytest-8.3.5 requests-2.32.3 snowballstemmer-2.2.0 soupsieve-2.2.1 sphinx-6.0.0 sphinx_rtd_theme-3.0.2 sphinxcontrib-applehelp-2.0.0 sphinxcontrib-devhelp-2.0.0 sphinxcontrib-htmlhelp-2.1.0 sphinxcontrib-jquery-4.1 sphinxcontrib-jsmath-1.0.1 sphinxcontrib-qthelp-2.0.0 sphinxcontrib-serializinghtml-2.0.0 toml-0.10.2 tomli-2.2.1 tqdm-4.67.1 tree-sitter-0.23.2 tree-sitter-c-0.23.4 tree-sitter-cpp-0.23.4 tree-sitter-go-0.23.4 tree-sitter-java-0.23.5 tree-sitter-languages-1.10.2 tree-sitter-python-0.23.6 tree-sitter-rust-0.23.2 urllib3-2.3.0 yapf-0.40.1 zipp-3.21.0
Step #6 - "compile-libfuzzer-introspector-x86_64": [33mWARNING: Running pip as the 'root' user can result in broken permissions and conflicting behaviour with the system package manager, possibly rendering your system unusable. It is recommended to use a virtual environment instead: https://pip.pypa.io/warnings/venv. Use the --root-user-action option if you know what you are doing and want to suppress this warning.[0m[33m
Step #6 - "compile-libfuzzer-introspector-x86_64": [0m/src
Step #6 - "compile-libfuzzer-introspector-x86_64": 2025-03-28 10:05:24.845 INFO cli - main: Running fuzz introspector post-processing
Step #6 - "compile-libfuzzer-introspector-x86_64": 2025-03-28 10:05:25.420 INFO analysis - extract_tests_from_directories: All test files
Step #6 - "compile-libfuzzer-introspector-x86_64": 2025-03-28 10:05:25.420 INFO analysis - extract_tests_from_directories: /workspace/oss-fuzz/projects/tinyxml2/xmltest.cpp
Step #6 - "compile-libfuzzer-introspector-x86_64": 2025-03-28 10:05:25.420 INFO analysis - extract_tests_from_directories: /src/leveldb/util/crc32c_test.cc
Step #6 - "compile-libfuzzer-introspector-x86_64": 2025-03-28 10:05:25.421 INFO analysis - extract_tests_from_directories: /src/leveldb/db/c_test.c
Step #6 - "compile-libfuzzer-introspector-x86_64": 2025-03-28 10:05:25.421 INFO analysis - extract_tests_from_directories: /src/leveldb/util/hash_test.cc
Step #6 - "compile-libfuzzer-introspector-x86_64": 2025-03-28 10:05:25.421 INFO analysis - extract_tests_from_directories: /src/leveldb/db/autocompact_test.cc
Step #6 - "compile-libfuzzer-introspector-x86_64": 2025-03-28 10:05:25.421 INFO analysis - extract_tests_from_directories: /src/leveldb/db/db_test.cc
Step #6 - "compile-libfuzzer-introspector-x86_64": 2025-03-28 10:05:25.422 INFO analysis - extract_tests_from_directories: /src/leveldb/issues/issue200_test.cc
Step #6 - "compile-libfuzzer-introspector-x86_64": 2025-03-28 10:05:25.422 INFO analysis - extract_tests_from_directories: /workspace/oss-fuzz/projects/example/my-api-repo/do_stuff_unittest.cpp
Step #6 - "compile-libfuzzer-introspector-x86_64": 2025-03-28 10:05:25.422 INFO analysis - extract_tests_from_directories: /src/leveldb/util/no_destructor_test.cc
Step #6 - "compile-libfuzzer-introspector-x86_64": 2025-03-28 10:05:25.422 INFO analysis - extract_tests_from_directories: /src/leveldb/util/status_test.cc
Step #6 - "compile-libfuzzer-introspector-x86_64": 2025-03-28 10:05:25.423 INFO analysis - extract_tests_from_directories: /src/leveldb/db/filename_test.cc
Step #6 - "compile-libfuzzer-introspector-x86_64": 2025-03-28 10:05:25.423 INFO analysis - extract_tests_from_directories: /src/leveldb/db/version_set_test.cc
Step #6 - "compile-libfuzzer-introspector-x86_64": 2025-03-28 10:05:25.423 INFO analysis - extract_tests_from_directories: /src/leveldb/db/log_test.cc
Step #6 - "compile-libfuzzer-introspector-x86_64": 2025-03-28 10:05:25.423 INFO analysis - extract_tests_from_directories: /src/leveldb/db/fault_injection_test.cc
Step #6 - "compile-libfuzzer-introspector-x86_64": 2025-03-28 10:05:25.423 INFO analysis - extract_tests_from_directories: /src/leveldb/util/logging_test.cc
Step #6 - "compile-libfuzzer-introspector-x86_64": 2025-03-28 10:05:25.423 INFO analysis - extract_tests_from_directories: /src/leveldb/db/skiplist_test.cc
Step #6 - "compile-libfuzzer-introspector-x86_64": 2025-03-28 10:05:25.424 INFO analysis - extract_tests_from_directories: /src/leveldb/util/bloom_test.cc
Step #6 - "compile-libfuzzer-introspector-x86_64": 2025-03-28 10:05:25.424 INFO analysis - extract_tests_from_directories: /src/leveldb/db/corruption_test.cc
Step #6 - "compile-libfuzzer-introspector-x86_64": 2025-03-28 10:05:25.424 INFO analysis - extract_tests_from_directories: /src/leveldb/util/env_windows_test.cc
Step #6 - "compile-libfuzzer-introspector-x86_64": 2025-03-28 10:05:25.424 INFO analysis - extract_tests_from_directories: /src/leveldb/db/dbformat_test.cc
Step #6 - "compile-libfuzzer-introspector-x86_64": 2025-03-28 10:05:25.424 INFO analysis - extract_tests_from_directories: /workspace/oss-fuzz/projects/tinyxml2/xmltest2.cpp
Step #6 - "compile-libfuzzer-introspector-x86_64": 2025-03-28 10:05:25.425 INFO analysis - extract_tests_from_directories: /src/leveldb/db/recovery_test.cc
Step #6 - "compile-libfuzzer-introspector-x86_64": 2025-03-28 10:05:25.425 INFO analysis - extract_tests_from_directories: /src/leveldb/issues/issue178_test.cc
Step #6 - "compile-libfuzzer-introspector-x86_64": 2025-03-28 10:05:25.425 INFO analysis - extract_tests_from_directories: /src/leveldb/db/version_edit_test.cc
Step #6 - "compile-libfuzzer-introspector-x86_64": 2025-03-28 10:05:25.425 INFO analysis - extract_tests_from_directories: /workspace/oss-fuzz/projects/upx/fuzzers/test_packed_file_fuzzer.cpp
Step #6 - "compile-libfuzzer-introspector-x86_64": 2025-03-28 10:05:25.425 INFO analysis - extract_tests_from_directories: /src/leveldb/util/env_test.cc
Step #6 - "compile-libfuzzer-introspector-x86_64": 2025-03-28 10:05:25.426 INFO analysis - extract_tests_from_directories: /src/leveldb/util/coding_test.cc
Step #6 - "compile-libfuzzer-introspector-x86_64": 2025-03-28 10:05:25.426 INFO analysis - extract_tests_from_directories: /src/leveldb/util/arena_test.cc
Step #6 - "compile-libfuzzer-introspector-x86_64": 2025-03-28 10:05:25.426 INFO analysis - extract_tests_from_directories: /src/leveldb/table/filter_block_test.cc
Step #6 - "compile-libfuzzer-introspector-x86_64": 2025-03-28 10:05:25.426 INFO analysis - extract_tests_from_directories: /src/leveldb/table/table_test.cc
Step #6 - "compile-libfuzzer-introspector-x86_64": 2025-03-28 10:05:25.426 INFO analysis - extract_tests_from_directories: /src/leveldb/issues/issue320_test.cc
Step #6 - "compile-libfuzzer-introspector-x86_64": 2025-03-28 10:05:25.427 INFO analysis - extract_tests_from_directories: /src/leveldb/util/env_posix_test.cc
Step #6 - "compile-libfuzzer-introspector-x86_64": 2025-03-28 10:05:25.427 INFO analysis - extract_tests_from_directories: /src/leveldb/util/cache_test.cc
Step #6 - "compile-libfuzzer-introspector-x86_64": 2025-03-28 10:05:25.427 INFO analysis - extract_tests_from_directories: /src/leveldb/util/testutil.cc
Step #6 - "compile-libfuzzer-introspector-x86_64": 2025-03-28 10:05:25.427 INFO analysis - extract_tests_from_directories: /src/leveldb/db/write_batch_test.cc
Step #6 - "compile-libfuzzer-introspector-x86_64": 2025-03-28 10:05:25.427 INFO analysis - extract_tests_from_directories: /src/leveldb/helpers/memenv/memenv_test.cc
Step #6 - "compile-libfuzzer-introspector-x86_64": 2025-03-28 10:05:25.478 INFO cli - main: Ending fuzz introspector post-processing
Step #6 - "compile-libfuzzer-introspector-x86_64": 2025-03-28 10:05:25.681 INFO cli - main: Running fuzz introspector post-processing
Step #6 - "compile-libfuzzer-introspector-x86_64": 2025-03-28 10:05:25.696 INFO oss_fuzz - analyse_folder: Found 376 files to include in analysis
Step #6 - "compile-libfuzzer-introspector-x86_64": 2025-03-28 10:05:25.696 INFO oss_fuzz - analyse_folder: Going C++ route
Step #6 - "compile-libfuzzer-introspector-x86_64": 2025-03-28 10:05:25.696 INFO oss_fuzz - analyse_folder: Loading tree-sitter trees
Step #6 - "compile-libfuzzer-introspector-x86_64": 2025-03-28 10:05:25.698 INFO frontend_cpp - load_treesitter_trees: harness: /src/leveldb/fuzz_db.cc
Step #6 - "compile-libfuzzer-introspector-x86_64": 2025-03-28 10:05:27.964 INFO oss_fuzz - analyse_folder: Dump methods for fuzz_db
Step #6 - "compile-libfuzzer-introspector-x86_64": 2025-03-28 10:05:27.964 INFO datatypes - dump_module_logic: Generating report
Step #6 - "compile-libfuzzer-introspector-x86_64": 2025-03-28 10:11:10.437 INFO datatypes - dump_module_logic: Report generated
Step #6 - "compile-libfuzzer-introspector-x86_64": 2025-03-28 10:11:10.797 INFO datatypes - dump_module_logic: Dumping project-wide logic.
Step #6 - "compile-libfuzzer-introspector-x86_64": 2025-03-28 10:11:10.797 INFO datatypes - dump_module_logic: Using safe yaml safe C dumper.
Step #6 - "compile-libfuzzer-introspector-x86_64": 2025-03-28 10:11:14.610 INFO datatypes - dump_module_logic: Dumped
Step #6 - "compile-libfuzzer-introspector-x86_64": 2025-03-28 10:11:14.622 INFO oss_fuzz - analyse_folder: Extracting calltree for fuzz_db
Step #6 - "compile-libfuzzer-introspector-x86_64": 2025-03-28 10:11:17.491 INFO oss_fuzz - analyse_folder: Calltree extracted
Step #6 - "compile-libfuzzer-introspector-x86_64": 2025-03-28 10:11:17.491 INFO commands - analyse_end_to_end: No harness list at place
Step #6 - "compile-libfuzzer-introspector-x86_64": 2025-03-28 10:11:17.492 INFO commands - run_analysis_on_dir: Running analysis
Step #6 - "compile-libfuzzer-introspector-x86_64": 2025-03-28 10:11:17.519 INFO analysis - load_data_files: Loading profiles using files
Step #6 - "compile-libfuzzer-introspector-x86_64": 2025-03-28 10:11:17.519 INFO data_loader - load_all_profiles: Loading profiles from /src/inspector
Step #6 - "compile-libfuzzer-introspector-x86_64": 2025-03-28 10:11:17.522 INFO data_loader - load_all_profiles: []
Step #6 - "compile-libfuzzer-introspector-x86_64": 2025-03-28 10:11:17.522 INFO data_loader - load_all_profiles: - found 1 profiles to load
Step #6 - "compile-libfuzzer-introspector-x86_64": 2025-03-28 10:11:17.550 INFO data_loader - read_fuzzer_data_file_to_profile: - loading /src/inspector/fuzzerLogFile-fuzz_db.data
Step #6 - "compile-libfuzzer-introspector-x86_64": 2025-03-28 10:11:17.550 INFO data_loader - read_fuzzer_data_file_to_profile: target data f: /src/inspector/fuzzerLogFile-fuzz_db.data
Step #6 - "compile-libfuzzer-introspector-x86_64": 2025-03-28 10:11:17.550 INFO utils - data_file_read_yaml: Set base loader to use CSafeLoader
Step #6 - "compile-libfuzzer-introspector-x86_64": 2025-03-28 10:11:22.936 INFO utils - data_file_read_yaml: Loaded single yaml module
Step #6 - "compile-libfuzzer-introspector-x86_64": 2025-03-28 10:11:23.128 INFO data_loader - read_fuzzer_data_file_to_profile: Returning profile
Step #6 - "compile-libfuzzer-introspector-x86_64": 2025-03-28 10:11:23.390 INFO analysis - load_data_files: Found 1 profiles
Step #6 - "compile-libfuzzer-introspector-x86_64": 2025-03-28 10:11:23.390 INFO analysis - load_data_files: [+] Accummulating profiles
Step #6 - "compile-libfuzzer-introspector-x86_64": 2025-03-28 10:11:23.390 INFO analysis - load_data_files: Accummulating using multiprocessing
Step #6 - "compile-libfuzzer-introspector-x86_64": 2025-03-28 10:11:23.410 INFO fuzzer_profile - accummulate_profile: /src/leveldb/fuzz_db.cc: propagating functions reached
Step #6 - "compile-libfuzzer-introspector-x86_64": 2025-03-28 10:11:23.447 INFO fuzzer_profile - accummulate_profile: /src/leveldb/fuzz_db.cc: setting reached funcs
Step #6 - "compile-libfuzzer-introspector-x86_64": 2025-03-28 10:11:23.447 INFO fuzzer_profile - accummulate_profile: /src/leveldb/fuzz_db.cc: setting unreached funcs
Step #6 - "compile-libfuzzer-introspector-x86_64": 2025-03-28 10:11:23.452 INFO fuzzer_profile - accummulate_profile: /src/leveldb/fuzz_db.cc: loading coverage
Step #6 - "compile-libfuzzer-introspector-x86_64": 2025-03-28 10:11:23.452 INFO fuzzer_profile - _load_coverage: Loading coverage of type c-cpp
Step #6 - "compile-libfuzzer-introspector-x86_64": 2025-03-28 10:11:23.452 INFO code_coverage - load_llvm_coverage: Loading LLVM coverage for target /src/leveldb/fuzz_db.cc
Step #6 - "compile-libfuzzer-introspector-x86_64": 2025-03-28 10:11:23.453 INFO code_coverage - load_llvm_coverage: Found 0 coverage reports
Step #6 - "compile-libfuzzer-introspector-x86_64": 2025-03-28 10:11:23.453 INFO code_coverage - load_llvm_coverage: Using the following coverages []
Step #6 - "compile-libfuzzer-introspector-x86_64": 2025-03-28 10:11:23.453 INFO fuzzer_profile - accummulate_profile: /src/leveldb/fuzz_db.cc: setting file targets
Step #6 - "compile-libfuzzer-introspector-x86_64": 2025-03-28 10:11:23.454 INFO fuzzer_profile - accummulate_profile: /src/leveldb/fuzz_db.cc: setting total basic blocks
Step #6 - "compile-libfuzzer-introspector-x86_64": 2025-03-28 10:11:23.454 INFO fuzzer_profile - accummulate_profile: /src/leveldb/fuzz_db.cc: setting cyclomatic complexity
Step #6 - "compile-libfuzzer-introspector-x86_64": 2025-03-28 10:11:23.454 INFO fuzzer_profile - accummulate_profile: /src/leveldb/fuzz_db.cc: setting fd cache
Step #6 - "compile-libfuzzer-introspector-x86_64": 2025-03-28 10:11:23.461 INFO fuzzer_profile - accummulate_profile: /src/leveldb/fuzz_db.cc: finished accummulating profile
Step #6 - "compile-libfuzzer-introspector-x86_64": 2025-03-28 10:11:23.682 INFO analysis - load_data_files: [+] Creating project profile
Step #6 - "compile-libfuzzer-introspector-x86_64": 2025-03-28 10:11:23.682 INFO project_profile - __init__: Creating merged profile of 1 profiles
Step #6 - "compile-libfuzzer-introspector-x86_64": 2025-03-28 10:11:23.682 INFO project_profile - __init__: Populating functions reached
Step #6 - "compile-libfuzzer-introspector-x86_64": 2025-03-28 10:11:23.682 INFO project_profile - __init__: Populating functions unreached
Step #6 - "compile-libfuzzer-introspector-x86_64": 2025-03-28 10:11:23.684 INFO project_profile - __init__: Creating all_functions dictionary
Step #6 - "compile-libfuzzer-introspector-x86_64": 2025-03-28 10:11:23.693 INFO project_profile - __init__: Gathering complexity and incoming references of each function
Step #6 - "compile-libfuzzer-introspector-x86_64": 2025-03-28 10:11:23.735 INFO project_profile - __init__: Completed creationg of merged profile
Step #6 - "compile-libfuzzer-introspector-x86_64": 2025-03-28 10:11:23.735 INFO analysis - load_data_files: [+] Refining profiles
Step #6 - "compile-libfuzzer-introspector-x86_64": 2025-03-28 10:11:23.744 INFO utils - get_target_coverage_url: Extracting coverage for https://storage.googleapis.com/oss-fuzz-coverage/leveldb/reports/20250328/linux -- fuzz_db.cc
Step #6 - "compile-libfuzzer-introspector-x86_64": 2025-03-28 10:11:23.744 INFO analysis - overlay_calltree_with_coverage: Using coverage url: https://storage.googleapis.com/oss-fuzz-coverage/leveldb/reports-by-target/20250328/fuzz_db.cc/linux
Step #6 - "compile-libfuzzer-introspector-x86_64": 2025-03-28 10:11:23.745 INFO analysis - get_node_coverage_hitcount: There is no coverage data (not even all negative).
Step #6 - "compile-libfuzzer-introspector-x86_64": 2025-03-28 10:11:23.754 INFO analysis - overlay_calltree_with_coverage: Overlaying 2
Step #6 - "compile-libfuzzer-introspector-x86_64": 2025-03-28 10:11:23.754 INFO analysis - overlay_calltree_with_coverage: Overlaying 3
Step #6 - "compile-libfuzzer-introspector-x86_64": 2025-03-28 10:11:23.755 INFO analysis - overlay_calltree_with_coverage: Updating branch complexities
Step #6 - "compile-libfuzzer-introspector-x86_64": 2025-03-28 10:11:23.756 INFO analysis - overlay_calltree_with_coverage: [+] found 0 branch blockers.
Step #6 - "compile-libfuzzer-introspector-x86_64": 2025-03-28 10:11:23.774 INFO commands - run_analysis_on_dir: Analyses to run: ['OptimalTargets', 'FuzzEngineInputAnalysis', 'RuntimeCoverageAnalysis', 'FuzzDriverSynthesizerAnalysis', 'BugDigestorAnalysis', 'FilePathAnalyser', 'ThirdPartyAPICoverageAnalyser', 'MetadataAnalysis', 'SinkCoverageAnalyser', 'AnnotatedCFG', 'SourceCodeLineAnalyser', 'FarReachLowCoverageAnalyser', 'PublicCandidateAnalyser']
Step #6 - "compile-libfuzzer-introspector-x86_64": 2025-03-28 10:11:23.774 INFO commands - run_analysis_on_dir: [+] Creating HTML report
Step #6 - "compile-libfuzzer-introspector-x86_64": 2025-03-28 10:11:23.774 INFO html_report - create_html_report: - Creating HTML report
Step #6 - "compile-libfuzzer-introspector-x86_64": 2025-03-28 10:11:23.774 INFO html_report - create_section_project_overview: - Creating reachability overview table
Step #6 - "compile-libfuzzer-introspector-x86_64": 2025-03-28 10:11:23.844 INFO html_report - create_section_fuzzers_overview: - Creating table with overview of all fuzzers
Step #6 - "compile-libfuzzer-introspector-x86_64": 2025-03-28 10:11:23.844 INFO html_report - create_section_all_functions: - Creating table with information about all functions in target
Step #6 - "compile-libfuzzer-introspector-x86_64": 2025-03-28 10:11:23.946 INFO html_report - create_all_function_table: Assembled a total of 4436 entries
Step #6 - "compile-libfuzzer-introspector-x86_64": 2025-03-28 10:11:23.946 INFO html_report - create_section_fuzzer_detailed_section: - Creating section with details about each fuzzer
Step #6 - "compile-libfuzzer-introspector-x86_64": 2025-03-28 10:11:23.946 INFO calltree_analysis - __init__: Creating FuzzCalltreeAnalysis
Step #6 - "compile-libfuzzer-introspector-x86_64": 2025-03-28 10:11:23.946 INFO calltree_analysis - create_calltree: In calltree
Step #6 - "compile-libfuzzer-introspector-x86_64": 2025-03-28 10:11:23.949 INFO calltree_analysis - create_calltree: At end
Step #6 - "compile-libfuzzer-introspector-x86_64": 2025-03-28 10:11:23.949 INFO calltree_analysis - create_calltree: calltree_html_section_string: : 477 -- : 477
Step #6 - "compile-libfuzzer-introspector-x86_64": 2025-03-28 10:11:23.949 INFO calltree_analysis - create_calltree: Calltree created
Step #6 - "compile-libfuzzer-introspector-x86_64": 2025-03-28 10:11:23.950 INFO calltree_analysis - create_fuzz_blocker_table: Creating fuzz blocker table
Step #6 - "compile-libfuzzer-introspector-x86_64": 2025-03-28 10:11:24.570 INFO font_manager - _load_fontmanager: generated new fontManager
Step #6 - "compile-libfuzzer-introspector-x86_64": 2025-03-28 10:11:24.784 INFO html_helpers - create_horisontal_calltree_image: Creating image fuzz_db.cc_colormap.png
Step #6 - "compile-libfuzzer-introspector-x86_64": 2025-03-28 10:11:24.784 INFO html_helpers - create_horisontal_calltree_image: - extracted the callsites (420 nodes)
Step #6 - "compile-libfuzzer-introspector-x86_64": 2025-03-28 10:11:24.803 INFO html_helpers - create_horisontal_calltree_image: - iterated over color list
Step #6 - "compile-libfuzzer-introspector-x86_64": 2025-03-28 10:11:24.803 INFO html_helpers - create_horisontal_calltree_image: - saving image
Step #6 - "compile-libfuzzer-introspector-x86_64": 2025-03-28 10:11:24.872 INFO html_helpers - create_horisontal_calltree_image: - image saved
Step #6 - "compile-libfuzzer-introspector-x86_64": 2025-03-28 10:11:24.872 INFO html_report - create_section_optional_analyses: - Handling optional analyses
Step #6 - "compile-libfuzzer-introspector-x86_64": 2025-03-28 10:11:24.872 INFO optimal_targets - analysis_func: - Running analysis OptimalTargets
Step #6 - "compile-libfuzzer-introspector-x86_64": 2025-03-28 10:11:24.873 INFO optimal_targets - iteratively_get_optimal_targets: - in iteratively_get_optimal_targets
Step #6 - "compile-libfuzzer-introspector-x86_64": 2025-03-28 10:11:25.165 INFO optimal_targets - analysis_get_optimal_targets: - in analysis_get_optimal_targets
Step #6 - "compile-libfuzzer-introspector-x86_64": 2025-03-28 10:11:25.165 INFO optimal_targets - analysis_get_optimal_targets: Filtering optimal functions from 4436 functions
Step #6 - "compile-libfuzzer-introspector-x86_64": 2025-03-28 10:11:25.169 INFO optimal_targets - analysis_get_optimal_targets: Found a total of 0 potential targets
Step #6 - "compile-libfuzzer-introspector-x86_64": 2025-03-28 10:11:25.169 INFO optimal_targets - iteratively_get_optimal_targets: Getting 7 optimal targets
Step #6 - "compile-libfuzzer-introspector-x86_64": 2025-03-28 10:11:25.169 INFO optimal_targets - iteratively_get_optimal_targets: - sorting by unreached complexity.
Step #6 - "compile-libfuzzer-introspector-x86_64": 2025-03-28 10:11:25.169 INFO optimal_targets - iteratively_get_optimal_targets: Found the following optimal functions: { [] }
Step #6 - "compile-libfuzzer-introspector-x86_64": 2025-03-28 10:11:25.293 INFO html_report - create_all_function_table: Assembled a total of 4436 entries
Step #6 - "compile-libfuzzer-introspector-x86_64": 2025-03-28 10:11:25.343 INFO optimal_targets - analysis_func: - Completed analysis OptimalTargets
Step #6 - "compile-libfuzzer-introspector-x86_64": 2025-03-28 10:11:25.349 INFO engine_input - analysis_func: - Running analysis FuzzEngineInputAnalysis
Step #6 - "compile-libfuzzer-introspector-x86_64": 2025-03-28 10:11:25.349 INFO engine_input - analysis_func: Generating input for fuzz_db.cc
Step #6 - "compile-libfuzzer-introspector-x86_64": 2025-03-28 10:11:25.350 INFO calltree_analysis - __init__: Creating FuzzCalltreeAnalysis
Step #6 - "compile-libfuzzer-introspector-x86_64": 2025-03-28 10:11:25.350 INFO engine_input - analysis_func: - Completed analysis FuzzEngineInputAnalysis
Step #6 - "compile-libfuzzer-introspector-x86_64": 2025-03-28 10:11:25.350 INFO runtime_coverage_analysis - analysis_func: - Running analysis RuntimeCoverageAnalysis
Step #6 - "compile-libfuzzer-introspector-x86_64": 2025-03-28 10:11:25.350 INFO runtime_coverage_analysis - analysis_func: - Completed analysis RuntimeCoverageAnalysis
Step #6 - "compile-libfuzzer-introspector-x86_64": 2025-03-28 10:11:25.350 INFO driver_synthesizer - analysis_func: - Running analysis FuzzDriverSynthesizerAnalysis
Step #6 - "compile-libfuzzer-introspector-x86_64": 2025-03-28 10:11:25.350 INFO optimal_targets - iteratively_get_optimal_targets: - in iteratively_get_optimal_targets
Step #6 - "compile-libfuzzer-introspector-x86_64": 2025-03-28 10:11:25.634 INFO optimal_targets - analysis_get_optimal_targets: - in analysis_get_optimal_targets
Step #6 - "compile-libfuzzer-introspector-x86_64": 2025-03-28 10:11:25.634 INFO optimal_targets - analysis_get_optimal_targets: Filtering optimal functions from 4436 functions
Step #6 - "compile-libfuzzer-introspector-x86_64": 2025-03-28 10:11:25.638 INFO optimal_targets - analysis_get_optimal_targets: Found a total of 0 potential targets
Step #6 - "compile-libfuzzer-introspector-x86_64": 2025-03-28 10:11:25.638 INFO optimal_targets - iteratively_get_optimal_targets: Getting 7 optimal targets
Step #6 - "compile-libfuzzer-introspector-x86_64": 2025-03-28 10:11:25.638 INFO optimal_targets - iteratively_get_optimal_targets: - sorting by unreached complexity.
Step #6 - "compile-libfuzzer-introspector-x86_64": 2025-03-28 10:11:25.638 INFO optimal_targets - iteratively_get_optimal_targets: Found the following optimal functions: { [] }
Step #6 - "compile-libfuzzer-introspector-x86_64": 2025-03-28 10:11:25.638 INFO driver_synthesizer - analysis_func: Synthesizing drivers for the following optimal functions: { [] }
Step #6 - "compile-libfuzzer-introspector-x86_64": 2025-03-28 10:11:25.638 INFO driver_synthesizer - analysis_func: - Completed analysis FuzzDriverSynthesizerAnalysis
Step #6 - "compile-libfuzzer-introspector-x86_64": 2025-03-28 10:11:25.644 INFO bug_digestor - analysis_func: - Running analysis BugDigestorAnalysis
Step #6 - "compile-libfuzzer-introspector-x86_64": 2025-03-28 10:11:25.644 INFO filepath_analyser - analysis_func: - Running analysis FilePathAnalyser
Step #6 - "compile-libfuzzer-introspector-x86_64": 2025-03-28 10:11:26.042 INFO function_call_analyser - analysis_func: - Running analysis ThirdPartyAPICoverageAnalyser
Step #6 - "compile-libfuzzer-introspector-x86_64": 2025-03-28 10:11:26.050 INFO metadata - analysis_func: - Running analysis MetadataAnalysis
Step #6 - "compile-libfuzzer-introspector-x86_64": 2025-03-28 10:11:26.051 INFO metadata - analysis_func: - Completed analysis MetadataAnalysis
Step #6 - "compile-libfuzzer-introspector-x86_64": 2025-03-28 10:11:26.051 INFO sinks_analyser - analysis_func: - Running analysis SinkCoverageAnalyser
Step #6 - "compile-libfuzzer-introspector-x86_64": 2025-03-28 10:11:26.300 INFO sinks_analyser - analysis_func: ['fuzz_db.cc']
Step #6 - "compile-libfuzzer-introspector-x86_64": 2025-03-28 10:11:26.300 INFO sinks_analyser - analysis_func: - Running analysis SinkCoverageAnalyser for CWE78
Step #6 - "compile-libfuzzer-introspector-x86_64": 2025-03-28 10:11:26.308 INFO sinks_analyser - analysis_func: - Running analysis SinkCoverageAnalyser for CWE79
Step #6 - "compile-libfuzzer-introspector-x86_64": 2025-03-28 10:11:26.316 INFO sinks_analyser - analysis_func: - Running analysis SinkCoverageAnalyser for CWE787
Step #6 - "compile-libfuzzer-introspector-x86_64": 2025-03-28 10:11:26.327 INFO sinks_analyser - analysis_func: - Running analysis SinkCoverageAnalyser for CWE89
Step #6 - "compile-libfuzzer-introspector-x86_64": 2025-03-28 10:11:26.334 INFO sinks_analyser - analysis_func: - Running analysis SinkCoverageAnalyser for CWE416
Step #6 - "compile-libfuzzer-introspector-x86_64": 2025-03-28 10:11:26.341 INFO sinks_analyser - analysis_func: - Running analysis SinkCoverageAnalyser for CWE20
Step #6 - "compile-libfuzzer-introspector-x86_64": 2025-03-28 10:11:26.353 INFO sinks_analyser - analysis_func: - Running analysis SinkCoverageAnalyser for CWE22
Step #6 - "compile-libfuzzer-introspector-x86_64": 2025-03-28 10:11:26.362 INFO sinks_analyser - analysis_func: - Running analysis SinkCoverageAnalyser for CWE352
Step #6 - "compile-libfuzzer-introspector-x86_64": 2025-03-28 10:11:26.369 INFO sinks_analyser - analysis_func: - Running analysis SinkCoverageAnalyser for CWE434
Step #6 - "compile-libfuzzer-introspector-x86_64": 2025-03-28 10:11:26.376 INFO sinks_analyser - analysis_func: - Finish running analysis SinkCoverageAnalyser
Step #6 - "compile-libfuzzer-introspector-x86_64": 2025-03-28 10:11:26.376 INFO annotated_cfg - __init__: Creating annotated CFG
Step #6 - "compile-libfuzzer-introspector-x86_64": 2025-03-28 10:11:26.376 INFO annotated_cfg - analysis_func: Creating annotated CFGs
Step #6 - "compile-libfuzzer-introspector-x86_64": 2025-03-28 10:11:26.376 INFO annotated_cfg - analysis_func: Analysing: fuzz_db.cc
Step #6 - "compile-libfuzzer-introspector-x86_64": 2025-03-28 10:11:26.381 INFO source_code_line_analyser - standalone_analysis: - Running analysis SourceCodeLineAnalyser
Step #6 - "compile-libfuzzer-introspector-x86_64": 2025-03-28 10:11:26.382 INFO far_reach_low_coverage_analyser - standalone_analysis: - Running analysis FarReachLowCoverageAnalyser
Step #6 - "compile-libfuzzer-introspector-x86_64": 2025-03-28 10:11:26.382 INFO far_reach_low_coverage_analyser - standalone_analysis: - Settings: exclude_static_functions: False, only_referenced_functions: False, only_header_functions: False, only_interesting_functions: False, only_easy_fuzz_params: False, min_complexity: 0, max_functions: 10
Step #6 - "compile-libfuzzer-introspector-x86_64": 2025-03-28 10:11:26.437 INFO far_reach_low_coverage_analyser - standalone_analysis: Found 10 function candidiates.
Step #6 - "compile-libfuzzer-introspector-x86_64": 2025-03-28 10:11:26.437 INFO far_reach_low_coverage_analyser - standalone_analysis: Dumping result to /src/inspector/result.json
Step #6 - "compile-libfuzzer-introspector-x86_64": 2025-03-28 10:11:26.438 INFO public_candidate_analyser - standalone_analysis: - Running analysis PublicCandidateAnalyser
Step #6 - "compile-libfuzzer-introspector-x86_64": 2025-03-28 10:11:26.464 INFO public_candidate_analyser - standalone_analysis: Found 1307 function candidiates.
Step #6 - "compile-libfuzzer-introspector-x86_64": 2025-03-28 10:11:26.464 INFO public_candidate_analyser - standalone_analysis: Dumping result to /src/inspector/result.json
Step #6 - "compile-libfuzzer-introspector-x86_64": 2025-03-28 10:11:26.496 INFO utils - get_target_coverage_url: Extracting coverage for https://storage.googleapis.com/oss-fuzz-coverage/leveldb/reports/20250328/linux -- fuzz_db.cc
Step #6 - "compile-libfuzzer-introspector-x86_64": 2025-03-28 10:11:26.497 INFO debug_info - load_debug_all_yaml_files: Set base loader to use CSafeLoader
Step #6 - "compile-libfuzzer-introspector-x86_64": 2025-03-28 10:11:26.497 INFO debug_info - load_debug_all_yaml_files: Set base loader to use CSafeLoader
Step #6 - "compile-libfuzzer-introspector-x86_64": 2025-03-28 10:11:26.497 INFO debug_info - correlate_debugged_function_to_debug_types: Creating dictionary
Step #6 - "compile-libfuzzer-introspector-x86_64": 2025-03-28 10:11:26.497 INFO debug_info - create_friendly_debug_types: Have to create for 0 addresses
Step #6 - "compile-libfuzzer-introspector-x86_64": 2025-03-28 10:11:26.497 INFO debug_info - correlate_debugged_function_to_debug_types: Finished creating dictionary
Step #6 - "compile-libfuzzer-introspector-x86_64": 2025-03-28 10:11:26.513 INFO analysis - extract_tests_from_directories: All test files
Step #6 - "compile-libfuzzer-introspector-x86_64": 2025-03-28 10:11:26.782 INFO html_report - write_content_to_html_files: Dumping report
Step #6 - "compile-libfuzzer-introspector-x86_64": 2025-03-28 10:11:26.962 INFO cli - main: Ending fuzz introspector post-processing
Step #6 - "compile-libfuzzer-introspector-x86_64": sending incremental file list
Step #6 - "compile-libfuzzer-introspector-x86_64": created directory /workspace/out/libfuzzer-introspector-x86_64/inspector
Step #6 - "compile-libfuzzer-introspector-x86_64": ./
Step #6 - "compile-libfuzzer-introspector-x86_64": all-files.json
Step #6 - "compile-libfuzzer-introspector-x86_64": all-friendly-debug-types.json
Step #6 - "compile-libfuzzer-introspector-x86_64": all-fuzz-introspector-functions.json
Step #6 - "compile-libfuzzer-introspector-x86_64": all_debug_info.json
Step #6 - "compile-libfuzzer-introspector-x86_64": all_functions.js
Step #6 - "compile-libfuzzer-introspector-x86_64": analysis_1.js
Step #6 - "compile-libfuzzer-introspector-x86_64": branch-blockers.json
Step #6 - "compile-libfuzzer-introspector-x86_64": calltree.js
Step #6 - "compile-libfuzzer-introspector-x86_64": calltree_view_0.html
Step #6 - "compile-libfuzzer-introspector-x86_64": clike.js
Step #6 - "compile-libfuzzer-introspector-x86_64": custom.js
Step #6 - "compile-libfuzzer-introspector-x86_64": fuzz_db.cc_colormap.png
Step #6 - "compile-libfuzzer-introspector-x86_64": fuzz_report.html
Step #6 - "compile-libfuzzer-introspector-x86_64": fuzzerLogFile-fuzz_db.data
Step #6 - "compile-libfuzzer-introspector-x86_64": fuzzerLogFile-fuzz_db.data.yaml
Step #6 - "compile-libfuzzer-introspector-x86_64": fuzzer_table_data.js
Step #6 - "compile-libfuzzer-introspector-x86_64": prism.css
Step #6 - "compile-libfuzzer-introspector-x86_64": prism.js
Step #6 - "compile-libfuzzer-introspector-x86_64": result.json
Step #6 - "compile-libfuzzer-introspector-x86_64": styles.css
Step #6 - "compile-libfuzzer-introspector-x86_64": summary.json
Step #6 - "compile-libfuzzer-introspector-x86_64": test-files.json
Step #6 - "compile-libfuzzer-introspector-x86_64": light/
Step #6 - "compile-libfuzzer-introspector-x86_64": light/all_files.json
Step #6 - "compile-libfuzzer-introspector-x86_64": light/all_pairs.json
Step #6 - "compile-libfuzzer-introspector-x86_64": light/all_tests.json
Step #6 - "compile-libfuzzer-introspector-x86_64": light/source_files/
Step #6 - "compile-libfuzzer-introspector-x86_64": light/source_files/src/
Step #6 - "compile-libfuzzer-introspector-x86_64": light/source_files/src/leveldb/
Step #6 - "compile-libfuzzer-introspector-x86_64": light/source_files/src/leveldb/fuzz_db.cc
Step #6 - "compile-libfuzzer-introspector-x86_64": light/source_files/src/leveldb/benchmarks/
Step #6 - "compile-libfuzzer-introspector-x86_64": light/source_files/src/leveldb/benchmarks/db_bench.cc
Step #6 - "compile-libfuzzer-introspector-x86_64": light/source_files/src/leveldb/benchmarks/db_bench_log.cc
Step #6 - "compile-libfuzzer-introspector-x86_64": light/source_files/src/leveldb/benchmarks/db_bench_sqlite3.cc
Step #6 - "compile-libfuzzer-introspector-x86_64": light/source_files/src/leveldb/benchmarks/db_bench_tree_db.cc
Step #6 - "compile-libfuzzer-introspector-x86_64": light/source_files/src/leveldb/db/
Step #6 - "compile-libfuzzer-introspector-x86_64": light/source_files/src/leveldb/db/autocompact_test.cc
Step #6 - "compile-libfuzzer-introspector-x86_64": light/source_files/src/leveldb/db/builder.cc
Step #6 - "compile-libfuzzer-introspector-x86_64": light/source_files/src/leveldb/db/builder.h
Step #6 - "compile-libfuzzer-introspector-x86_64": light/source_files/src/leveldb/db/c.cc
Step #6 - "compile-libfuzzer-introspector-x86_64": light/source_files/src/leveldb/db/c_test.c
Step #6 - "compile-libfuzzer-introspector-x86_64": light/source_files/src/leveldb/db/corruption_test.cc
Step #6 - "compile-libfuzzer-introspector-x86_64": light/source_files/src/leveldb/db/db_impl.cc
Step #6 - "compile-libfuzzer-introspector-x86_64": light/source_files/src/leveldb/db/db_impl.h
Step #6 - "compile-libfuzzer-introspector-x86_64": light/source_files/src/leveldb/db/db_iter.cc
Step #6 - "compile-libfuzzer-introspector-x86_64": light/source_files/src/leveldb/db/db_iter.h
Step #6 - "compile-libfuzzer-introspector-x86_64": light/source_files/src/leveldb/db/db_test.cc
Step #6 - "compile-libfuzzer-introspector-x86_64": light/source_files/src/leveldb/db/dbformat.cc
Step #6 - "compile-libfuzzer-introspector-x86_64": light/source_files/src/leveldb/db/dbformat.h
Step #6 - "compile-libfuzzer-introspector-x86_64": light/source_files/src/leveldb/db/dbformat_test.cc
Step #6 - "compile-libfuzzer-introspector-x86_64": light/source_files/src/leveldb/db/dumpfile.cc
Step #6 - "compile-libfuzzer-introspector-x86_64": light/source_files/src/leveldb/db/fault_injection_test.cc
Step #6 - "compile-libfuzzer-introspector-x86_64": light/source_files/src/leveldb/db/filename.cc
Step #6 - "compile-libfuzzer-introspector-x86_64": light/source_files/src/leveldb/db/filename.h
Step #6 - "compile-libfuzzer-introspector-x86_64": light/source_files/src/leveldb/db/filename_test.cc
Step #6 - "compile-libfuzzer-introspector-x86_64": light/source_files/src/leveldb/db/leveldbutil.cc
Step #6 - "compile-libfuzzer-introspector-x86_64": light/source_files/src/leveldb/db/log_format.h
Step #6 - "compile-libfuzzer-introspector-x86_64": light/source_files/src/leveldb/db/log_reader.cc
Step #6 - "compile-libfuzzer-introspector-x86_64": light/source_files/src/leveldb/db/log_reader.h
Step #6 - "compile-libfuzzer-introspector-x86_64": light/source_files/src/leveldb/db/log_test.cc
Step #6 - "compile-libfuzzer-introspector-x86_64": light/source_files/src/leveldb/db/log_writer.cc
Step #6 - "compile-libfuzzer-introspector-x86_64": light/source_files/src/leveldb/db/log_writer.h
Step #6 - "compile-libfuzzer-introspector-x86_64": light/source_files/src/leveldb/db/memtable.cc
Step #6 - "compile-libfuzzer-introspector-x86_64": light/source_files/src/leveldb/db/memtable.h
Step #6 - "compile-libfuzzer-introspector-x86_64": light/source_files/src/leveldb/db/recovery_test.cc
Step #6 - "compile-libfuzzer-introspector-x86_64": light/source_files/src/leveldb/db/repair.cc
Step #6 - "compile-libfuzzer-introspector-x86_64": light/source_files/src/leveldb/db/skiplist.h
Step #6 - "compile-libfuzzer-introspector-x86_64": light/source_files/src/leveldb/db/skiplist_test.cc
Step #6 - "compile-libfuzzer-introspector-x86_64": light/source_files/src/leveldb/db/snapshot.h
Step #6 - "compile-libfuzzer-introspector-x86_64": light/source_files/src/leveldb/db/table_cache.cc
Step #6 - "compile-libfuzzer-introspector-x86_64": light/source_files/src/leveldb/db/table_cache.h
Step #6 - "compile-libfuzzer-introspector-x86_64": light/source_files/src/leveldb/db/version_edit.cc
Step #6 - "compile-libfuzzer-introspector-x86_64": light/source_files/src/leveldb/db/version_edit.h
Step #6 - "compile-libfuzzer-introspector-x86_64": light/source_files/src/leveldb/db/version_edit_test.cc
Step #6 - "compile-libfuzzer-introspector-x86_64": light/source_files/src/leveldb/db/version_set.cc
Step #6 - "compile-libfuzzer-introspector-x86_64": light/source_files/src/leveldb/db/version_set.h
Step #6 - "compile-libfuzzer-introspector-x86_64": light/source_files/src/leveldb/db/version_set_test.cc
Step #6 - "compile-libfuzzer-introspector-x86_64": light/source_files/src/leveldb/db/write_batch.cc
Step #6 - "compile-libfuzzer-introspector-x86_64": light/source_files/src/leveldb/db/write_batch_internal.h
Step #6 - "compile-libfuzzer-introspector-x86_64": light/source_files/src/leveldb/db/write_batch_test.cc
Step #6 - "compile-libfuzzer-introspector-x86_64": light/source_files/src/leveldb/helpers/
Step #6 - "compile-libfuzzer-introspector-x86_64": light/source_files/src/leveldb/helpers/memenv/
Step #6 - "compile-libfuzzer-introspector-x86_64": light/source_files/src/leveldb/helpers/memenv/memenv.cc
Step #6 - "compile-libfuzzer-introspector-x86_64": light/source_files/src/leveldb/helpers/memenv/memenv.h
Step #6 - "compile-libfuzzer-introspector-x86_64": light/source_files/src/leveldb/helpers/memenv/memenv_test.cc
Step #6 - "compile-libfuzzer-introspector-x86_64": light/source_files/src/leveldb/include/
Step #6 - "compile-libfuzzer-introspector-x86_64": light/source_files/src/leveldb/include/leveldb/
Step #6 - "compile-libfuzzer-introspector-x86_64": light/source_files/src/leveldb/include/leveldb/c.h
Step #6 - "compile-libfuzzer-introspector-x86_64": light/source_files/src/leveldb/include/leveldb/cache.h
Step #6 - "compile-libfuzzer-introspector-x86_64": light/source_files/src/leveldb/include/leveldb/comparator.h
Step #6 - "compile-libfuzzer-introspector-x86_64": light/source_files/src/leveldb/include/leveldb/db.h
Step #6 - "compile-libfuzzer-introspector-x86_64": light/source_files/src/leveldb/include/leveldb/dumpfile.h
Step #6 - "compile-libfuzzer-introspector-x86_64": light/source_files/src/leveldb/include/leveldb/env.h
Step #6 - "compile-libfuzzer-introspector-x86_64": light/source_files/src/leveldb/include/leveldb/export.h
Step #6 - "compile-libfuzzer-introspector-x86_64": light/source_files/src/leveldb/include/leveldb/filter_policy.h
Step #6 - "compile-libfuzzer-introspector-x86_64": light/source_files/src/leveldb/include/leveldb/iterator.h
Step #6 - "compile-libfuzzer-introspector-x86_64": light/source_files/src/leveldb/include/leveldb/options.h
Step #6 - "compile-libfuzzer-introspector-x86_64": light/source_files/src/leveldb/include/leveldb/slice.h
Step #6 - "compile-libfuzzer-introspector-x86_64": light/source_files/src/leveldb/include/leveldb/status.h
Step #6 - "compile-libfuzzer-introspector-x86_64": light/source_files/src/leveldb/include/leveldb/table.h
Step #6 - "compile-libfuzzer-introspector-x86_64": light/source_files/src/leveldb/include/leveldb/table_builder.h
Step #6 - "compile-libfuzzer-introspector-x86_64": light/source_files/src/leveldb/include/leveldb/write_batch.h
Step #6 - "compile-libfuzzer-introspector-x86_64": light/source_files/src/leveldb/issues/
Step #6 - "compile-libfuzzer-introspector-x86_64": light/source_files/src/leveldb/issues/issue178_test.cc
Step #6 - "compile-libfuzzer-introspector-x86_64": light/source_files/src/leveldb/issues/issue200_test.cc
Step #6 - "compile-libfuzzer-introspector-x86_64": light/source_files/src/leveldb/issues/issue320_test.cc
Step #6 - "compile-libfuzzer-introspector-x86_64": light/source_files/src/leveldb/port/
Step #6 - "compile-libfuzzer-introspector-x86_64": light/source_files/src/leveldb/port/port.h
Step #6 - "compile-libfuzzer-introspector-x86_64": light/source_files/src/leveldb/port/port_example.h
Step #6 - "compile-libfuzzer-introspector-x86_64": light/source_files/src/leveldb/port/port_stdcxx.h
Step #6 - "compile-libfuzzer-introspector-x86_64": light/source_files/src/leveldb/port/thread_annotations.h
Step #6 - "compile-libfuzzer-introspector-x86_64": light/source_files/src/leveldb/table/
Step #6 - "compile-libfuzzer-introspector-x86_64": light/source_files/src/leveldb/table/block.cc
Step #6 - "compile-libfuzzer-introspector-x86_64": light/source_files/src/leveldb/table/block.h
Step #6 - "compile-libfuzzer-introspector-x86_64": light/source_files/src/leveldb/table/block_builder.cc
Step #6 - "compile-libfuzzer-introspector-x86_64": light/source_files/src/leveldb/table/block_builder.h
Step #6 - "compile-libfuzzer-introspector-x86_64": light/source_files/src/leveldb/table/filter_block.cc
Step #6 - "compile-libfuzzer-introspector-x86_64": light/source_files/src/leveldb/table/filter_block.h
Step #6 - "compile-libfuzzer-introspector-x86_64": light/source_files/src/leveldb/table/filter_block_test.cc
Step #6 - "compile-libfuzzer-introspector-x86_64": light/source_files/src/leveldb/table/format.cc
Step #6 - "compile-libfuzzer-introspector-x86_64": light/source_files/src/leveldb/table/format.h
Step #6 - "compile-libfuzzer-introspector-x86_64": light/source_files/src/leveldb/table/iterator.cc
Step #6 - "compile-libfuzzer-introspector-x86_64": light/source_files/src/leveldb/table/iterator_wrapper.h
Step #6 - "compile-libfuzzer-introspector-x86_64": light/source_files/src/leveldb/table/merger.cc
Step #6 - "compile-libfuzzer-introspector-x86_64": light/source_files/src/leveldb/table/merger.h
Step #6 - "compile-libfuzzer-introspector-x86_64": light/source_files/src/leveldb/table/table.cc
Step #6 - "compile-libfuzzer-introspector-x86_64": light/source_files/src/leveldb/table/table_builder.cc
Step #6 - "compile-libfuzzer-introspector-x86_64": light/source_files/src/leveldb/table/table_test.cc
Step #6 - "compile-libfuzzer-introspector-x86_64": light/source_files/src/leveldb/table/two_level_iterator.cc
Step #6 - "compile-libfuzzer-introspector-x86_64": light/source_files/src/leveldb/table/two_level_iterator.h
Step #6 - "compile-libfuzzer-introspector-x86_64": light/source_files/src/leveldb/util/
Step #6 - "compile-libfuzzer-introspector-x86_64": light/source_files/src/leveldb/util/arena.cc
Step #6 - "compile-libfuzzer-introspector-x86_64": light/source_files/src/leveldb/util/arena.h
Step #6 - "compile-libfuzzer-introspector-x86_64": light/source_files/src/leveldb/util/arena_test.cc
Step #6 - "compile-libfuzzer-introspector-x86_64": light/source_files/src/leveldb/util/bloom.cc
Step #6 - "compile-libfuzzer-introspector-x86_64": light/source_files/src/leveldb/util/bloom_test.cc
Step #6 - "compile-libfuzzer-introspector-x86_64": light/source_files/src/leveldb/util/cache.cc
Step #6 - "compile-libfuzzer-introspector-x86_64": light/source_files/src/leveldb/util/cache_test.cc
Step #6 - "compile-libfuzzer-introspector-x86_64": light/source_files/src/leveldb/util/coding.cc
Step #6 - "compile-libfuzzer-introspector-x86_64": light/source_files/src/leveldb/util/coding.h
Step #6 - "compile-libfuzzer-introspector-x86_64": light/source_files/src/leveldb/util/coding_test.cc
Step #6 - "compile-libfuzzer-introspector-x86_64": light/source_files/src/leveldb/util/comparator.cc
Step #6 - "compile-libfuzzer-introspector-x86_64": light/source_files/src/leveldb/util/crc32c.cc
Step #6 - "compile-libfuzzer-introspector-x86_64": light/source_files/src/leveldb/util/crc32c.h
Step #6 - "compile-libfuzzer-introspector-x86_64": light/source_files/src/leveldb/util/crc32c_test.cc
Step #6 - "compile-libfuzzer-introspector-x86_64": light/source_files/src/leveldb/util/env.cc
Step #6 - "compile-libfuzzer-introspector-x86_64": light/source_files/src/leveldb/util/env_posix.cc
Step #6 - "compile-libfuzzer-introspector-x86_64": light/source_files/src/leveldb/util/env_posix_test.cc
Step #6 - "compile-libfuzzer-introspector-x86_64": light/source_files/src/leveldb/util/env_posix_test_helper.h
Step #6 - "compile-libfuzzer-introspector-x86_64": light/source_files/src/leveldb/util/env_test.cc
Step #6 - "compile-libfuzzer-introspector-x86_64": light/source_files/src/leveldb/util/env_windows.cc
Step #6 - "compile-libfuzzer-introspector-x86_64": light/source_files/src/leveldb/util/env_windows_test.cc
Step #6 - "compile-libfuzzer-introspector-x86_64": light/source_files/src/leveldb/util/env_windows_test_helper.h
Step #6 - "compile-libfuzzer-introspector-x86_64": light/source_files/src/leveldb/util/filter_policy.cc
Step #6 - "compile-libfuzzer-introspector-x86_64": light/source_files/src/leveldb/util/hash.cc
Step #6 - "compile-libfuzzer-introspector-x86_64": light/source_files/src/leveldb/util/hash.h
Step #6 - "compile-libfuzzer-introspector-x86_64": light/source_files/src/leveldb/util/hash_test.cc
Step #6 - "compile-libfuzzer-introspector-x86_64": light/source_files/src/leveldb/util/histogram.cc
Step #6 - "compile-libfuzzer-introspector-x86_64": light/source_files/src/leveldb/util/histogram.h
Step #6 - "compile-libfuzzer-introspector-x86_64": light/source_files/src/leveldb/util/logging.cc
Step #6 - "compile-libfuzzer-introspector-x86_64": light/source_files/src/leveldb/util/logging.h
Step #6 - "compile-libfuzzer-introspector-x86_64": light/source_files/src/leveldb/util/logging_test.cc
Step #6 - "compile-libfuzzer-introspector-x86_64": light/source_files/src/leveldb/util/mutexlock.h
Step #6 - "compile-libfuzzer-introspector-x86_64": light/source_files/src/leveldb/util/no_destructor.h
Step #6 - "compile-libfuzzer-introspector-x86_64": light/source_files/src/leveldb/util/no_destructor_test.cc
Step #6 - "compile-libfuzzer-introspector-x86_64": light/source_files/src/leveldb/util/options.cc
Step #6 - "compile-libfuzzer-introspector-x86_64": light/source_files/src/leveldb/util/posix_logger.h
Step #6 - "compile-libfuzzer-introspector-x86_64": light/source_files/src/leveldb/util/random.h
Step #6 - "compile-libfuzzer-introspector-x86_64": light/source_files/src/leveldb/util/status.cc
Step #6 - "compile-libfuzzer-introspector-x86_64": light/source_files/src/leveldb/util/status_test.cc
Step #6 - "compile-libfuzzer-introspector-x86_64": light/source_files/src/leveldb/util/testutil.cc
Step #6 - "compile-libfuzzer-introspector-x86_64": light/source_files/src/leveldb/util/testutil.h
Step #6 - "compile-libfuzzer-introspector-x86_64": light/source_files/src/leveldb/util/windows_logger.h
Step #6 - "compile-libfuzzer-introspector-x86_64": source-code/
Step #6 - "compile-libfuzzer-introspector-x86_64": source-code/src/
Step #6 - "compile-libfuzzer-introspector-x86_64": source-code/src/leveldb/
Step #6 - "compile-libfuzzer-introspector-x86_64": source-code/src/leveldb/fuzz_db.cc
Step #6 - "compile-libfuzzer-introspector-x86_64": source-code/src/leveldb/benchmarks/
Step #6 - "compile-libfuzzer-introspector-x86_64": source-code/src/leveldb/benchmarks/db_bench.cc
Step #6 - "compile-libfuzzer-introspector-x86_64": source-code/src/leveldb/benchmarks/db_bench_log.cc
Step #6 - "compile-libfuzzer-introspector-x86_64": source-code/src/leveldb/benchmarks/db_bench_sqlite3.cc
Step #6 - "compile-libfuzzer-introspector-x86_64": source-code/src/leveldb/benchmarks/db_bench_tree_db.cc
Step #6 - "compile-libfuzzer-introspector-x86_64": source-code/src/leveldb/db/
Step #6 - "compile-libfuzzer-introspector-x86_64": source-code/src/leveldb/db/autocompact_test.cc
Step #6 - "compile-libfuzzer-introspector-x86_64": source-code/src/leveldb/db/builder.cc
Step #6 - "compile-libfuzzer-introspector-x86_64": source-code/src/leveldb/db/builder.h
Step #6 - "compile-libfuzzer-introspector-x86_64": source-code/src/leveldb/db/c.cc
Step #6 - "compile-libfuzzer-introspector-x86_64": source-code/src/leveldb/db/c_test.c
Step #6 - "compile-libfuzzer-introspector-x86_64": source-code/src/leveldb/db/corruption_test.cc
Step #6 - "compile-libfuzzer-introspector-x86_64": source-code/src/leveldb/db/db_impl.cc
Step #6 - "compile-libfuzzer-introspector-x86_64": source-code/src/leveldb/db/db_impl.h
Step #6 - "compile-libfuzzer-introspector-x86_64": source-code/src/leveldb/db/db_iter.cc
Step #6 - "compile-libfuzzer-introspector-x86_64": source-code/src/leveldb/db/db_iter.h
Step #6 - "compile-libfuzzer-introspector-x86_64": source-code/src/leveldb/db/db_test.cc
Step #6 - "compile-libfuzzer-introspector-x86_64": source-code/src/leveldb/db/dbformat.cc
Step #6 - "compile-libfuzzer-introspector-x86_64": source-code/src/leveldb/db/dbformat.h
Step #6 - "compile-libfuzzer-introspector-x86_64": source-code/src/leveldb/db/dbformat_test.cc
Step #6 - "compile-libfuzzer-introspector-x86_64": source-code/src/leveldb/db/dumpfile.cc
Step #6 - "compile-libfuzzer-introspector-x86_64": source-code/src/leveldb/db/fault_injection_test.cc
Step #6 - "compile-libfuzzer-introspector-x86_64": source-code/src/leveldb/db/filename.cc
Step #6 - "compile-libfuzzer-introspector-x86_64": source-code/src/leveldb/db/filename.h
Step #6 - "compile-libfuzzer-introspector-x86_64": source-code/src/leveldb/db/filename_test.cc
Step #6 - "compile-libfuzzer-introspector-x86_64": source-code/src/leveldb/db/leveldbutil.cc
Step #6 - "compile-libfuzzer-introspector-x86_64": source-code/src/leveldb/db/log_format.h
Step #6 - "compile-libfuzzer-introspector-x86_64": source-code/src/leveldb/db/log_reader.cc
Step #6 - "compile-libfuzzer-introspector-x86_64": source-code/src/leveldb/db/log_reader.h
Step #6 - "compile-libfuzzer-introspector-x86_64": source-code/src/leveldb/db/log_test.cc
Step #6 - "compile-libfuzzer-introspector-x86_64": source-code/src/leveldb/db/log_writer.cc
Step #6 - "compile-libfuzzer-introspector-x86_64": source-code/src/leveldb/db/log_writer.h
Step #6 - "compile-libfuzzer-introspector-x86_64": source-code/src/leveldb/db/memtable.cc
Step #6 - "compile-libfuzzer-introspector-x86_64": source-code/src/leveldb/db/memtable.h
Step #6 - "compile-libfuzzer-introspector-x86_64": source-code/src/leveldb/db/recovery_test.cc
Step #6 - "compile-libfuzzer-introspector-x86_64": source-code/src/leveldb/db/repair.cc
Step #6 - "compile-libfuzzer-introspector-x86_64": source-code/src/leveldb/db/skiplist.h
Step #6 - "compile-libfuzzer-introspector-x86_64": source-code/src/leveldb/db/skiplist_test.cc
Step #6 - "compile-libfuzzer-introspector-x86_64": source-code/src/leveldb/db/snapshot.h
Step #6 - "compile-libfuzzer-introspector-x86_64": source-code/src/leveldb/db/table_cache.cc
Step #6 - "compile-libfuzzer-introspector-x86_64": source-code/src/leveldb/db/table_cache.h
Step #6 - "compile-libfuzzer-introspector-x86_64": source-code/src/leveldb/db/version_edit.cc
Step #6 - "compile-libfuzzer-introspector-x86_64": source-code/src/leveldb/db/version_edit.h
Step #6 - "compile-libfuzzer-introspector-x86_64": source-code/src/leveldb/db/version_edit_test.cc
Step #6 - "compile-libfuzzer-introspector-x86_64": source-code/src/leveldb/db/version_set.cc
Step #6 - "compile-libfuzzer-introspector-x86_64": source-code/src/leveldb/db/version_set.h
Step #6 - "compile-libfuzzer-introspector-x86_64": source-code/src/leveldb/db/version_set_test.cc
Step #6 - "compile-libfuzzer-introspector-x86_64": source-code/src/leveldb/db/write_batch.cc
Step #6 - "compile-libfuzzer-introspector-x86_64": source-code/src/leveldb/db/write_batch_internal.h
Step #6 - "compile-libfuzzer-introspector-x86_64": source-code/src/leveldb/db/write_batch_test.cc
Step #6 - "compile-libfuzzer-introspector-x86_64": source-code/src/leveldb/helpers/
Step #6 - "compile-libfuzzer-introspector-x86_64": source-code/src/leveldb/helpers/memenv/
Step #6 - "compile-libfuzzer-introspector-x86_64": source-code/src/leveldb/helpers/memenv/memenv.cc
Step #6 - "compile-libfuzzer-introspector-x86_64": source-code/src/leveldb/helpers/memenv/memenv.h
Step #6 - "compile-libfuzzer-introspector-x86_64": source-code/src/leveldb/helpers/memenv/memenv_test.cc
Step #6 - "compile-libfuzzer-introspector-x86_64": source-code/src/leveldb/include/
Step #6 - "compile-libfuzzer-introspector-x86_64": source-code/src/leveldb/include/leveldb/
Step #6 - "compile-libfuzzer-introspector-x86_64": source-code/src/leveldb/include/leveldb/c.h
Step #6 - "compile-libfuzzer-introspector-x86_64": source-code/src/leveldb/include/leveldb/cache.h
Step #6 - "compile-libfuzzer-introspector-x86_64": source-code/src/leveldb/include/leveldb/comparator.h
Step #6 - "compile-libfuzzer-introspector-x86_64": source-code/src/leveldb/include/leveldb/db.h
Step #6 - "compile-libfuzzer-introspector-x86_64": source-code/src/leveldb/include/leveldb/dumpfile.h
Step #6 - "compile-libfuzzer-introspector-x86_64": source-code/src/leveldb/include/leveldb/env.h
Step #6 - "compile-libfuzzer-introspector-x86_64": source-code/src/leveldb/include/leveldb/export.h
Step #6 - "compile-libfuzzer-introspector-x86_64": source-code/src/leveldb/include/leveldb/filter_policy.h
Step #6 - "compile-libfuzzer-introspector-x86_64": source-code/src/leveldb/include/leveldb/iterator.h
Step #6 - "compile-libfuzzer-introspector-x86_64": source-code/src/leveldb/include/leveldb/options.h
Step #6 - "compile-libfuzzer-introspector-x86_64": source-code/src/leveldb/include/leveldb/slice.h
Step #6 - "compile-libfuzzer-introspector-x86_64": source-code/src/leveldb/include/leveldb/status.h
Step #6 - "compile-libfuzzer-introspector-x86_64": source-code/src/leveldb/include/leveldb/table.h
Step #6 - "compile-libfuzzer-introspector-x86_64": source-code/src/leveldb/include/leveldb/table_builder.h
Step #6 - "compile-libfuzzer-introspector-x86_64": source-code/src/leveldb/include/leveldb/write_batch.h
Step #6 - "compile-libfuzzer-introspector-x86_64": source-code/src/leveldb/issues/
Step #6 - "compile-libfuzzer-introspector-x86_64": source-code/src/leveldb/issues/issue178_test.cc
Step #6 - "compile-libfuzzer-introspector-x86_64": source-code/src/leveldb/issues/issue200_test.cc
Step #6 - "compile-libfuzzer-introspector-x86_64": source-code/src/leveldb/issues/issue320_test.cc
Step #6 - "compile-libfuzzer-introspector-x86_64": source-code/src/leveldb/port/
Step #6 - "compile-libfuzzer-introspector-x86_64": source-code/src/leveldb/port/port.h
Step #6 - "compile-libfuzzer-introspector-x86_64": source-code/src/leveldb/port/port_example.h
Step #6 - "compile-libfuzzer-introspector-x86_64": source-code/src/leveldb/port/port_stdcxx.h
Step #6 - "compile-libfuzzer-introspector-x86_64": source-code/src/leveldb/port/thread_annotations.h
Step #6 - "compile-libfuzzer-introspector-x86_64": source-code/src/leveldb/table/
Step #6 - "compile-libfuzzer-introspector-x86_64": source-code/src/leveldb/table/block.cc
Step #6 - "compile-libfuzzer-introspector-x86_64": source-code/src/leveldb/table/block.h
Step #6 - "compile-libfuzzer-introspector-x86_64": source-code/src/leveldb/table/block_builder.cc
Step #6 - "compile-libfuzzer-introspector-x86_64": source-code/src/leveldb/table/block_builder.h
Step #6 - "compile-libfuzzer-introspector-x86_64": source-code/src/leveldb/table/filter_block.cc
Step #6 - "compile-libfuzzer-introspector-x86_64": source-code/src/leveldb/table/filter_block.h
Step #6 - "compile-libfuzzer-introspector-x86_64": source-code/src/leveldb/table/filter_block_test.cc
Step #6 - "compile-libfuzzer-introspector-x86_64": source-code/src/leveldb/table/format.cc
Step #6 - "compile-libfuzzer-introspector-x86_64": source-code/src/leveldb/table/format.h
Step #6 - "compile-libfuzzer-introspector-x86_64": source-code/src/leveldb/table/iterator.cc
Step #6 - "compile-libfuzzer-introspector-x86_64": source-code/src/leveldb/table/iterator_wrapper.h
Step #6 - "compile-libfuzzer-introspector-x86_64": source-code/src/leveldb/table/merger.cc
Step #6 - "compile-libfuzzer-introspector-x86_64": source-code/src/leveldb/table/merger.h
Step #6 - "compile-libfuzzer-introspector-x86_64": source-code/src/leveldb/table/table.cc
Step #6 - "compile-libfuzzer-introspector-x86_64": source-code/src/leveldb/table/table_builder.cc
Step #6 - "compile-libfuzzer-introspector-x86_64": source-code/src/leveldb/table/table_test.cc
Step #6 - "compile-libfuzzer-introspector-x86_64": source-code/src/leveldb/table/two_level_iterator.cc
Step #6 - "compile-libfuzzer-introspector-x86_64": source-code/src/leveldb/table/two_level_iterator.h
Step #6 - "compile-libfuzzer-introspector-x86_64": source-code/src/leveldb/util/
Step #6 - "compile-libfuzzer-introspector-x86_64": source-code/src/leveldb/util/arena.cc
Step #6 - "compile-libfuzzer-introspector-x86_64": source-code/src/leveldb/util/arena.h
Step #6 - "compile-libfuzzer-introspector-x86_64": source-code/src/leveldb/util/arena_test.cc
Step #6 - "compile-libfuzzer-introspector-x86_64": source-code/src/leveldb/util/bloom.cc
Step #6 - "compile-libfuzzer-introspector-x86_64": source-code/src/leveldb/util/bloom_test.cc
Step #6 - "compile-libfuzzer-introspector-x86_64": source-code/src/leveldb/util/cache.cc
Step #6 - "compile-libfuzzer-introspector-x86_64": source-code/src/leveldb/util/cache_test.cc
Step #6 - "compile-libfuzzer-introspector-x86_64": source-code/src/leveldb/util/coding.cc
Step #6 - "compile-libfuzzer-introspector-x86_64": source-code/src/leveldb/util/coding.h
Step #6 - "compile-libfuzzer-introspector-x86_64": source-code/src/leveldb/util/coding_test.cc
Step #6 - "compile-libfuzzer-introspector-x86_64": source-code/src/leveldb/util/comparator.cc
Step #6 - "compile-libfuzzer-introspector-x86_64": source-code/src/leveldb/util/crc32c.cc
Step #6 - "compile-libfuzzer-introspector-x86_64": source-code/src/leveldb/util/crc32c.h
Step #6 - "compile-libfuzzer-introspector-x86_64": source-code/src/leveldb/util/crc32c_test.cc
Step #6 - "compile-libfuzzer-introspector-x86_64": source-code/src/leveldb/util/env.cc
Step #6 - "compile-libfuzzer-introspector-x86_64": source-code/src/leveldb/util/env_posix.cc
Step #6 - "compile-libfuzzer-introspector-x86_64": source-code/src/leveldb/util/env_posix_test.cc
Step #6 - "compile-libfuzzer-introspector-x86_64": source-code/src/leveldb/util/env_posix_test_helper.h
Step #6 - "compile-libfuzzer-introspector-x86_64": source-code/src/leveldb/util/env_test.cc
Step #6 - "compile-libfuzzer-introspector-x86_64": source-code/src/leveldb/util/env_windows.cc
Step #6 - "compile-libfuzzer-introspector-x86_64": source-code/src/leveldb/util/env_windows_test.cc
Step #6 - "compile-libfuzzer-introspector-x86_64": source-code/src/leveldb/util/env_windows_test_helper.h
Step #6 - "compile-libfuzzer-introspector-x86_64": source-code/src/leveldb/util/filter_policy.cc
Step #6 - "compile-libfuzzer-introspector-x86_64": source-code/src/leveldb/util/hash.cc
Step #6 - "compile-libfuzzer-introspector-x86_64": source-code/src/leveldb/util/hash.h
Step #6 - "compile-libfuzzer-introspector-x86_64": source-code/src/leveldb/util/hash_test.cc
Step #6 - "compile-libfuzzer-introspector-x86_64": source-code/src/leveldb/util/histogram.cc
Step #6 - "compile-libfuzzer-introspector-x86_64": source-code/src/leveldb/util/histogram.h
Step #6 - "compile-libfuzzer-introspector-x86_64": source-code/src/leveldb/util/logging.cc
Step #6 - "compile-libfuzzer-introspector-x86_64": source-code/src/leveldb/util/logging.h
Step #6 - "compile-libfuzzer-introspector-x86_64": source-code/src/leveldb/util/logging_test.cc
Step #6 - "compile-libfuzzer-introspector-x86_64": source-code/src/leveldb/util/mutexlock.h
Step #6 - "compile-libfuzzer-introspector-x86_64": source-code/src/leveldb/util/no_destructor.h
Step #6 - "compile-libfuzzer-introspector-x86_64": source-code/src/leveldb/util/no_destructor_test.cc
Step #6 - "compile-libfuzzer-introspector-x86_64": source-code/src/leveldb/util/options.cc
Step #6 - "compile-libfuzzer-introspector-x86_64": source-code/src/leveldb/util/posix_logger.h
Step #6 - "compile-libfuzzer-introspector-x86_64": source-code/src/leveldb/util/random.h
Step #6 - "compile-libfuzzer-introspector-x86_64": source-code/src/leveldb/util/status.cc
Step #6 - "compile-libfuzzer-introspector-x86_64": source-code/src/leveldb/util/status_test.cc
Step #6 - "compile-libfuzzer-introspector-x86_64": source-code/src/leveldb/util/testutil.cc
Step #6 - "compile-libfuzzer-introspector-x86_64": source-code/src/leveldb/util/testutil.h
Step #6 - "compile-libfuzzer-introspector-x86_64": source-code/src/leveldb/util/windows_logger.h
Step #6 - "compile-libfuzzer-introspector-x86_64": source-code/workspace/
Step #6 - "compile-libfuzzer-introspector-x86_64": source-code/workspace/oss-fuzz/
Step #6 - "compile-libfuzzer-introspector-x86_64": source-code/workspace/oss-fuzz/projects/
Step #6 - "compile-libfuzzer-introspector-x86_64": source-code/workspace/oss-fuzz/projects/example/
Step #6 - "compile-libfuzzer-introspector-x86_64": source-code/workspace/oss-fuzz/projects/example/my-api-repo/
Step #6 - "compile-libfuzzer-introspector-x86_64": source-code/workspace/oss-fuzz/projects/example/my-api-repo/do_stuff_unittest.cpp
Step #6 - "compile-libfuzzer-introspector-x86_64": source-code/workspace/oss-fuzz/projects/tinyxml2/
Step #6 - "compile-libfuzzer-introspector-x86_64": source-code/workspace/oss-fuzz/projects/tinyxml2/xmltest.cpp
Step #6 - "compile-libfuzzer-introspector-x86_64": source-code/workspace/oss-fuzz/projects/tinyxml2/xmltest2.cpp
Step #6 - "compile-libfuzzer-introspector-x86_64": source-code/workspace/oss-fuzz/projects/upx/
Step #6 - "compile-libfuzzer-introspector-x86_64": source-code/workspace/oss-fuzz/projects/upx/fuzzers/
Step #6 - "compile-libfuzzer-introspector-x86_64": source-code/workspace/oss-fuzz/projects/upx/fuzzers/test_packed_file_fuzzer.cpp
Step #6 - "compile-libfuzzer-introspector-x86_64":
Step #6 - "compile-libfuzzer-introspector-x86_64": sent 31,183,974 bytes received 5,943 bytes 62,379,834.00 bytes/sec
Step #6 - "compile-libfuzzer-introspector-x86_64": total size is 31,155,496 speedup is 1.00
Step #6 - "compile-libfuzzer-introspector-x86_64": ---------------------------------------------------------------
Step #6 - "compile-libfuzzer-introspector-x86_64": CC=clang
Step #6 - "compile-libfuzzer-introspector-x86_64": CXX=clang++
Step #6 - "compile-libfuzzer-introspector-x86_64": CFLAGS=-O1 -fno-omit-frame-pointer -gline-tables-only -Wno-error=enum-constexpr-conversion -Wno-error=incompatible-function-pointer-types -Wno-error=int-conversion -Wno-error=deprecated-declarations -Wno-error=implicit-function-declaration -Wno-error=implicit-int -Wno-error=vla-cxx-extension -DFUZZING_BUILD_MODE_UNSAFE_FOR_PRODUCTION -O0 -flto -fno-inline-functions -fuse-ld=gold -Wno-unused-command-line-argument -fsanitize=fuzzer-no-link -g
Step #6 - "compile-libfuzzer-introspector-x86_64": CXXFLAGS=-O1 -fno-omit-frame-pointer -gline-tables-only -Wno-error=enum-constexpr-conversion -Wno-error=incompatible-function-pointer-types -Wno-error=int-conversion -Wno-error=deprecated-declarations -Wno-error=implicit-function-declaration -Wno-error=implicit-int -Wno-error=vla-cxx-extension -DFUZZING_BUILD_MODE_UNSAFE_FOR_PRODUCTION -O0 -flto -fno-inline-functions -fuse-ld=gold -Wno-unused-command-line-argument -fsanitize=fuzzer-no-link -stdlib=libc++ -g
Step #6 - "compile-libfuzzer-introspector-x86_64": RUSTFLAGS=-Cdebuginfo=2 -Cforce-frame-pointers
Step #6 - "compile-libfuzzer-introspector-x86_64": ---------------------------------------------------------------
Step #6 - "compile-libfuzzer-introspector-x86_64": + CFLAGS='-O1 -fno-omit-frame-pointer -gline-tables-only -Wno-error=enum-constexpr-conversion -Wno-error=incompatible-function-pointer-types -Wno-error=int-conversion -Wno-error=deprecated-declarations -Wno-error=implicit-function-declaration -Wno-error=implicit-int -Wno-error=vla-cxx-extension -DFUZZING_BUILD_MODE_UNSAFE_FOR_PRODUCTION -O0 -flto -fno-inline-functions -fuse-ld=gold -Wno-unused-command-line-argument -fsanitize=fuzzer-no-link -g -fno-sanitize=vptr'
Step #6 - "compile-libfuzzer-introspector-x86_64": + CXXFLAGS='-O1 -fno-omit-frame-pointer -gline-tables-only -Wno-error=enum-constexpr-conversion -Wno-error=incompatible-function-pointer-types -Wno-error=int-conversion -Wno-error=deprecated-declarations -Wno-error=implicit-function-declaration -Wno-error=implicit-int -Wno-error=vla-cxx-extension -DFUZZING_BUILD_MODE_UNSAFE_FOR_PRODUCTION -O0 -flto -fno-inline-functions -fuse-ld=gold -Wno-unused-command-line-argument -fsanitize=fuzzer-no-link -stdlib=libc++ -g -fno-sanitize=vptr'
Step #6 - "compile-libfuzzer-introspector-x86_64": + CXXFLAGS='-O1 -fno-omit-frame-pointer -gline-tables-only -Wno-error=enum-constexpr-conversion -Wno-error=incompatible-function-pointer-types -Wno-error=int-conversion -Wno-error=deprecated-declarations -Wno-error=implicit-function-declaration -Wno-error=implicit-int -Wno-error=vla-cxx-extension -DFUZZING_BUILD_MODE_UNSAFE_FOR_PRODUCTION -O0 -flto -fno-inline-functions -fuse-ld=gold -Wno-unused-command-line-argument -fsanitize=fuzzer-no-link -stdlib=libc++ -g -fno-sanitize=vptr -std=c++17'
Step #6 - "compile-libfuzzer-introspector-x86_64": + cd /src/leveldb
Step #6 - "compile-libfuzzer-introspector-x86_64": + mkdir -p build
Step #6 - "compile-libfuzzer-introspector-x86_64": + cd build
Step #6 - "compile-libfuzzer-introspector-x86_64": + cmake -DCMAKE_BUILD_TYPE=Release -DLEVELDB_BUILD_TESTS=0 -DLEVELDB_BUILD_BENCHMARKS=0 ..
Step #6 - "compile-libfuzzer-introspector-x86_64": -- The C compiler identification is Clang 18.1.8
Step #6 - "compile-libfuzzer-introspector-x86_64": -- The CXX compiler identification is Clang 18.1.8
Step #6 - "compile-libfuzzer-introspector-x86_64": -- Detecting C compiler ABI info
Step #6 - "compile-libfuzzer-introspector-x86_64": -- Detecting C compiler ABI info - done
Step #6 - "compile-libfuzzer-introspector-x86_64": -- Check for working C compiler: /usr/local/bin/clang - skipped
Step #6 - "compile-libfuzzer-introspector-x86_64": -- Detecting C compile features
Step #6 - "compile-libfuzzer-introspector-x86_64": -- Detecting C compile features - done
Step #6 - "compile-libfuzzer-introspector-x86_64": -- Detecting CXX compiler ABI info
Step #6 - "compile-libfuzzer-introspector-x86_64": -- Detecting CXX compiler ABI info - done
Step #6 - "compile-libfuzzer-introspector-x86_64": -- Check for working CXX compiler: /usr/local/bin/clang++ - skipped
Step #6 - "compile-libfuzzer-introspector-x86_64": -- Detecting CXX compile features
Step #6 - "compile-libfuzzer-introspector-x86_64": -- Detecting CXX compile features - done
Step #6 - "compile-libfuzzer-introspector-x86_64": -- Looking for unistd.h
Step #6 - "compile-libfuzzer-introspector-x86_64": -- Looking for unistd.h - found
Step #6 - "compile-libfuzzer-introspector-x86_64": -- Looking for crc32c_value in crc32c
Step #6 - "compile-libfuzzer-introspector-x86_64": -- Looking for crc32c_value in crc32c - not found
Step #6 - "compile-libfuzzer-introspector-x86_64": -- Looking for snappy_compress in snappy
Step #6 - "compile-libfuzzer-introspector-x86_64": -- Looking for snappy_compress in snappy - not found
Step #6 - "compile-libfuzzer-introspector-x86_64": -- Looking for zstd_compress in zstd
Step #6 - "compile-libfuzzer-introspector-x86_64": -- Looking for zstd_compress in zstd - not found
Step #6 - "compile-libfuzzer-introspector-x86_64": -- Looking for malloc in tcmalloc
Step #6 - "compile-libfuzzer-introspector-x86_64": -- Looking for malloc in tcmalloc - not found
Step #6 - "compile-libfuzzer-introspector-x86_64": -- Looking for fdatasync
Step #6 - "compile-libfuzzer-introspector-x86_64": -- Looking for fdatasync - found
Step #6 - "compile-libfuzzer-introspector-x86_64": -- Looking for F_FULLFSYNC
Step #6 - "compile-libfuzzer-introspector-x86_64": -- Looking for F_FULLFSYNC - not found
Step #6 - "compile-libfuzzer-introspector-x86_64": -- Looking for O_CLOEXEC
Step #6 - "compile-libfuzzer-introspector-x86_64": -- Looking for O_CLOEXEC - found
Step #6 - "compile-libfuzzer-introspector-x86_64": -- Performing Test HAVE_CLANG_THREAD_SAFETY
Step #6 - "compile-libfuzzer-introspector-x86_64": -- Performing Test HAVE_CLANG_THREAD_SAFETY - Success
Step #6 - "compile-libfuzzer-introspector-x86_64": -- Performing Test LEVELDB_HAVE_NO_MISSING_FIELD_INITIALIZERS
Step #6 - "compile-libfuzzer-introspector-x86_64": -- Performing Test LEVELDB_HAVE_NO_MISSING_FIELD_INITIALIZERS - Success
Step #6 - "compile-libfuzzer-introspector-x86_64": -- Performing Test HAVE_CXX17_HAS_INCLUDE
Step #6 - "compile-libfuzzer-introspector-x86_64": -- Performing Test HAVE_CXX17_HAS_INCLUDE - Success
Step #6 - "compile-libfuzzer-introspector-x86_64": -- Performing Test CMAKE_HAVE_LIBC_PTHREAD
Step #6 - "compile-libfuzzer-introspector-x86_64": -- Performing Test CMAKE_HAVE_LIBC_PTHREAD - Success
Step #6 - "compile-libfuzzer-introspector-x86_64": -- Found Threads: TRUE
Step #6 - "compile-libfuzzer-introspector-x86_64": -- Configuring done (2.0s)
Step #6 - "compile-libfuzzer-introspector-x86_64": -- Generating done (0.0s)
Step #6 - "compile-libfuzzer-introspector-x86_64": -- Build files have been written to: /src/leveldb/build
Step #6 - "compile-libfuzzer-introspector-x86_64": + cmake --build .
Step #6 - "compile-libfuzzer-introspector-x86_64": [ 2%] [32mBuilding CXX object CMakeFiles/leveldb.dir/db/builder.cc.o[0m
Step #6 - "compile-libfuzzer-introspector-x86_64": [ 4%] [32mBuilding CXX object CMakeFiles/leveldb.dir/db/c.cc.o[0m
Step #6 - "compile-libfuzzer-introspector-x86_64": [ 7%] [32mBuilding CXX object CMakeFiles/leveldb.dir/db/db_impl.cc.o[0m
Step #6 - "compile-libfuzzer-introspector-x86_64": [ 9%] [32mBuilding CXX object CMakeFiles/leveldb.dir/db/db_iter.cc.o[0m
Step #6 - "compile-libfuzzer-introspector-x86_64": [ 12%] [32mBuilding CXX object CMakeFiles/leveldb.dir/db/dbformat.cc.o[0m
Step #6 - "compile-libfuzzer-introspector-x86_64": [ 14%] [32mBuilding CXX object CMakeFiles/leveldb.dir/db/dumpfile.cc.o[0m
Step #6 - "compile-libfuzzer-introspector-x86_64": [ 17%] [32mBuilding CXX object CMakeFiles/leveldb.dir/db/filename.cc.o[0m
Step #6 - "compile-libfuzzer-introspector-x86_64": [ 19%] [32mBuilding CXX object CMakeFiles/leveldb.dir/db/log_reader.cc.o[0m
Step #6 - "compile-libfuzzer-introspector-x86_64": [ 21%] [32mBuilding CXX object CMakeFiles/leveldb.dir/db/log_writer.cc.o[0m
Step #6 - "compile-libfuzzer-introspector-x86_64": [ 24%] [32mBuilding CXX object CMakeFiles/leveldb.dir/db/memtable.cc.o[0m
Step #6 - "compile-libfuzzer-introspector-x86_64": [ 26%] [32mBuilding CXX object CMakeFiles/leveldb.dir/db/repair.cc.o[0m
Step #6 - "compile-libfuzzer-introspector-x86_64": [ 29%] [32mBuilding CXX object CMakeFiles/leveldb.dir/db/table_cache.cc.o[0m
Step #6 - "compile-libfuzzer-introspector-x86_64": [ 31%] [32mBuilding CXX object CMakeFiles/leveldb.dir/db/version_edit.cc.o[0m
Step #6 - "compile-libfuzzer-introspector-x86_64": [ 34%] [32mBuilding CXX object CMakeFiles/leveldb.dir/db/version_set.cc.o[0m
Step #6 - "compile-libfuzzer-introspector-x86_64": [ 36%] [32mBuilding CXX object CMakeFiles/leveldb.dir/db/write_batch.cc.o[0m
Step #6 - "compile-libfuzzer-introspector-x86_64": [ 39%] [32mBuilding CXX object CMakeFiles/leveldb.dir/table/block_builder.cc.o[0m
Step #6 - "compile-libfuzzer-introspector-x86_64": [ 41%] [32mBuilding CXX object CMakeFiles/leveldb.dir/table/block.cc.o[0m
Step #6 - "compile-libfuzzer-introspector-x86_64": [ 43%] [32mBuilding CXX object CMakeFiles/leveldb.dir/table/filter_block.cc.o[0m
Step #6 - "compile-libfuzzer-introspector-x86_64": [ 46%] [32mBuilding CXX object CMakeFiles/leveldb.dir/table/format.cc.o[0m
Step #6 - "compile-libfuzzer-introspector-x86_64": [ 48%] [32mBuilding CXX object CMakeFiles/leveldb.dir/table/iterator.cc.o[0m
Step #6 - "compile-libfuzzer-introspector-x86_64": [ 51%] [32mBuilding CXX object CMakeFiles/leveldb.dir/table/merger.cc.o[0m
Step #6 - "compile-libfuzzer-introspector-x86_64": [ 53%] [32mBuilding CXX object CMakeFiles/leveldb.dir/table/table_builder.cc.o[0m
Step #6 - "compile-libfuzzer-introspector-x86_64": [ 56%] [32mBuilding CXX object CMakeFiles/leveldb.dir/table/table.cc.o[0m
Step #6 - "compile-libfuzzer-introspector-x86_64": [ 58%] [32mBuilding CXX object CMakeFiles/leveldb.dir/table/two_level_iterator.cc.o[0m
Step #6 - "compile-libfuzzer-introspector-x86_64": [ 60%] [32mBuilding CXX object CMakeFiles/leveldb.dir/util/arena.cc.o[0m
Step #6 - "compile-libfuzzer-introspector-x86_64": [ 63%] [32mBuilding CXX object CMakeFiles/leveldb.dir/util/bloom.cc.o[0m
Step #6 - "compile-libfuzzer-introspector-x86_64": [ 65%] [32mBuilding CXX object CMakeFiles/leveldb.dir/util/cache.cc.o[0m
Step #6 - "compile-libfuzzer-introspector-x86_64": [ 68%] [32mBuilding CXX object CMakeFiles/leveldb.dir/util/coding.cc.o[0m
Step #6 - "compile-libfuzzer-introspector-x86_64": [ 70%] [32mBuilding CXX object CMakeFiles/leveldb.dir/util/comparator.cc.o[0m
Step #6 - "compile-libfuzzer-introspector-x86_64": In file included from /src/leveldb/util/comparator.cc:14:
Step #6 - "compile-libfuzzer-introspector-x86_64": [1m/src/leveldb/./util/no_destructor.h:24:24: [0m[0;1;31merror: [0m[1mno template named 'is_standard_layout_v' in namespace 'std'; did you mean 'is_standard_layout'?[0m
Step #6 - "compile-libfuzzer-introspector-x86_64": 24 | static_assert(std::is_standard_layout_v>);[0m
Step #6 - "compile-libfuzzer-introspector-x86_64": | [0;1;32m ~~~~~^~~~~~~~~~~~~~~~~~~~
Step #6 - "compile-libfuzzer-introspector-x86_64": [0m | [0;32m is_standard_layout
Step #6 - "compile-libfuzzer-introspector-x86_64": [0m[1m/usr/local/bin/../include/c++/v1/__type_traits/is_standard_layout.h:22:29: [0m[0;1;36mnote: [0m'is_standard_layout' declared here[0m
Step #6 - "compile-libfuzzer-introspector-x86_64": 22 | struct _LIBCPP_TEMPLATE_VIS is_standard_layout : public integral_constant {};[0m
Step #6 - "compile-libfuzzer-introspector-x86_64": | [0;1;32m ^
Step #6 - "compile-libfuzzer-introspector-x86_64": [0mIn file included from /src/leveldb/util/comparator.cc:14:
Step #6 - "compile-libfuzzer-introspector-x86_64": [1m/src/leveldb/./util/no_destructor.h:24:72: [0m[0;1;31merror: [0m[1mexpected '(' for function-style cast or type construction[0m
Step #6 - "compile-libfuzzer-introspector-x86_64": 24 | static_assert(std::is_standard_layout_v>);[0m
Step #6 - "compile-libfuzzer-introspector-x86_64": | [0;1;32m ~~~~~~~~~~~~~~~~~~~~~~~~~~~~~~~~~~~~~~~~~~~~~~~~~~~~~^
Step #6 - "compile-libfuzzer-introspector-x86_64": [0m2 errors generated.
Step #6 - "compile-libfuzzer-introspector-x86_64": make[2]: *** [CMakeFiles/leveldb.dir/build.make:468: CMakeFiles/leveldb.dir/util/comparator.cc.o] Error 1
Step #6 - "compile-libfuzzer-introspector-x86_64": make[1]: *** [CMakeFiles/Makefile2:85: CMakeFiles/leveldb.dir/all] Error 2
Step #6 - "compile-libfuzzer-introspector-x86_64": make: *** [Makefile:136: all] Error 2
Step #6 - "compile-libfuzzer-introspector-x86_64": ********************************************************************************
Step #6 - "compile-libfuzzer-introspector-x86_64": Failed to build.
Step #6 - "compile-libfuzzer-introspector-x86_64": To reproduce, run:
Step #6 - "compile-libfuzzer-introspector-x86_64": python infra/helper.py build_image leveldb
Step #6 - "compile-libfuzzer-introspector-x86_64": python infra/helper.py build_fuzzers --sanitizer introspector --engine libfuzzer --architecture x86_64 leveldb
Step #6 - "compile-libfuzzer-introspector-x86_64": ********************************************************************************
Finished Step #6 - "compile-libfuzzer-introspector-x86_64"
ERROR: step exited with non-zero status: 1
Starting Step #7
Step #7: Already have image (with digest): gcr.io/cloud-builders/gsutil
Step #7: CommandException: 1 files/objects could not be removed.
Finished Step #7
Starting Step #8
Step #8: Already have image (with digest): gcr.io/cloud-builders/gsutil
Step #8: Copying file:///workspace/out/libfuzzer-introspector-x86_64/inspector/summary.json [Content-Type=application/json]...
Step #8: / [0/297 files][ 0.0 B/ 29.7 MiB] 0% Done
Copying file:///workspace/out/libfuzzer-introspector-x86_64/inspector/prism.js [Content-Type=text/javascript]...
Step #8: / [0/297 files][ 0.0 B/ 29.7 MiB] 0% Done
Copying file:///workspace/out/libfuzzer-introspector-x86_64/inspector/custom.js [Content-Type=text/javascript]...
Step #8: / [0/297 files][ 3.3 KiB/ 29.7 MiB] 0% Done
Copying file:///workspace/out/libfuzzer-introspector-x86_64/inspector/result.json [Content-Type=application/json]...
Step #8: / [0/297 files][ 3.3 KiB/ 29.7 MiB] 0% Done
Copying file:///workspace/out/libfuzzer-introspector-x86_64/inspector/fuzz_db.cc_colormap.png [Content-Type=image/png]...
Step #8: / [0/297 files][ 56.1 KiB/ 29.7 MiB] 0% Done
Copying file:///workspace/out/libfuzzer-introspector-x86_64/inspector/fuzz_report.html [Content-Type=text/html]...
Step #8: / [0/297 files][ 63.3 KiB/ 29.7 MiB] 0% Done
Copying file:///workspace/out/libfuzzer-introspector-x86_64/inspector/all-files.json [Content-Type=application/json]...
Step #8: / [0/297 files][ 63.3 KiB/ 29.7 MiB] 0% Done
Copying file:///workspace/out/libfuzzer-introspector-x86_64/inspector/all_functions.js [Content-Type=text/javascript]...
Step #8: / [0/297 files][ 63.3 KiB/ 29.7 MiB] 0% Done
Copying file:///workspace/out/libfuzzer-introspector-x86_64/inspector/fuzzerLogFile-fuzz_db.data.yaml [Content-Type=application/octet-stream]...
Step #8: / [0/297 files][ 63.3 KiB/ 29.7 MiB] 0% Done
Copying file:///workspace/out/libfuzzer-introspector-x86_64/inspector/branch-blockers.json [Content-Type=application/json]...
Step #8: / [0/297 files][591.3 KiB/ 29.7 MiB] 1% Done
/ [1/297 files][902.1 KiB/ 29.7 MiB] 2% Done
/ [2/297 files][902.1 KiB/ 29.7 MiB] 2% Done
Copying file:///workspace/out/libfuzzer-introspector-x86_64/inspector/fuzzer_table_data.js [Content-Type=text/javascript]...
Step #8: / [2/297 files][902.1 KiB/ 29.7 MiB] 2% Done
Copying file:///workspace/out/libfuzzer-introspector-x86_64/inspector/clike.js [Content-Type=text/javascript]...
Step #8: Copying file:///workspace/out/libfuzzer-introspector-x86_64/inspector/all-friendly-debug-types.json [Content-Type=application/json]...
Step #8: / [2/297 files][902.1 KiB/ 29.7 MiB] 2% Done
/ [3/297 files][902.1 KiB/ 29.7 MiB] 2% Done
/ [3/297 files][902.1 KiB/ 29.7 MiB] 2% Done
Copying file:///workspace/out/libfuzzer-introspector-x86_64/inspector/analysis_1.js [Content-Type=text/javascript]...
Step #8: / [3/297 files][902.1 KiB/ 29.7 MiB] 2% Done
/ [4/297 files][ 1005 KiB/ 29.7 MiB] 3% Done
/ [5/297 files][ 1005 KiB/ 29.7 MiB] 3% Done
/ [6/297 files][ 11.0 MiB/ 29.7 MiB] 36% Done
/ [7/297 files][ 11.5 MiB/ 29.7 MiB] 38% Done
Copying file:///workspace/out/libfuzzer-introspector-x86_64/inspector/calltree.js [Content-Type=text/javascript]...
Step #8: / [7/297 files][ 12.5 MiB/ 29.7 MiB] 42% Done
Copying file:///workspace/out/libfuzzer-introspector-x86_64/inspector/prism.css [Content-Type=text/css]...
Step #8: / [7/297 files][ 14.6 MiB/ 29.7 MiB] 49% Done
Copying file:///workspace/out/libfuzzer-introspector-x86_64/inspector/calltree_view_0.html [Content-Type=text/html]...
Step #8: / [8/297 files][ 15.4 MiB/ 29.7 MiB] 51% Done
/ [8/297 files][ 15.4 MiB/ 29.7 MiB] 51% Done
Copying file:///workspace/out/libfuzzer-introspector-x86_64/inspector/all-fuzz-introspector-functions.json [Content-Type=application/json]...
Step #8: / [8/297 files][ 15.9 MiB/ 29.7 MiB] 53% Done
Copying file:///workspace/out/libfuzzer-introspector-x86_64/inspector/test-files.json [Content-Type=application/json]...
Step #8: / [8/297 files][ 18.3 MiB/ 29.7 MiB] 61% Done
Copying file:///workspace/out/libfuzzer-introspector-x86_64/inspector/fuzzerLogFile-fuzz_db.data [Content-Type=application/octet-stream]...
Step #8: Copying file:///workspace/out/libfuzzer-introspector-x86_64/inspector/all_debug_info.json [Content-Type=application/json]...
Step #8: / [8/297 files][ 19.6 MiB/ 29.7 MiB] 65% Done
/ [8/297 files][ 19.8 MiB/ 29.7 MiB] 66% Done
Copying file:///workspace/out/libfuzzer-introspector-x86_64/inspector/styles.css [Content-Type=text/css]...
Step #8: / [8/297 files][ 20.3 MiB/ 29.7 MiB] 68% Done
Copying file:///workspace/out/libfuzzer-introspector-x86_64/inspector/source-code/src/leveldb/fuzz_db.cc [Content-Type=text/x-c++src]...
Step #8: / [8/297 files][ 20.8 MiB/ 29.7 MiB] 69% Done
/ [9/297 files][ 20.8 MiB/ 29.7 MiB] 69% Done
Copying file:///workspace/out/libfuzzer-introspector-x86_64/inspector/source-code/src/leveldb/db/log_reader.cc [Content-Type=text/x-c++src]...
Step #8: / [9/297 files][ 20.8 MiB/ 29.7 MiB] 69% Done
Copying file:///workspace/out/libfuzzer-introspector-x86_64/inspector/source-code/src/leveldb/db/fault_injection_test.cc [Content-Type=text/x-c++src]...
Step #8: / [9/297 files][ 20.8 MiB/ 29.7 MiB] 69% Done
/ [10/297 files][ 20.8 MiB/ 29.7 MiB] 69% Done
/ [11/297 files][ 20.8 MiB/ 29.7 MiB] 69% Done
Copying file:///workspace/out/libfuzzer-introspector-x86_64/inspector/source-code/src/leveldb/db/dbformat_test.cc [Content-Type=text/x-c++src]...
Step #8: / [11/297 files][ 20.8 MiB/ 29.7 MiB] 69% Done
Copying file:///workspace/out/libfuzzer-introspector-x86_64/inspector/source-code/src/leveldb/db/recovery_test.cc [Content-Type=text/x-c++src]...
Step #8: / [11/297 files][ 20.8 MiB/ 29.7 MiB] 69% Done
Copying file:///workspace/out/libfuzzer-introspector-x86_64/inspector/source-code/src/leveldb/db/table_cache.h [Content-Type=text/x-chdr]...
Step #8: / [11/297 files][ 20.8 MiB/ 29.7 MiB] 69% Done
/ [12/297 files][ 20.8 MiB/ 29.7 MiB] 69% Done
Copying file:///workspace/out/libfuzzer-introspector-x86_64/inspector/source-code/src/leveldb/db/dbformat.cc [Content-Type=text/x-c++src]...
Step #8: / [12/297 files][ 20.8 MiB/ 29.7 MiB] 69% Done
Copying file:///workspace/out/libfuzzer-introspector-x86_64/inspector/source-code/src/leveldb/db/log_writer.cc [Content-Type=text/x-c++src]...
Step #8: / [12/297 files][ 20.8 MiB/ 29.7 MiB] 69% Done
Copying file:///workspace/out/libfuzzer-introspector-x86_64/inspector/source-code/src/leveldb/db/db_iter.cc [Content-Type=text/x-c++src]...
Step #8: / [12/297 files][ 20.8 MiB/ 29.7 MiB] 69% Done
Copying file:///workspace/out/libfuzzer-introspector-x86_64/inspector/source-code/src/leveldb/db/c.cc [Content-Type=text/x-c++src]...
Step #8: / [12/297 files][ 20.8 MiB/ 29.7 MiB] 69% Done
Copying file:///workspace/out/libfuzzer-introspector-x86_64/inspector/source-code/src/leveldb/db/c_test.c [Content-Type=text/x-csrc]...
Step #8: Copying file:///workspace/out/libfuzzer-introspector-x86_64/inspector/source-code/src/leveldb/db/write_batch_internal.h [Content-Type=text/x-chdr]...
Step #8: / [12/297 files][ 20.8 MiB/ 29.7 MiB] 69% Done
/ [12/297 files][ 20.8 MiB/ 29.7 MiB] 69% Done
Copying file:///workspace/out/libfuzzer-introspector-x86_64/inspector/source-code/src/leveldb/db/log_writer.h [Content-Type=text/x-chdr]...
Step #8: / [12/297 files][ 20.8 MiB/ 29.7 MiB] 69% Done
Copying file:///workspace/out/libfuzzer-introspector-x86_64/inspector/source-code/src/leveldb/db/version_edit.h [Content-Type=text/x-chdr]...
Step #8: / [12/297 files][ 20.8 MiB/ 29.7 MiB] 69% Done
Copying file:///workspace/out/libfuzzer-introspector-x86_64/inspector/source-code/src/leveldb/db/version_set.cc [Content-Type=text/x-c++src]...
Step #8: / [12/297 files][ 20.8 MiB/ 29.7 MiB] 69% Done
Copying file:///workspace/out/libfuzzer-introspector-x86_64/inspector/source-code/src/leveldb/db/snapshot.h [Content-Type=text/x-chdr]...
Step #8: / [12/297 files][ 20.8 MiB/ 29.7 MiB] 69% Done
Copying file:///workspace/out/libfuzzer-introspector-x86_64/inspector/source-code/src/leveldb/db/memtable.h [Content-Type=text/x-chdr]...
Step #8: / [12/297 files][ 20.8 MiB/ 29.7 MiB] 69% Done
Copying file:///workspace/out/libfuzzer-introspector-x86_64/inspector/source-code/src/leveldb/db/db_impl.h [Content-Type=text/x-chdr]...
Step #8: / [12/297 files][ 21.0 MiB/ 29.7 MiB] 70% Done
/ [13/297 files][ 21.2 MiB/ 29.7 MiB] 71% Done
Copying file:///workspace/out/libfuzzer-introspector-x86_64/inspector/source-code/src/leveldb/db/dumpfile.cc [Content-Type=text/x-c++src]...
Step #8: / [13/297 files][ 21.2 MiB/ 29.7 MiB] 71% Done
Copying file:///workspace/out/libfuzzer-introspector-x86_64/inspector/source-code/src/leveldb/db/write_batch.cc [Content-Type=text/x-c++src]...
Step #8: / [14/297 files][ 21.2 MiB/ 29.7 MiB] 71% Done
/ [14/297 files][ 21.2 MiB/ 29.7 MiB] 71% Done
Copying file:///workspace/out/libfuzzer-introspector-x86_64/inspector/source-code/src/leveldb/db/version_set.h [Content-Type=text/x-chdr]...
Step #8: / [14/297 files][ 21.2 MiB/ 29.7 MiB] 71% Done
Copying file:///workspace/out/libfuzzer-introspector-x86_64/inspector/source-code/src/leveldb/db/write_batch_test.cc [Content-Type=text/x-c++src]...
Step #8: / [14/297 files][ 21.2 MiB/ 29.7 MiB] 71% Done
Copying file:///workspace/out/libfuzzer-introspector-x86_64/inspector/source-code/src/leveldb/db/repair.cc [Content-Type=text/x-c++src]...
Step #8: / [14/297 files][ 21.4 MiB/ 29.7 MiB] 72% Done
Copying file:///workspace/out/libfuzzer-introspector-x86_64/inspector/source-code/src/leveldb/db/db_iter.h [Content-Type=text/x-chdr]...
Step #8: / [14/297 files][ 21.7 MiB/ 29.7 MiB] 72% Done
Copying file:///workspace/out/libfuzzer-introspector-x86_64/inspector/source-code/src/leveldb/db/memtable.cc [Content-Type=text/x-c++src]...
Step #8: / [14/297 files][ 21.7 MiB/ 29.7 MiB] 73% Done
/ [15/297 files][ 21.7 MiB/ 29.7 MiB] 73% Done
/ [16/297 files][ 21.7 MiB/ 29.7 MiB] 73% Done
Copying file:///workspace/out/libfuzzer-introspector-x86_64/inspector/source-code/src/leveldb/db/table_cache.cc [Content-Type=text/x-c++src]...
Step #8: / [16/297 files][ 23.0 MiB/ 29.7 MiB] 77% Done
-
- [17/297 files][ 28.0 MiB/ 29.7 MiB] 94% Done
- [18/297 files][ 28.0 MiB/ 29.7 MiB] 94% Done
Copying file:///workspace/out/libfuzzer-introspector-x86_64/inspector/source-code/src/leveldb/db/version_edit.cc [Content-Type=text/x-c++src]...
Step #8: - [18/297 files][ 28.0 MiB/ 29.7 MiB] 94% Done
Copying file:///workspace/out/libfuzzer-introspector-x86_64/inspector/source-code/src/leveldb/db/version_edit_test.cc [Content-Type=text/x-c++src]...
Step #8: - [18/297 files][ 28.0 MiB/ 29.7 MiB] 94% Done
Copying file:///workspace/out/libfuzzer-introspector-x86_64/inspector/source-code/src/leveldb/db/dbformat.h [Content-Type=text/x-chdr]...
Step #8: - [18/297 files][ 28.0 MiB/ 29.7 MiB] 94% Done
Copying file:///workspace/out/libfuzzer-introspector-x86_64/inspector/source-code/src/leveldb/db/log_format.h [Content-Type=text/x-chdr]...
Step #8: - [18/297 files][ 28.0 MiB/ 29.7 MiB] 94% Done
Copying file:///workspace/out/libfuzzer-introspector-x86_64/inspector/source-code/src/leveldb/db/builder.h [Content-Type=text/x-chdr]...
Step #8: - [18/297 files][ 28.0 MiB/ 29.7 MiB] 94% Done
Copying file:///workspace/out/libfuzzer-introspector-x86_64/inspector/source-code/src/leveldb/db/log_reader.h [Content-Type=text/x-chdr]...
Step #8: - [18/297 files][ 28.0 MiB/ 29.7 MiB] 94% Done
Copying file:///workspace/out/libfuzzer-introspector-x86_64/inspector/source-code/src/leveldb/db/log_test.cc [Content-Type=text/x-c++src]...
Step #8: - [18/297 files][ 28.0 MiB/ 29.7 MiB] 94% Done
- [19/297 files][ 28.0 MiB/ 29.7 MiB] 94% Done
Copying file:///workspace/out/libfuzzer-introspector-x86_64/inspector/source-code/src/leveldb/db/filename.cc [Content-Type=text/x-c++src]...
Step #8: Copying file:///workspace/out/libfuzzer-introspector-x86_64/inspector/source-code/src/leveldb/db/filename_test.cc [Content-Type=text/x-c++src]...
Step #8: - [19/297 files][ 28.0 MiB/ 29.7 MiB] 94% Done
- [19/297 files][ 28.0 MiB/ 29.7 MiB] 94% Done
Copying file:///workspace/out/libfuzzer-introspector-x86_64/inspector/source-code/src/leveldb/db/leveldbutil.cc [Content-Type=text/x-c++src]...
Step #8: - [19/297 files][ 28.0 MiB/ 29.7 MiB] 94% Done
Copying file:///workspace/out/libfuzzer-introspector-x86_64/inspector/source-code/src/leveldb/db/filename.h [Content-Type=text/x-chdr]...
Step #8: - [19/297 files][ 28.0 MiB/ 29.7 MiB] 94% Done
Copying file:///workspace/out/libfuzzer-introspector-x86_64/inspector/source-code/src/leveldb/db/db_test.cc [Content-Type=text/x-c++src]...
Step #8: - [19/297 files][ 28.0 MiB/ 29.7 MiB] 94% Done
Copying file:///workspace/out/libfuzzer-introspector-x86_64/inspector/source-code/src/leveldb/db/builder.cc [Content-Type=text/x-c++src]...
Step #8: Copying file:///workspace/out/libfuzzer-introspector-x86_64/inspector/source-code/src/leveldb/db/autocompact_test.cc [Content-Type=text/x-c++src]...
Step #8: - [19/297 files][ 28.0 MiB/ 29.7 MiB] 94% Done
- [19/297 files][ 28.0 MiB/ 29.7 MiB] 94% Done
Copying file:///workspace/out/libfuzzer-introspector-x86_64/inspector/source-code/src/leveldb/db/version_set_test.cc [Content-Type=text/x-c++src]...
Step #8: - [19/297 files][ 28.0 MiB/ 29.7 MiB] 94% Done
- [20/297 files][ 28.0 MiB/ 29.7 MiB] 94% Done
Copying file:///workspace/out/libfuzzer-introspector-x86_64/inspector/source-code/src/leveldb/db/skiplist.h [Content-Type=text/x-chdr]...
Step #8: - [20/297 files][ 28.0 MiB/ 29.7 MiB] 94% Done
Copying file:///workspace/out/libfuzzer-introspector-x86_64/inspector/source-code/src/leveldb/db/corruption_test.cc [Content-Type=text/x-c++src]...
Step #8: - [20/297 files][ 28.0 MiB/ 29.7 MiB] 94% Done
Copying file:///workspace/out/libfuzzer-introspector-x86_64/inspector/source-code/src/leveldb/db/db_impl.cc [Content-Type=text/x-c++src]...
Step #8: Copying file:///workspace/out/libfuzzer-introspector-x86_64/inspector/source-code/src/leveldb/db/skiplist_test.cc [Content-Type=text/x-c++src]...
Step #8: - [20/297 files][ 28.0 MiB/ 29.7 MiB] 94% Done
- [20/297 files][ 28.0 MiB/ 29.7 MiB] 94% Done
Copying file:///workspace/out/libfuzzer-introspector-x86_64/inspector/source-code/src/leveldb/port/port_example.h [Content-Type=text/x-chdr]...
Step #8: - [20/297 files][ 28.0 MiB/ 29.7 MiB] 94% Done
Copying file:///workspace/out/libfuzzer-introspector-x86_64/inspector/source-code/src/leveldb/port/port.h [Content-Type=text/x-chdr]...
Step #8: - [20/297 files][ 28.0 MiB/ 29.7 MiB] 94% Done
Copying file:///workspace/out/libfuzzer-introspector-x86_64/inspector/source-code/src/leveldb/port/thread_annotations.h [Content-Type=text/x-chdr]...
Step #8: - [20/297 files][ 28.0 MiB/ 29.7 MiB] 94% Done
- [21/297 files][ 28.1 MiB/ 29.7 MiB] 94% Done
- [22/297 files][ 28.1 MiB/ 29.7 MiB] 94% Done
- [23/297 files][ 28.1 MiB/ 29.7 MiB] 94% Done
- [24/297 files][ 28.1 MiB/ 29.7 MiB] 94% Done
Copying file:///workspace/out/libfuzzer-introspector-x86_64/inspector/source-code/src/leveldb/port/port_stdcxx.h [Content-Type=text/x-chdr]...
Step #8: - [24/297 files][ 28.1 MiB/ 29.7 MiB] 94% Done
- [25/297 files][ 28.1 MiB/ 29.7 MiB] 94% Done
Copying file:///workspace/out/libfuzzer-introspector-x86_64/inspector/source-code/src/leveldb/include/leveldb/comparator.h [Content-Type=text/x-chdr]...
Step #8: - [25/297 files][ 28.1 MiB/ 29.7 MiB] 94% Done
Copying file:///workspace/out/libfuzzer-introspector-x86_64/inspector/source-code/src/leveldb/include/leveldb/options.h [Content-Type=text/x-chdr]...
Step #8: - [25/297 files][ 28.1 MiB/ 29.7 MiB] 94% Done
Copying file:///workspace/out/libfuzzer-introspector-x86_64/inspector/source-code/src/leveldb/include/leveldb/status.h [Content-Type=text/x-chdr]...
Step #8: - [25/297 files][ 28.1 MiB/ 29.7 MiB] 94% Done
Copying file:///workspace/out/libfuzzer-introspector-x86_64/inspector/source-code/src/leveldb/include/leveldb/table.h [Content-Type=text/x-chdr]...
Step #8: Copying file:///workspace/out/libfuzzer-introspector-x86_64/inspector/source-code/src/leveldb/include/leveldb/table_builder.h [Content-Type=text/x-chdr]...
Step #8: - [25/297 files][ 28.1 MiB/ 29.7 MiB] 94% Done
- [25/297 files][ 28.1 MiB/ 29.7 MiB] 94% Done
Copying file:///workspace/out/libfuzzer-introspector-x86_64/inspector/light/all_tests.json [Content-Type=application/json]...
Step #8: Copying file:///workspace/out/libfuzzer-introspector-x86_64/inspector/source-code/src/leveldb/include/leveldb/c.h [Content-Type=text/x-chdr]...
Step #8: - [25/297 files][ 28.1 MiB/ 29.7 MiB] 94% Done
- [25/297 files][ 28.1 MiB/ 29.7 MiB] 94% Done
- [26/297 files][ 28.1 MiB/ 29.7 MiB] 94% Done
Copying file:///workspace/out/libfuzzer-introspector-x86_64/inspector/source-code/src/leveldb/util/testutil.h [Content-Type=text/x-chdr]...
Step #8: - [27/297 files][ 28.2 MiB/ 29.7 MiB] 94% Done
- [27/297 files][ 28.2 MiB/ 29.7 MiB] 94% Done
Copying file:///workspace/out/libfuzzer-introspector-x86_64/inspector/source-code/src/leveldb/include/leveldb/export.h [Content-Type=text/x-chdr]...
Step #8: Copying file:///workspace/out/libfuzzer-introspector-x86_64/inspector/light/all_files.json [Content-Type=application/json]...
Step #8: Copying file:///workspace/out/libfuzzer-introspector-x86_64/inspector/source-code/src/leveldb/include/leveldb/dumpfile.h [Content-Type=text/x-chdr]...
Step #8: - [27/297 files][ 28.2 MiB/ 29.7 MiB] 94% Done
- [27/297 files][ 28.2 MiB/ 29.7 MiB] 94% Done
- [27/297 files][ 28.2 MiB/ 29.7 MiB] 94% Done
Copying file:///workspace/out/libfuzzer-introspector-x86_64/inspector/source-code/src/leveldb/include/leveldb/env.h [Content-Type=text/x-chdr]...
Step #8: Copying file:///workspace/out/libfuzzer-introspector-x86_64/inspector/source-code/src/leveldb/include/leveldb/cache.h [Content-Type=text/x-chdr]...
Step #8: - [28/297 files][ 28.2 MiB/ 29.7 MiB] 94% Done
- [28/297 files][ 28.2 MiB/ 29.7 MiB] 94% Done
- [28/297 files][ 28.2 MiB/ 29.7 MiB] 94% Done
Copying file:///workspace/out/libfuzzer-introspector-x86_64/inspector/source-code/src/leveldb/include/leveldb/filter_policy.h [Content-Type=text/x-chdr]...
Step #8: - [29/297 files][ 28.2 MiB/ 29.7 MiB] 94% Done
- [29/297 files][ 28.2 MiB/ 29.7 MiB] 94% Done
- [30/297 files][ 28.2 MiB/ 29.7 MiB] 94% Done
Copying file:///workspace/out/libfuzzer-introspector-x86_64/inspector/light/all_pairs.json [Content-Type=application/json]...
Step #8: - [30/297 files][ 28.2 MiB/ 29.7 MiB] 94% Done
- [31/297 files][ 28.2 MiB/ 29.7 MiB] 94% Done
Copying file:///workspace/out/libfuzzer-introspector-x86_64/inspector/source-code/src/leveldb/issues/issue178_test.cc [Content-Type=text/x-c++src]...
Step #8: Copying file:///workspace/out/libfuzzer-introspector-x86_64/inspector/source-code/src/leveldb/include/leveldb/write_batch.h [Content-Type=text/x-chdr]...
Step #8: - [31/297 files][ 28.2 MiB/ 29.7 MiB] 94% Done
- [31/297 files][ 28.2 MiB/ 29.7 MiB] 94% Done
Copying file:///workspace/out/libfuzzer-introspector-x86_64/inspector/source-code/src/leveldb/issues/issue320_test.cc [Content-Type=text/x-c++src]...
Step #8: - [31/297 files][ 28.2 MiB/ 29.7 MiB] 94% Done
Copying file:///workspace/out/libfuzzer-introspector-x86_64/inspector/source-code/src/leveldb/util/status.cc [Content-Type=text/x-c++src]...
Step #8: - [31/297 files][ 28.2 MiB/ 29.7 MiB] 94% Done
Copying file:///workspace/out/libfuzzer-introspector-x86_64/inspector/source-code/src/leveldb/issues/issue200_test.cc [Content-Type=text/x-c++src]...
Step #8: - [31/297 files][ 28.2 MiB/ 29.7 MiB] 94% Done
Copying file:///workspace/out/libfuzzer-introspector-x86_64/inspector/source-code/src/leveldb/util/no_destructor_test.cc [Content-Type=text/x-c++src]...
Step #8: Copying file:///workspace/out/libfuzzer-introspector-x86_64/inspector/source-code/src/leveldb/util/histogram.cc [Content-Type=text/x-c++src]...
Step #8: - [31/297 files][ 28.2 MiB/ 29.7 MiB] 94% Done
- [31/297 files][ 28.2 MiB/ 29.7 MiB] 94% Done
Copying file:///workspace/out/libfuzzer-introspector-x86_64/inspector/source-code/src/leveldb/util/crc32c.cc [Content-Type=text/x-c++src]...
Step #8: - [31/297 files][ 28.2 MiB/ 29.7 MiB] 94% Done
Copying file:///workspace/out/libfuzzer-introspector-x86_64/inspector/light/source_files/src/leveldb/fuzz_db.cc [Content-Type=text/x-c++src]...
Step #8: - [31/297 files][ 28.2 MiB/ 29.7 MiB] 94% Done
Copying file:///workspace/out/libfuzzer-introspector-x86_64/inspector/source-code/src/leveldb/util/logging.cc [Content-Type=text/x-c++src]...
Step #8: - [31/297 files][ 28.2 MiB/ 29.7 MiB] 94% Done
Copying file:///workspace/out/libfuzzer-introspector-x86_64/inspector/source-code/src/leveldb/util/logging.h [Content-Type=text/x-chdr]...
Step #8: - [31/297 files][ 28.2 MiB/ 29.7 MiB] 94% Done
- [32/297 files][ 28.2 MiB/ 29.7 MiB] 94% Done
Copying file:///workspace/out/libfuzzer-introspector-x86_64/inspector/source-code/src/leveldb/util/hash.h [Content-Type=text/x-chdr]...
Step #8: - [32/297 files][ 28.2 MiB/ 29.7 MiB] 94% Done
Copying file:///workspace/out/libfuzzer-introspector-x86_64/inspector/source-code/src/leveldb/util/posix_logger.h [Content-Type=text/x-chdr]...
Step #8: - [32/297 files][ 28.2 MiB/ 29.7 MiB] 94% Done
Copying file:///workspace/out/libfuzzer-introspector-x86_64/inspector/source-code/src/leveldb/util/bloom.cc [Content-Type=text/x-c++src]...
Step #8: - [32/297 files][ 28.2 MiB/ 29.7 MiB] 95% Done
- [33/297 files][ 28.2 MiB/ 29.7 MiB] 95% Done
- [34/297 files][ 28.2 MiB/ 29.7 MiB] 95% Done
Copying file:///workspace/out/libfuzzer-introspector-x86_64/inspector/source-code/src/leveldb/util/windows_logger.h [Content-Type=text/x-chdr]...
Step #8: - [34/297 files][ 28.2 MiB/ 29.7 MiB] 95% Done
Copying file:///workspace/out/libfuzzer-introspector-x86_64/inspector/source-code/src/leveldb/util/coding.h [Content-Type=text/x-chdr]...
Step #8: Copying file:///workspace/out/libfuzzer-introspector-x86_64/inspector/source-code/src/leveldb/util/no_destructor.h [Content-Type=text/x-chdr]...
Step #8: - [34/297 files][ 28.2 MiB/ 29.7 MiB] 95% Done
- [34/297 files][ 28.2 MiB/ 29.7 MiB] 95% Done
Copying file:///workspace/out/libfuzzer-introspector-x86_64/inspector/source-code/src/leveldb/util/bloom_test.cc [Content-Type=text/x-c++src]...
Step #8: Copying file:///workspace/out/libfuzzer-introspector-x86_64/inspector/source-code/src/leveldb/util/filter_policy.cc [Content-Type=text/x-c++src]...
Step #8: - [34/297 files][ 28.2 MiB/ 29.7 MiB] 95% Done
- [35/297 files][ 28.2 MiB/ 29.7 MiB] 95% Done
- [35/297 files][ 28.2 MiB/ 29.7 MiB] 95% Done
- [36/297 files][ 28.2 MiB/ 29.7 MiB] 95% Done
- [37/297 files][ 28.2 MiB/ 29.7 MiB] 95% Done
Copying file:///workspace/out/libfuzzer-introspector-x86_64/inspector/source-code/src/leveldb/util/coding_test.cc [Content-Type=text/x-c++src]...
Step #8: - [37/297 files][ 28.3 MiB/ 29.7 MiB] 95% Done
Copying file:///workspace/out/libfuzzer-introspector-x86_64/inspector/source-code/src/leveldb/util/random.h [Content-Type=text/x-chdr]...
Step #8: - [37/297 files][ 28.3 MiB/ 29.7 MiB] 95% Done
Copying file:///workspace/out/libfuzzer-introspector-x86_64/inspector/light/source_files/src/leveldb/db/log_reader.cc [Content-Type=text/x-c++src]...
Step #8: Copying file:///workspace/out/libfuzzer-introspector-x86_64/inspector/source-code/src/leveldb/util/crc32c_test.cc [Content-Type=text/x-c++src]...
Step #8: - [37/297 files][ 28.3 MiB/ 29.7 MiB] 95% Done
- [38/297 files][ 28.3 MiB/ 29.7 MiB] 95% Done
- [38/297 files][ 28.3 MiB/ 29.7 MiB] 95% Done
Copying file:///workspace/out/libfuzzer-introspector-x86_64/inspector/source-code/src/leveldb/util/env_test.cc [Content-Type=text/x-c++src]...
Step #8: - [38/297 files][ 28.3 MiB/ 29.7 MiB] 95% Done
Copying file:///workspace/out/libfuzzer-introspector-x86_64/inspector/source-code/src/leveldb/util/env.cc [Content-Type=text/x-c++src]...
Step #8: - [39/297 files][ 28.3 MiB/ 29.7 MiB] 95% Done
Copying file:///workspace/out/libfuzzer-introspector-x86_64/inspector/source-code/src/leveldb/util/logging_test.cc [Content-Type=text/x-c++src]...
Step #8: - [39/297 files][ 28.3 MiB/ 29.7 MiB] 95% Done
- [39/297 files][ 28.3 MiB/ 29.7 MiB] 95% Done
Copying file:///workspace/out/libfuzzer-introspector-x86_64/inspector/source-code/src/leveldb/util/env_posix_test_helper.h [Content-Type=text/x-chdr]...
Step #8: - [39/297 files][ 28.3 MiB/ 29.7 MiB] 95% Done
Copying file:///workspace/out/libfuzzer-introspector-x86_64/inspector/source-code/src/leveldb/util/env_posix.cc [Content-Type=text/x-c++src]...
Step #8: - [39/297 files][ 28.3 MiB/ 29.7 MiB] 95% Done
Copying file:///workspace/out/libfuzzer-introspector-x86_64/inspector/source-code/src/leveldb/util/status_test.cc [Content-Type=text/x-c++src]...
Step #8: Copying file:///workspace/out/libfuzzer-introspector-x86_64/inspector/source-code/src/leveldb/util/arena.cc [Content-Type=text/x-c++src]...
Step #8: - [39/297 files][ 28.3 MiB/ 29.7 MiB] 95% Done
- [39/297 files][ 28.3 MiB/ 29.7 MiB] 95% Done
Copying file:///workspace/out/libfuzzer-introspector-x86_64/inspector/source-code/src/leveldb/util/comparator.cc [Content-Type=text/x-c++src]...
Step #8: - [39/297 files][ 28.3 MiB/ 29.7 MiB] 95% Done
Copying file:///workspace/out/libfuzzer-introspector-x86_64/inspector/source-code/src/leveldb/util/arena.h [Content-Type=text/x-chdr]...
Step #8: - [39/297 files][ 28.3 MiB/ 29.7 MiB] 95% Done
Copying file:///workspace/out/libfuzzer-introspector-x86_64/inspector/light/source_files/src/leveldb/db/fault_injection_test.cc [Content-Type=text/x-c++src]...
Step #8: - [39/297 files][ 28.3 MiB/ 29.7 MiB] 95% Done
Copying file:///workspace/out/libfuzzer-introspector-x86_64/inspector/light/source_files/src/leveldb/db/dbformat_test.cc [Content-Type=text/x-c++src]...
Step #8: - [40/297 files][ 28.3 MiB/ 29.7 MiB] 95% Done
- [40/297 files][ 28.3 MiB/ 29.7 MiB] 95% Done
- [41/297 files][ 28.3 MiB/ 29.7 MiB] 95% Done
Copying file:///workspace/out/libfuzzer-introspector-x86_64/inspector/source-code/src/leveldb/util/coding.cc [Content-Type=text/x-c++src]...
Step #8: - [41/297 files][ 28.3 MiB/ 29.7 MiB] 95% Done
Copying file:///workspace/out/libfuzzer-introspector-x86_64/inspector/source-code/src/leveldb/util/hash_test.cc [Content-Type=text/x-c++src]...
Step #8: - [41/297 files][ 28.3 MiB/ 29.7 MiB] 95% Done
Copying file:///workspace/out/libfuzzer-introspector-x86_64/inspector/source-code/src/leveldb/util/crc32c.h [Content-Type=text/x-chdr]...
Step #8: - [41/297 files][ 28.3 MiB/ 29.7 MiB] 95% Done
Copying file:///workspace/out/libfuzzer-introspector-x86_64/inspector/source-code/src/leveldb/util/env_windows_test_helper.h [Content-Type=text/x-chdr]...
Step #8: - [41/297 files][ 28.3 MiB/ 29.7 MiB] 95% Done
Copying file:///workspace/out/libfuzzer-introspector-x86_64/inspector/source-code/src/leveldb/util/cache_test.cc [Content-Type=text/x-c++src]...
Step #8: Copying file:///workspace/out/libfuzzer-introspector-x86_64/inspector/source-code/src/leveldb/util/hash.cc [Content-Type=text/x-c++src]...
Step #8: - [41/297 files][ 28.3 MiB/ 29.7 MiB] 95% Done
- [41/297 files][ 28.3 MiB/ 29.7 MiB] 95% Done
Copying file:///workspace/out/libfuzzer-introspector-x86_64/inspector/source-code/src/leveldb/util/mutexlock.h [Content-Type=text/x-chdr]...
Step #8: Copying file:///workspace/out/libfuzzer-introspector-x86_64/inspector/source-code/src/leveldb/util/histogram.h [Content-Type=text/x-chdr]...
Step #8: Copying file:///workspace/out/libfuzzer-introspector-x86_64/inspector/source-code/src/leveldb/util/arena_test.cc [Content-Type=text/x-c++src]...
Step #8: - [41/297 files][ 28.3 MiB/ 29.7 MiB] 95% Done
- [41/297 files][ 28.3 MiB/ 29.7 MiB] 95% Done
Copying file:///workspace/out/libfuzzer-introspector-x86_64/inspector/source-code/src/leveldb/util/testutil.cc [Content-Type=text/x-c++src]...
Step #8: Copying file:///workspace/out/libfuzzer-introspector-x86_64/inspector/source-code/src/leveldb/util/env_windows.cc [Content-Type=text/x-c++src]...
Step #8: - [41/297 files][ 28.3 MiB/ 29.7 MiB] 95% Done
- [41/297 files][ 28.3 MiB/ 29.7 MiB] 95% Done
- [41/297 files][ 28.3 MiB/ 29.7 MiB] 95% Done
Copying file:///workspace/out/libfuzzer-introspector-x86_64/inspector/source-code/src/leveldb/util/env_posix_test.cc [Content-Type=text/x-c++src]...
Step #8: Copying file:///workspace/out/libfuzzer-introspector-x86_64/inspector/source-code/src/leveldb/util/options.cc [Content-Type=text/x-c++src]...
Step #8: - [41/297 files][ 28.3 MiB/ 29.7 MiB] 95% Done
- [41/297 files][ 28.3 MiB/ 29.7 MiB] 95% Done
- [42/297 files][ 28.3 MiB/ 29.7 MiB] 95% Done
- [43/297 files][ 28.3 MiB/ 29.7 MiB] 95% Done
Copying file:///workspace/out/libfuzzer-introspector-x86_64/inspector/source-code/src/leveldb/table/merger.cc [Content-Type=text/x-c++src]...
Step #8: - [44/297 files][ 28.3 MiB/ 29.7 MiB] 95% Done
- [45/297 files][ 28.3 MiB/ 29.7 MiB] 95% Done
Copying file:///workspace/out/libfuzzer-introspector-x86_64/inspector/source-code/src/leveldb/table/table.cc [Content-Type=text/x-c++src]...
Step #8: - [46/297 files][ 28.3 MiB/ 29.7 MiB] 95% Done
- [46/297 files][ 28.3 MiB/ 29.7 MiB] 95% Done
- [46/297 files][ 28.3 MiB/ 29.7 MiB] 95% Done
Copying file:///workspace/out/libfuzzer-introspector-x86_64/inspector/source-code/src/leveldb/benchmarks/db_bench_tree_db.cc [Content-Type=text/x-c++src]...
Step #8: Copying file:///workspace/out/libfuzzer-introspector-x86_64/inspector/source-code/src/leveldb/table/iterator_wrapper.h [Content-Type=text/x-chdr]...
Step #8: - [46/297 files][ 28.3 MiB/ 29.7 MiB] 95% Done
- [46/297 files][ 28.3 MiB/ 29.7 MiB] 95% Done
- [47/297 files][ 28.3 MiB/ 29.7 MiB] 95% Done
Copying file:///workspace/out/libfuzzer-introspector-x86_64/inspector/source-code/src/leveldb/benchmarks/db_bench_sqlite3.cc [Content-Type=text/x-c++src]...
Step #8: - [47/297 files][ 28.3 MiB/ 29.7 MiB] 95% Done
Copying file:///workspace/out/libfuzzer-introspector-x86_64/inspector/source-code/src/leveldb/benchmarks/db_bench_log.cc [Content-Type=text/x-c++src]...
Step #8: - [47/297 files][ 28.3 MiB/ 29.7 MiB] 95% Done
Copying file:///workspace/out/libfuzzer-introspector-x86_64/inspector/source-code/src/leveldb/benchmarks/db_bench.cc [Content-Type=text/x-c++src]...
Step #8: Copying file:///workspace/out/libfuzzer-introspector-x86_64/inspector/source-code/src/leveldb/table/block.cc [Content-Type=text/x-c++src]...
Step #8: - [48/297 files][ 28.3 MiB/ 29.7 MiB] 95% Done
- [48/297 files][ 28.3 MiB/ 29.7 MiB] 95% Done
Copying file:///workspace/out/libfuzzer-introspector-x86_64/inspector/source-code/src/leveldb/table/block_builder.cc [Content-Type=text/x-c++src]...
Step #8: - [48/297 files][ 28.3 MiB/ 29.7 MiB] 95% Done
Copying file:///workspace/out/libfuzzer-introspector-x86_64/inspector/light/source_files/src/leveldb/db/recovery_test.cc [Content-Type=text/x-c++src]...
Step #8: - [48/297 files][ 28.3 MiB/ 29.7 MiB] 95% Done
- [48/297 files][ 28.3 MiB/ 29.7 MiB] 95% Done
- [49/297 files][ 28.3 MiB/ 29.7 MiB] 95% Done
- [50/297 files][ 28.3 MiB/ 29.7 MiB] 95% Done
Copying file:///workspace/out/libfuzzer-introspector-x86_64/inspector/source-code/src/leveldb/table/format.h [Content-Type=text/x-chdr]...
Step #8: Copying file:///workspace/out/libfuzzer-introspector-x86_64/inspector/source-code/src/leveldb/table/filter_block_test.cc [Content-Type=text/x-c++src]...
Step #8: - [50/297 files][ 28.3 MiB/ 29.7 MiB] 95% Done
- [51/297 files][ 28.3 MiB/ 29.7 MiB] 95% Done
- [51/297 files][ 28.3 MiB/ 29.7 MiB] 95% Done
Copying file:///workspace/out/libfuzzer-introspector-x86_64/inspector/source-code/src/leveldb/table/table_test.cc [Content-Type=text/x-c++src]...
Step #8: - [52/297 files][ 28.3 MiB/ 29.7 MiB] 95% Done
Copying file:///workspace/out/libfuzzer-introspector-x86_64/inspector/source-code/src/leveldb/table/merger.h [Content-Type=text/x-chdr]...
Step #8: - [52/297 files][ 28.3 MiB/ 29.7 MiB] 95% Done
- [52/297 files][ 28.3 MiB/ 29.7 MiB] 95% Done
Copying file:///workspace/out/libfuzzer-introspector-x86_64/inspector/source-code/src/leveldb/table/iterator.cc [Content-Type=text/x-c++src]...
Step #8: - [52/297 files][ 28.3 MiB/ 29.7 MiB] 95% Done
Copying file:///workspace/out/libfuzzer-introspector-x86_64/inspector/source-code/src/leveldb/table/filter_block.h [Content-Type=text/x-chdr]...
Step #8: Copying file:///workspace/out/libfuzzer-introspector-x86_64/inspector/source-code/src/leveldb/table/block.h [Content-Type=text/x-chdr]...
Step #8: Copying file:///workspace/out/libfuzzer-introspector-x86_64/inspector/source-code/src/leveldb/table/filter_block.cc [Content-Type=text/x-c++src]...
Step #8: - [52/297 files][ 28.3 MiB/ 29.7 MiB] 95% Done
- [52/297 files][ 28.3 MiB/ 29.7 MiB] 95% Done
- [52/297 files][ 28.3 MiB/ 29.7 MiB] 95% Done
Copying file:///workspace/out/libfuzzer-introspector-x86_64/inspector/source-code/src/leveldb/helpers/memenv/memenv.h [Content-Type=text/x-chdr]...
Step #8: - [52/297 files][ 28.3 MiB/ 29.7 MiB] 95% Done
Copying file:///workspace/out/libfuzzer-introspector-x86_64/inspector/source-code/src/leveldb/table/block_builder.h [Content-Type=text/x-chdr]...
Step #8: - [52/297 files][ 28.3 MiB/ 29.7 MiB] 95% Done
- [53/297 files][ 28.3 MiB/ 29.7 MiB] 95% Done
Copying file:///workspace/out/libfuzzer-introspector-x86_64/inspector/source-code/src/leveldb/table/table_builder.cc [Content-Type=text/x-c++src]...
Step #8: - [53/297 files][ 28.3 MiB/ 29.7 MiB] 95% Done
Copying file:///workspace/out/libfuzzer-introspector-x86_64/inspector/source-code/src/leveldb/table/two_level_iterator.cc [Content-Type=text/x-c++src]...
Step #8: - [53/297 files][ 28.3 MiB/ 29.7 MiB] 95% Done
Copying file:///workspace/out/libfuzzer-introspector-x86_64/inspector/source-code/src/leveldb/helpers/memenv/memenv_test.cc [Content-Type=text/x-c++src]...
Step #8: Copying file:///workspace/out/libfuzzer-introspector-x86_64/inspector/source-code/src/leveldb/table/two_level_iterator.h [Content-Type=text/x-chdr]...
Step #8: Copying file:///workspace/out/libfuzzer-introspector-x86_64/inspector/source-code/src/leveldb/helpers/memenv/memenv.cc [Content-Type=text/x-c++src]...
Step #8: - [53/297 files][ 28.3 MiB/ 29.7 MiB] 95% Done
- [53/297 files][ 28.3 MiB/ 29.7 MiB] 95% Done
Copying file:///workspace/out/libfuzzer-introspector-x86_64/inspector/source-code/workspace/oss-fuzz/projects/tinyxml2/xmltest.cpp [Content-Type=text/x-c++src]...
Step #8: - [53/297 files][ 28.3 MiB/ 29.7 MiB] 95% Done
- [53/297 files][ 28.3 MiB/ 29.7 MiB] 95% Done
Copying file:///workspace/out/libfuzzer-introspector-x86_64/inspector/source-code/workspace/oss-fuzz/projects/upx/fuzzers/test_packed_file_fuzzer.cpp [Content-Type=text/x-c++src]...
Step #8: Copying file:///workspace/out/libfuzzer-introspector-x86_64/inspector/source-code/src/leveldb/table/format.cc [Content-Type=text/x-c++src]...
Step #8: - [53/297 files][ 28.3 MiB/ 29.7 MiB] 95% Done
Copying file:///workspace/out/libfuzzer-introspector-x86_64/inspector/source-code/workspace/oss-fuzz/projects/tinyxml2/xmltest2.cpp [Content-Type=text/x-c++src]...
Step #8: - [53/297 files][ 28.3 MiB/ 29.7 MiB] 95% Done
- [53/297 files][ 28.3 MiB/ 29.7 MiB] 95% Done
- [54/297 files][ 28.3 MiB/ 29.7 MiB] 95% Done
Copying file:///workspace/out/libfuzzer-introspector-x86_64/inspector/source-code/workspace/oss-fuzz/projects/example/my-api-repo/do_stuff_unittest.cpp [Content-Type=text/x-c++src]...
Step #8: - [55/297 files][ 28.3 MiB/ 29.7 MiB] 95% Done
- [56/297 files][ 28.3 MiB/ 29.7 MiB] 95% Done
Copying file:///workspace/out/libfuzzer-introspector-x86_64/inspector/source-code/src/leveldb/include/leveldb/db.h [Content-Type=text/x-chdr]...
Step #8: - [56/297 files][ 28.3 MiB/ 29.7 MiB] 95% Done
- [56/297 files][ 28.3 MiB/ 29.7 MiB] 95% Done
Copying file:///workspace/out/libfuzzer-introspector-x86_64/inspector/source-code/src/leveldb/include/leveldb/slice.h [Content-Type=text/x-chdr]...
Step #8: - [56/297 files][ 28.3 MiB/ 29.7 MiB] 95% Done
Copying file:///workspace/out/libfuzzer-introspector-x86_64/inspector/source-code/src/leveldb/include/leveldb/iterator.h [Content-Type=text/x-chdr]...
Step #8: - [56/297 files][ 28.3 MiB/ 29.7 MiB] 95% Done
- [57/297 files][ 28.3 MiB/ 29.7 MiB] 95% Done
- [58/297 files][ 28.3 MiB/ 29.7 MiB] 95% Done
Copying file:///workspace/out/libfuzzer-introspector-x86_64/inspector/light/source_files/src/leveldb/db/table_cache.h [Content-Type=text/x-chdr]...
Step #8: - [59/297 files][ 28.4 MiB/ 29.7 MiB] 95% Done
- [60/297 files][ 28.4 MiB/ 29.7 MiB] 95% Done
- [60/297 files][ 28.4 MiB/ 29.7 MiB] 95% Done
- [61/297 files][ 28.4 MiB/ 29.7 MiB] 95% Done
- [62/297 files][ 28.4 MiB/ 29.7 MiB] 95% Done
Copying file:///workspace/out/libfuzzer-introspector-x86_64/inspector/light/source_files/src/leveldb/db/dbformat.cc [Content-Type=text/x-c++src]...
Step #8: - [62/297 files][ 28.4 MiB/ 29.7 MiB] 95% Done
Copying file:///workspace/out/libfuzzer-introspector-x86_64/inspector/light/source_files/src/leveldb/db/log_writer.cc [Content-Type=text/x-c++src]...
Step #8: - [62/297 files][ 28.4 MiB/ 29.7 MiB] 95% Done
Copying file:///workspace/out/libfuzzer-introspector-x86_64/inspector/light/source_files/src/leveldb/db/db_iter.cc [Content-Type=text/x-c++src]...
Step #8: - [63/297 files][ 28.4 MiB/ 29.7 MiB] 95% Done
- [63/297 files][ 28.4 MiB/ 29.7 MiB] 95% Done
- [64/297 files][ 28.4 MiB/ 29.7 MiB] 95% Done
- [65/297 files][ 28.4 MiB/ 29.7 MiB] 95% Done
Copying file:///workspace/out/libfuzzer-introspector-x86_64/inspector/light/source_files/src/leveldb/db/c.cc [Content-Type=text/x-c++src]...
Step #8: - [65/297 files][ 28.4 MiB/ 29.7 MiB] 95% Done
Copying file:///workspace/out/libfuzzer-introspector-x86_64/inspector/light/source_files/src/leveldb/db/c_test.c [Content-Type=text/x-csrc]...
Step #8: - [65/297 files][ 28.4 MiB/ 29.7 MiB] 95% Done
Copying file:///workspace/out/libfuzzer-introspector-x86_64/inspector/source-code/src/leveldb/util/cache.cc [Content-Type=text/x-c++src]...
Step #8: Copying file:///workspace/out/libfuzzer-introspector-x86_64/inspector/source-code/src/leveldb/util/env_windows_test.cc [Content-Type=text/x-c++src]...
Step #8: - [65/297 files][ 28.4 MiB/ 29.7 MiB] 95% Done
- [65/297 files][ 28.4 MiB/ 29.7 MiB] 95% Done
Copying file:///workspace/out/libfuzzer-introspector-x86_64/inspector/light/source_files/src/leveldb/db/write_batch_internal.h [Content-Type=text/x-chdr]...
Step #8: - [66/297 files][ 28.4 MiB/ 29.7 MiB] 95% Done
- [66/297 files][ 28.4 MiB/ 29.7 MiB] 95% Done
Copying file:///workspace/out/libfuzzer-introspector-x86_64/inspector/light/source_files/src/leveldb/db/log_writer.h [Content-Type=text/x-chdr]...
Step #8: - [66/297 files][ 28.4 MiB/ 29.7 MiB] 95% Done
- [67/297 files][ 28.4 MiB/ 29.7 MiB] 95% Done
Copying file:///workspace/out/libfuzzer-introspector-x86_64/inspector/light/source_files/src/leveldb/db/version_edit.h [Content-Type=text/x-chdr]...
Step #8: - [67/297 files][ 28.4 MiB/ 29.7 MiB] 95% Done
Copying file:///workspace/out/libfuzzer-introspector-x86_64/inspector/light/source_files/src/leveldb/db/version_set.cc [Content-Type=text/x-c++src]...
Step #8: - [67/297 files][ 28.4 MiB/ 29.7 MiB] 95% Done
- [68/297 files][ 28.4 MiB/ 29.7 MiB] 95% Done
Copying file:///workspace/out/libfuzzer-introspector-x86_64/inspector/light/source_files/src/leveldb/db/snapshot.h [Content-Type=text/x-chdr]...
Step #8: - [69/297 files][ 28.4 MiB/ 29.7 MiB] 95% Done
- [69/297 files][ 28.4 MiB/ 29.7 MiB] 95% Done
Copying file:///workspace/out/libfuzzer-introspector-x86_64/inspector/light/source_files/src/leveldb/db/memtable.h [Content-Type=text/x-chdr]...
Step #8: - [69/297 files][ 28.4 MiB/ 29.7 MiB] 95% Done
- [70/297 files][ 28.4 MiB/ 29.7 MiB] 95% Done
- [71/297 files][ 28.4 MiB/ 29.7 MiB] 95% Done
- [72/297 files][ 28.5 MiB/ 29.7 MiB] 95% Done
- [73/297 files][ 28.5 MiB/ 29.7 MiB] 95% Done
- [74/297 files][ 28.5 MiB/ 29.7 MiB] 95% Done
- [75/297 files][ 28.5 MiB/ 29.7 MiB] 95% Done
Copying file:///workspace/out/libfuzzer-introspector-x86_64/inspector/light/source_files/src/leveldb/db/dumpfile.cc [Content-Type=text/x-c++src]...
Step #8: - [75/297 files][ 28.5 MiB/ 29.7 MiB] 95% Done
Copying file:///workspace/out/libfuzzer-introspector-x86_64/inspector/light/source_files/src/leveldb/db/db_impl.h [Content-Type=text/x-chdr]...
Step #8: - [75/297 files][ 28.5 MiB/ 29.7 MiB] 95% Done
Copying file:///workspace/out/libfuzzer-introspector-x86_64/inspector/light/source_files/src/leveldb/db/write_batch.cc [Content-Type=text/x-c++src]...
Step #8: \
\ [75/297 files][ 28.5 MiB/ 29.7 MiB] 95% Done
\ [76/297 files][ 28.5 MiB/ 29.7 MiB] 95% Done
Copying file:///workspace/out/libfuzzer-introspector-x86_64/inspector/light/source_files/src/leveldb/db/version_set.h [Content-Type=text/x-chdr]...
Step #8: \ [76/297 files][ 28.5 MiB/ 29.7 MiB] 95% Done
Copying file:///workspace/out/libfuzzer-introspector-x86_64/inspector/light/source_files/src/leveldb/db/write_batch_test.cc [Content-Type=text/x-c++src]...
Step #8: \ [76/297 files][ 28.5 MiB/ 29.7 MiB] 95% Done
\ [77/297 files][ 28.5 MiB/ 29.7 MiB] 95% Done
Copying file:///workspace/out/libfuzzer-introspector-x86_64/inspector/light/source_files/src/leveldb/db/repair.cc [Content-Type=text/x-c++src]...
Step #8: Copying file:///workspace/out/libfuzzer-introspector-x86_64/inspector/light/source_files/src/leveldb/db/db_iter.h [Content-Type=text/x-chdr]...
Step #8: \ [77/297 files][ 28.5 MiB/ 29.7 MiB] 96% Done
\ [77/297 files][ 28.5 MiB/ 29.7 MiB] 96% Done
Copying file:///workspace/out/libfuzzer-introspector-x86_64/inspector/light/source_files/src/leveldb/db/memtable.cc [Content-Type=text/x-c++src]...
Step #8: \ [77/297 files][ 28.5 MiB/ 29.7 MiB] 96% Done
Copying file:///workspace/out/libfuzzer-introspector-x86_64/inspector/light/source_files/src/leveldb/db/version_edit.cc [Content-Type=text/x-c++src]...
Step #8: \ [77/297 files][ 28.5 MiB/ 29.7 MiB] 96% Done
\ [78/297 files][ 28.5 MiB/ 29.7 MiB] 96% Done
Copying file:///workspace/out/libfuzzer-introspector-x86_64/inspector/light/source_files/src/leveldb/db/version_edit_test.cc [Content-Type=text/x-c++src]...
Step #8: Copying file:///workspace/out/libfuzzer-introspector-x86_64/inspector/light/source_files/src/leveldb/db/dbformat.h [Content-Type=text/x-chdr]...
Step #8: \ [78/297 files][ 28.6 MiB/ 29.7 MiB] 96% Done
\ [78/297 files][ 28.6 MiB/ 29.7 MiB] 96% Done
\ [79/297 files][ 28.6 MiB/ 29.7 MiB] 96% Done
\ [80/297 files][ 28.6 MiB/ 29.7 MiB] 96% Done
\ [81/297 files][ 28.6 MiB/ 29.7 MiB] 96% Done
Copying file:///workspace/out/libfuzzer-introspector-x86_64/inspector/light/source_files/src/leveldb/db/log_format.h [Content-Type=text/x-chdr]...
Step #8: \ [81/297 files][ 28.6 MiB/ 29.7 MiB] 96% Done
Copying file:///workspace/out/libfuzzer-introspector-x86_64/inspector/light/source_files/src/leveldb/db/builder.h [Content-Type=text/x-chdr]...
Step #8: Copying file:///workspace/out/libfuzzer-introspector-x86_64/inspector/light/source_files/src/leveldb/db/log_reader.h [Content-Type=text/x-chdr]...
Step #8: \ [81/297 files][ 28.6 MiB/ 29.7 MiB] 96% Done
\ [81/297 files][ 28.6 MiB/ 29.7 MiB] 96% Done
Copying file:///workspace/out/libfuzzer-introspector-x86_64/inspector/light/source_files/src/leveldb/db/filename.cc [Content-Type=text/x-c++src]...
Step #8: \ [81/297 files][ 28.6 MiB/ 29.7 MiB] 96% Done
Copying file:///workspace/out/libfuzzer-introspector-x86_64/inspector/light/source_files/src/leveldb/db/log_test.cc [Content-Type=text/x-c++src]...
Step #8: \ [81/297 files][ 28.6 MiB/ 29.7 MiB] 96% Done
Copying file:///workspace/out/libfuzzer-introspector-x86_64/inspector/light/source_files/src/leveldb/db/leveldbutil.cc [Content-Type=text/x-c++src]...
Step #8: Copying file:///workspace/out/libfuzzer-introspector-x86_64/inspector/light/source_files/src/leveldb/db/filename_test.cc [Content-Type=text/x-c++src]...
Step #8: \ [81/297 files][ 28.6 MiB/ 29.7 MiB] 96% Done
Copying file:///workspace/out/libfuzzer-introspector-x86_64/inspector/light/source_files/src/leveldb/db/filename.h [Content-Type=text/x-chdr]...
Step #8: \ [81/297 files][ 28.6 MiB/ 29.7 MiB] 96% Done
\ [82/297 files][ 28.6 MiB/ 29.7 MiB] 96% Done
\ [83/297 files][ 28.6 MiB/ 29.7 MiB] 96% Done
\ [83/297 files][ 28.6 MiB/ 29.7 MiB] 96% Done
\ [84/297 files][ 28.6 MiB/ 29.7 MiB] 96% Done
Copying file:///workspace/out/libfuzzer-introspector-x86_64/inspector/light/source_files/src/leveldb/db/builder.cc [Content-Type=text/x-c++src]...
Step #8: \ [85/297 files][ 28.6 MiB/ 29.7 MiB] 96% Done
Copying file:///workspace/out/libfuzzer-introspector-x86_64/inspector/light/source_files/src/leveldb/db/version_set_test.cc [Content-Type=text/x-c++src]...
Step #8: \ [86/297 files][ 28.6 MiB/ 29.7 MiB] 96% Done
\ [87/297 files][ 28.6 MiB/ 29.7 MiB] 96% Done
\ [87/297 files][ 28.6 MiB/ 29.7 MiB] 96% Done
\ [88/297 files][ 28.6 MiB/ 29.7 MiB] 96% Done
\ [88/297 files][ 28.6 MiB/ 29.7 MiB] 96% Done
\ [89/297 files][ 28.6 MiB/ 29.7 MiB] 96% Done
Copying file:///workspace/out/libfuzzer-introspector-x86_64/inspector/light/source_files/src/leveldb/db/table_cache.cc [Content-Type=text/x-c++src]...
Step #8: Copying file:///workspace/out/libfuzzer-introspector-x86_64/inspector/light/source_files/src/leveldb/db/db_test.cc [Content-Type=text/x-c++src]...
Step #8: \ [90/297 files][ 28.6 MiB/ 29.7 MiB] 96% Done
\ [90/297 files][ 28.6 MiB/ 29.7 MiB] 96% Done
\ [91/297 files][ 28.6 MiB/ 29.7 MiB] 96% Done
\ [92/297 files][ 28.6 MiB/ 29.7 MiB] 96% Done
\ [92/297 files][ 28.6 MiB/ 29.7 MiB] 96% Done
\ [93/297 files][ 28.6 MiB/ 29.7 MiB] 96% Done
Copying file:///workspace/out/libfuzzer-introspector-x86_64/inspector/light/source_files/src/leveldb/db/autocompact_test.cc [Content-Type=text/x-c++src]...
Step #8: Copying file:///workspace/out/libfuzzer-introspector-x86_64/inspector/light/source_files/src/leveldb/db/corruption_test.cc [Content-Type=text/x-c++src]...
Step #8: Copying file:///workspace/out/libfuzzer-introspector-x86_64/inspector/light/source_files/src/leveldb/db/skiplist_test.cc [Content-Type=text/x-c++src]...
Step #8: Copying file:///workspace/out/libfuzzer-introspector-x86_64/inspector/light/source_files/src/leveldb/db/skiplist.h [Content-Type=text/x-chdr]...
Step #8: \ [94/297 files][ 28.6 MiB/ 29.7 MiB] 96% Done
\ [95/297 files][ 28.6 MiB/ 29.7 MiB] 96% Done
\ [95/297 files][ 28.6 MiB/ 29.7 MiB] 96% Done
Copying file:///workspace/out/libfuzzer-introspector-x86_64/inspector/light/source_files/src/leveldb/db/db_impl.cc [Content-Type=text/x-c++src]...
Step #8: Copying file:///workspace/out/libfuzzer-introspector-x86_64/inspector/light/source_files/src/leveldb/port/port.h [Content-Type=text/x-chdr]...
Step #8: Copying file:///workspace/out/libfuzzer-introspector-x86_64/inspector/light/source_files/src/leveldb/port/port_example.h [Content-Type=text/x-chdr]...
Step #8: \ [95/297 files][ 28.6 MiB/ 29.7 MiB] 96% Done
\ [95/297 files][ 28.6 MiB/ 29.7 MiB] 96% Done
\ [95/297 files][ 28.6 MiB/ 29.7 MiB] 96% Done
\ [96/297 files][ 28.6 MiB/ 29.7 MiB] 96% Done
\ [96/297 files][ 28.6 MiB/ 29.7 MiB] 96% Done
Copying file:///workspace/out/libfuzzer-introspector-x86_64/inspector/light/source_files/src/leveldb/port/port_stdcxx.h [Content-Type=text/x-chdr]...
Step #8: \ [96/297 files][ 28.6 MiB/ 29.7 MiB] 96% Done
Copying file:///workspace/out/libfuzzer-introspector-x86_64/inspector/light/source_files/src/leveldb/port/thread_annotations.h [Content-Type=text/x-chdr]...
Step #8: Copying file:///workspace/out/libfuzzer-introspector-x86_64/inspector/light/source_files/src/leveldb/include/leveldb/comparator.h [Content-Type=text/x-chdr]...
Step #8: \ [96/297 files][ 28.6 MiB/ 29.7 MiB] 96% Done
\ [97/297 files][ 28.6 MiB/ 29.7 MiB] 96% Done
\ [98/297 files][ 28.6 MiB/ 29.7 MiB] 96% Done
\ [98/297 files][ 28.6 MiB/ 29.7 MiB] 96% Done
Copying file:///workspace/out/libfuzzer-introspector-x86_64/inspector/light/source_files/src/leveldb/include/leveldb/env.h [Content-Type=text/x-chdr]...
Step #8: Copying file:///workspace/out/libfuzzer-introspector-x86_64/inspector/light/source_files/src/leveldb/include/leveldb/export.h [Content-Type=text/x-chdr]...
Step #8: \ [98/297 files][ 28.6 MiB/ 29.7 MiB] 96% Done
\ [98/297 files][ 28.6 MiB/ 29.7 MiB] 96% Done
Copying file:///workspace/out/libfuzzer-introspector-x86_64/inspector/light/source_files/src/leveldb/include/leveldb/dumpfile.h [Content-Type=text/x-chdr]...
Step #8: \ [99/297 files][ 28.6 MiB/ 29.7 MiB] 96% Done
\ [100/297 files][ 28.6 MiB/ 29.7 MiB] 96% Done
Copying file:///workspace/out/libfuzzer-introspector-x86_64/inspector/light/source_files/src/leveldb/include/leveldb/options.h [Content-Type=text/x-chdr]...
Step #8: \ [100/297 files][ 28.6 MiB/ 29.7 MiB] 96% Done
\ [100/297 files][ 28.6 MiB/ 29.7 MiB] 96% Done
\ [100/297 files][ 28.6 MiB/ 29.7 MiB] 96% Done
Copying file:///workspace/out/libfuzzer-introspector-x86_64/inspector/light/source_files/src/leveldb/include/leveldb/status.h [Content-Type=text/x-chdr]...
Step #8: Copying file:///workspace/out/libfuzzer-introspector-x86_64/inspector/light/source_files/src/leveldb/include/leveldb/table_builder.h [Content-Type=text/x-chdr]...
Step #8: \ [100/297 files][ 28.7 MiB/ 29.7 MiB] 96% Done
\ [101/297 files][ 28.7 MiB/ 29.7 MiB] 96% Done
\ [102/297 files][ 28.7 MiB/ 29.7 MiB] 96% Done
Copying file:///workspace/out/libfuzzer-introspector-x86_64/inspector/light/source_files/src/leveldb/include/leveldb/table.h [Content-Type=text/x-chdr]...
Step #8: \ [103/297 files][ 28.7 MiB/ 29.7 MiB] 96% Done
\ [104/297 files][ 28.7 MiB/ 29.7 MiB] 96% Done
\ [104/297 files][ 28.7 MiB/ 29.7 MiB] 96% Done
\ [104/297 files][ 28.8 MiB/ 29.7 MiB] 96% Done
\ [105/297 files][ 28.8 MiB/ 29.7 MiB] 96% Done
\ [106/297 files][ 28.8 MiB/ 29.7 MiB] 96% Done
\ [107/297 files][ 28.8 MiB/ 29.7 MiB] 96% Done
\ [107/297 files][ 28.8 MiB/ 29.7 MiB] 96% Done
Copying file:///workspace/out/libfuzzer-introspector-x86_64/inspector/light/source_files/src/leveldb/include/leveldb/c.h [Content-Type=text/x-chdr]...
Step #8: \ [108/297 files][ 28.8 MiB/ 29.7 MiB] 96% Done
Copying file:///workspace/out/libfuzzer-introspector-x86_64/inspector/light/source_files/src/leveldb/include/leveldb/db.h [Content-Type=text/x-chdr]...
Step #8: \ [109/297 files][ 28.8 MiB/ 29.7 MiB] 96% Done
\ [110/297 files][ 28.8 MiB/ 29.7 MiB] 97% Done
\ [111/297 files][ 28.8 MiB/ 29.7 MiB] 97% Done
\ [112/297 files][ 28.8 MiB/ 29.7 MiB] 97% Done
\ [113/297 files][ 28.8 MiB/ 29.7 MiB] 97% Done
Copying file:///workspace/out/libfuzzer-introspector-x86_64/inspector/light/source_files/src/leveldb/include/leveldb/slice.h [Content-Type=text/x-chdr]...
Step #8: Copying file:///workspace/out/libfuzzer-introspector-x86_64/inspector/light/source_files/src/leveldb/include/leveldb/cache.h [Content-Type=text/x-chdr]...
Step #8: \ [114/297 files][ 28.9 MiB/ 29.7 MiB] 97% Done
\ [114/297 files][ 28.9 MiB/ 29.7 MiB] 97% Done
\ [114/297 files][ 28.9 MiB/ 29.7 MiB] 97% Done
\ [115/297 files][ 28.9 MiB/ 29.7 MiB] 97% Done
\ [116/297 files][ 28.9 MiB/ 29.7 MiB] 97% Done
\ [117/297 files][ 28.9 MiB/ 29.7 MiB] 97% Done
Copying file:///workspace/out/libfuzzer-introspector-x86_64/inspector/light/source_files/src/leveldb/include/leveldb/iterator.h [Content-Type=text/x-chdr]...
Step #8: \ [117/297 files][ 28.9 MiB/ 29.7 MiB] 97% Done
Copying file:///workspace/out/libfuzzer-introspector-x86_64/inspector/light/source_files/src/leveldb/include/leveldb/filter_policy.h [Content-Type=text/x-chdr]...
Step #8: Copying file:///workspace/out/libfuzzer-introspector-x86_64/inspector/light/source_files/src/leveldb/include/leveldb/write_batch.h [Content-Type=text/x-chdr]...
Step #8: \ [117/297 files][ 28.9 MiB/ 29.7 MiB] 97% Done
\ [118/297 files][ 28.9 MiB/ 29.7 MiB] 97% Done
\ [119/297 files][ 28.9 MiB/ 29.7 MiB] 97% Done
\ [120/297 files][ 28.9 MiB/ 29.7 MiB] 97% Done
\ [121/297 files][ 28.9 MiB/ 29.7 MiB] 97% Done
\ [121/297 files][ 28.9 MiB/ 29.7 MiB] 97% Done
\ [122/297 files][ 28.9 MiB/ 29.7 MiB] 97% Done
\ [122/297 files][ 28.9 MiB/ 29.7 MiB] 97% Done
\ [122/297 files][ 28.9 MiB/ 29.7 MiB] 97% Done
\ [123/297 files][ 28.9 MiB/ 29.7 MiB] 97% Done
\ [124/297 files][ 28.9 MiB/ 29.7 MiB] 97% Done
\ [125/297 files][ 28.9 MiB/ 29.7 MiB] 97% Done
\ [126/297 files][ 28.9 MiB/ 29.7 MiB] 97% Done
\ [127/297 files][ 28.9 MiB/ 29.7 MiB] 97% Done
\ [128/297 files][ 29.0 MiB/ 29.7 MiB] 97% Done
\ [129/297 files][ 29.0 MiB/ 29.7 MiB] 97% Done
\ [130/297 files][ 29.0 MiB/ 29.7 MiB] 97% Done
\ [131/297 files][ 29.0 MiB/ 29.7 MiB] 97% Done
\ [132/297 files][ 29.0 MiB/ 29.7 MiB] 97% Done
\ [133/297 files][ 29.0 MiB/ 29.7 MiB] 97% Done
\ [134/297 files][ 29.0 MiB/ 29.7 MiB] 97% Done
\ [135/297 files][ 29.0 MiB/ 29.7 MiB] 97% Done
\ [136/297 files][ 29.0 MiB/ 29.7 MiB] 97% Done
\ [137/297 files][ 29.0 MiB/ 29.7 MiB] 97% Done
\ [138/297 files][ 29.0 MiB/ 29.7 MiB] 97% Done
Copying file:///workspace/out/libfuzzer-introspector-x86_64/inspector/light/source_files/src/leveldb/issues/issue178_test.cc [Content-Type=text/x-c++src]...
Step #8: \ [139/297 files][ 29.0 MiB/ 29.7 MiB] 97% Done
\ [140/297 files][ 29.0 MiB/ 29.7 MiB] 97% Done
\ [141/297 files][ 29.0 MiB/ 29.7 MiB] 97% Done
\ [142/297 files][ 29.0 MiB/ 29.7 MiB] 97% Done
\ [143/297 files][ 29.0 MiB/ 29.7 MiB] 97% Done
Copying file:///workspace/out/libfuzzer-introspector-x86_64/inspector/light/source_files/src/leveldb/issues/issue200_test.cc [Content-Type=text/x-c++src]...
Step #8: \ [143/297 files][ 29.0 MiB/ 29.7 MiB] 97% Done
\ [144/297 files][ 29.0 MiB/ 29.7 MiB] 97% Done
\ [145/297 files][ 29.0 MiB/ 29.7 MiB] 97% Done
\ [146/297 files][ 29.0 MiB/ 29.7 MiB] 97% Done
\ [146/297 files][ 29.0 MiB/ 29.7 MiB] 97% Done
\ [147/297 files][ 29.0 MiB/ 29.7 MiB] 97% Done
\ [148/297 files][ 29.0 MiB/ 29.7 MiB] 97% Done
\ [149/297 files][ 29.0 MiB/ 29.7 MiB] 97% Done
\ [150/297 files][ 29.0 MiB/ 29.7 MiB] 97% Done
\ [151/297 files][ 29.0 MiB/ 29.7 MiB] 97% Done
Copying file:///workspace/out/libfuzzer-introspector-x86_64/inspector/light/source_files/src/leveldb/issues/issue320_test.cc [Content-Type=text/x-c++src]...
Step #8: \ [152/297 files][ 29.0 MiB/ 29.7 MiB] 97% Done
\ [153/297 files][ 29.0 MiB/ 29.7 MiB] 97% Done
\ [153/297 files][ 29.0 MiB/ 29.7 MiB] 97% Done
Copying file:///workspace/out/libfuzzer-introspector-x86_64/inspector/light/source_files/src/leveldb/util/logging.cc [Content-Type=text/x-c++src]...
Step #8: \ [153/297 files][ 29.0 MiB/ 29.7 MiB] 97% Done
\ [154/297 files][ 29.0 MiB/ 29.7 MiB] 97% Done
\ [155/297 files][ 29.0 MiB/ 29.7 MiB] 97% Done
\ [156/297 files][ 29.0 MiB/ 29.7 MiB] 97% Done
\ [157/297 files][ 29.0 MiB/ 29.7 MiB] 97% Done
\ [158/297 files][ 29.0 MiB/ 29.7 MiB] 97% Done
Copying file:///workspace/out/libfuzzer-introspector-x86_64/inspector/light/source_files/src/leveldb/util/logging.h [Content-Type=text/x-chdr]...
Step #8: Copying file:///workspace/out/libfuzzer-introspector-x86_64/inspector/light/source_files/src/leveldb/util/status.cc [Content-Type=text/x-c++src]...
Step #8: \ [158/297 files][ 29.0 MiB/ 29.7 MiB] 97% Done
\ [158/297 files][ 29.0 MiB/ 29.7 MiB] 97% Done
\ [159/297 files][ 29.0 MiB/ 29.7 MiB] 97% Done
\ [160/297 files][ 29.0 MiB/ 29.7 MiB] 97% Done
\ [161/297 files][ 29.0 MiB/ 29.7 MiB] 97% Done
\ [162/297 files][ 29.0 MiB/ 29.7 MiB] 97% Done
Copying file:///workspace/out/libfuzzer-introspector-x86_64/inspector/light/source_files/src/leveldb/util/hash.h [Content-Type=text/x-chdr]...
Step #8: \ [162/297 files][ 29.0 MiB/ 29.7 MiB] 97% Done
\ [163/297 files][ 29.0 MiB/ 29.7 MiB] 97% Done
Copying file:///workspace/out/libfuzzer-introspector-x86_64/inspector/light/source_files/src/leveldb/util/crc32c.cc [Content-Type=text/x-c++src]...
Step #8: \ [164/297 files][ 29.0 MiB/ 29.7 MiB] 97% Done
\ [165/297 files][ 29.0 MiB/ 29.7 MiB] 97% Done
\ [166/297 files][ 29.0 MiB/ 29.7 MiB] 97% Done
\ [167/297 files][ 29.0 MiB/ 29.7 MiB] 97% Done
\ [167/297 files][ 29.0 MiB/ 29.7 MiB] 97% Done
Copying file:///workspace/out/libfuzzer-introspector-x86_64/inspector/light/source_files/src/leveldb/util/posix_logger.h [Content-Type=text/x-chdr]...
Step #8: Copying file:///workspace/out/libfuzzer-introspector-x86_64/inspector/light/source_files/src/leveldb/util/histogram.cc [Content-Type=text/x-c++src]...
Step #8: \ [167/297 files][ 29.0 MiB/ 29.7 MiB] 97% Done
\ [167/297 files][ 29.0 MiB/ 29.7 MiB] 97% Done
\ [168/297 files][ 29.0 MiB/ 29.7 MiB] 97% Done
\ [169/297 files][ 29.0 MiB/ 29.7 MiB] 97% Done
\ [170/297 files][ 29.0 MiB/ 29.7 MiB] 97% Done
Copying file:///workspace/out/libfuzzer-introspector-x86_64/inspector/light/source_files/src/leveldb/util/bloom.cc [Content-Type=text/x-c++src]...
Step #8: \ [170/297 files][ 29.0 MiB/ 29.7 MiB] 97% Done
Copying file:///workspace/out/libfuzzer-introspector-x86_64/inspector/light/source_files/src/leveldb/util/coding.h [Content-Type=text/x-chdr]...
Step #8: \ [170/297 files][ 29.1 MiB/ 29.7 MiB] 97% Done
\ [171/297 files][ 29.1 MiB/ 29.7 MiB] 97% Done
Copying file:///workspace/out/libfuzzer-introspector-x86_64/inspector/light/source_files/src/leveldb/util/windows_logger.h [Content-Type=text/x-chdr]...
Step #8: \ [171/297 files][ 29.1 MiB/ 29.7 MiB] 97% Done
Copying file:///workspace/out/libfuzzer-introspector-x86_64/inspector/light/source_files/src/leveldb/util/no_destructor.h [Content-Type=text/x-chdr]...
Step #8: \ [171/297 files][ 29.1 MiB/ 29.7 MiB] 97% Done
\ [172/297 files][ 29.1 MiB/ 29.7 MiB] 97% Done
\ [173/297 files][ 29.1 MiB/ 29.7 MiB] 97% Done
\ [174/297 files][ 29.1 MiB/ 29.7 MiB] 97% Done
\ [175/297 files][ 29.1 MiB/ 29.7 MiB] 97% Done
\ [176/297 files][ 29.1 MiB/ 29.7 MiB] 97% Done
\ [177/297 files][ 29.1 MiB/ 29.7 MiB] 97% Done
\ [178/297 files][ 29.1 MiB/ 29.7 MiB] 97% Done
\ [179/297 files][ 29.1 MiB/ 29.7 MiB] 97% Done
Copying file:///workspace/out/libfuzzer-introspector-x86_64/inspector/light/source_files/src/leveldb/util/filter_policy.cc [Content-Type=text/x-c++src]...
Step #8: \ [179/297 files][ 29.1 MiB/ 29.7 MiB] 97% Done
Copying file:///workspace/out/libfuzzer-introspector-x86_64/inspector/light/source_files/src/leveldb/util/bloom_test.cc [Content-Type=text/x-c++src]...
Step #8: \ [179/297 files][ 29.1 MiB/ 29.7 MiB] 97% Done
\ [180/297 files][ 29.1 MiB/ 29.7 MiB] 97% Done
Copying file:///workspace/out/libfuzzer-introspector-x86_64/inspector/light/source_files/src/leveldb/util/random.h [Content-Type=text/x-chdr]...
Step #8: \ [180/297 files][ 29.1 MiB/ 29.7 MiB] 97% Done
Copying file:///workspace/out/libfuzzer-introspector-x86_64/inspector/light/source_files/src/leveldb/util/coding_test.cc [Content-Type=text/x-c++src]...
Step #8: \ [180/297 files][ 29.1 MiB/ 29.7 MiB] 97% Done
Copying file:///workspace/out/libfuzzer-introspector-x86_64/inspector/light/source_files/src/leveldb/util/crc32c_test.cc [Content-Type=text/x-c++src]...
Step #8: \ [180/297 files][ 29.1 MiB/ 29.7 MiB] 97% Done
\ [181/297 files][ 29.1 MiB/ 29.7 MiB] 97% Done
Copying file:///workspace/out/libfuzzer-introspector-x86_64/inspector/light/source_files/src/leveldb/util/env_test.cc [Content-Type=text/x-c++src]...
Step #8: \ [182/297 files][ 29.1 MiB/ 29.7 MiB] 97% Done
\ [183/297 files][ 29.1 MiB/ 29.7 MiB] 97% Done
\ [183/297 files][ 29.1 MiB/ 29.7 MiB] 97% Done
Copying file:///workspace/out/libfuzzer-introspector-x86_64/inspector/light/source_files/src/leveldb/util/env.cc [Content-Type=text/x-c++src]...
Step #8: \ [183/297 files][ 29.1 MiB/ 29.7 MiB] 97% Done
\ [184/297 files][ 29.1 MiB/ 29.7 MiB] 97% Done
\ [185/297 files][ 29.1 MiB/ 29.7 MiB] 98% Done
\ [186/297 files][ 29.1 MiB/ 29.7 MiB] 98% Done
\ [187/297 files][ 29.2 MiB/ 29.7 MiB] 98% Done
Copying file:///workspace/out/libfuzzer-introspector-x86_64/inspector/light/source_files/src/leveldb/util/histogram.h [Content-Type=text/x-chdr]...
Step #8: \ [187/297 files][ 29.2 MiB/ 29.7 MiB] 98% Done
\ [188/297 files][ 29.2 MiB/ 29.7 MiB] 98% Done
\ [189/297 files][ 29.2 MiB/ 29.7 MiB] 98% Done
\ [190/297 files][ 29.2 MiB/ 29.7 MiB] 98% Done
Copying file:///workspace/out/libfuzzer-introspector-x86_64/inspector/light/source_files/src/leveldb/util/env_posix_test_helper.h [Content-Type=text/x-chdr]...
Step #8: \ [191/297 files][ 29.2 MiB/ 29.7 MiB] 98% Done
\ [192/297 files][ 29.2 MiB/ 29.7 MiB] 98% Done
\ [192/297 files][ 29.2 MiB/ 29.7 MiB] 98% Done
\ [193/297 files][ 29.2 MiB/ 29.7 MiB] 98% Done
Copying file:///workspace/out/libfuzzer-introspector-x86_64/inspector/light/source_files/src/leveldb/util/arena_test.cc [Content-Type=text/x-c++src]...
Step #8: \ [194/297 files][ 29.2 MiB/ 29.7 MiB] 98% Done
\ [195/297 files][ 29.2 MiB/ 29.7 MiB] 98% Done
\ [196/297 files][ 29.2 MiB/ 29.7 MiB] 98% Done
\ [196/297 files][ 29.2 MiB/ 29.7 MiB] 98% Done
\ [197/297 files][ 29.2 MiB/ 29.7 MiB] 98% Done
Copying file:///workspace/out/libfuzzer-introspector-x86_64/inspector/light/source_files/src/leveldb/util/status_test.cc [Content-Type=text/x-c++src]...
Step #8: \ [197/297 files][ 29.2 MiB/ 29.7 MiB] 98% Done
|
| [198/297 files][ 29.2 MiB/ 29.7 MiB] 98% Done
Copying file:///workspace/out/libfuzzer-introspector-x86_64/inspector/light/source_files/src/leveldb/util/comparator.cc [Content-Type=text/x-c++src]...
Step #8: | [198/297 files][ 29.2 MiB/ 29.7 MiB] 98% Done
Copying file:///workspace/out/libfuzzer-introspector-x86_64/inspector/light/source_files/src/leveldb/util/logging_test.cc [Content-Type=text/x-c++src]...
Step #8: | [198/297 files][ 29.2 MiB/ 29.7 MiB] 98% Done
| [199/297 files][ 29.2 MiB/ 29.7 MiB] 98% Done
Copying file:///workspace/out/libfuzzer-introspector-x86_64/inspector/light/source_files/src/leveldb/util/arena.h [Content-Type=text/x-chdr]...
Step #8: | [199/297 files][ 29.2 MiB/ 29.7 MiB] 98% Done
Copying file:///workspace/out/libfuzzer-introspector-x86_64/inspector/light/source_files/src/leveldb/util/hash_test.cc [Content-Type=text/x-c++src]...
Step #8: | [199/297 files][ 29.2 MiB/ 29.7 MiB] 98% Done
| [200/297 files][ 29.2 MiB/ 29.7 MiB] 98% Done
Copying file:///workspace/out/libfuzzer-introspector-x86_64/inspector/light/source_files/src/leveldb/util/arena.cc [Content-Type=text/x-c++src]...
Step #8: | [200/297 files][ 29.2 MiB/ 29.7 MiB] 98% Done
| [201/297 files][ 29.3 MiB/ 29.7 MiB] 98% Done
| [202/297 files][ 29.3 MiB/ 29.7 MiB] 98% Done
| [203/297 files][ 29.3 MiB/ 29.7 MiB] 98% Done
Copying file:///workspace/out/libfuzzer-introspector-x86_64/inspector/light/source_files/src/leveldb/util/env_posix.cc [Content-Type=text/x-c++src]...
Step #8: | [203/297 files][ 29.3 MiB/ 29.7 MiB] 98% Done
Copying file:///workspace/out/libfuzzer-introspector-x86_64/inspector/light/source_files/src/leveldb/util/env_windows_test_helper.h [Content-Type=text/x-chdr]...
Step #8: | [204/297 files][ 29.3 MiB/ 29.7 MiB] 98% Done
| [205/297 files][ 29.3 MiB/ 29.7 MiB] 98% Done
| [206/297 files][ 29.3 MiB/ 29.7 MiB] 98% Done
| [206/297 files][ 29.3 MiB/ 29.7 MiB] 98% Done
| [207/297 files][ 29.3 MiB/ 29.7 MiB] 98% Done
| [208/297 files][ 29.3 MiB/ 29.7 MiB] 98% Done
| [209/297 files][ 29.3 MiB/ 29.7 MiB] 98% Done
Copying file:///workspace/out/libfuzzer-introspector-x86_64/inspector/light/source_files/src/leveldb/util/hash.cc [Content-Type=text/x-c++src]...
Step #8: | [209/297 files][ 29.3 MiB/ 29.7 MiB] 98% Done
| [210/297 files][ 29.3 MiB/ 29.7 MiB] 98% Done
| [211/297 files][ 29.3 MiB/ 29.7 MiB] 98% Done
Copying file:///workspace/out/libfuzzer-introspector-x86_64/inspector/light/source_files/src/leveldb/util/testutil.cc [Content-Type=text/x-c++src]...
Step #8: | [211/297 files][ 29.3 MiB/ 29.7 MiB] 98% Done
| [212/297 files][ 29.3 MiB/ 29.7 MiB] 98% Done
| [213/297 files][ 29.3 MiB/ 29.7 MiB] 98% Done
Copying file:///workspace/out/libfuzzer-introspector-x86_64/inspector/light/source_files/src/leveldb/util/coding.cc [Content-Type=text/x-c++src]...
Step #8: | [214/297 files][ 29.3 MiB/ 29.7 MiB] 98% Done
| [214/297 files][ 29.3 MiB/ 29.7 MiB] 98% Done
| [215/297 files][ 29.3 MiB/ 29.7 MiB] 98% Done
Copying file:///workspace/out/libfuzzer-introspector-x86_64/inspector/light/source_files/src/leveldb/util/testutil.h [Content-Type=text/x-chdr]...
Step #8: | [215/297 files][ 29.3 MiB/ 29.7 MiB] 98% Done
Copying file:///workspace/out/libfuzzer-introspector-x86_64/inspector/light/source_files/src/leveldb/util/env_windows.cc [Content-Type=text/x-c++src]...
Step #8: | [216/297 files][ 29.3 MiB/ 29.7 MiB] 98% Done
| [217/297 files][ 29.3 MiB/ 29.7 MiB] 98% Done
| [218/297 files][ 29.3 MiB/ 29.7 MiB] 98% Done
| [218/297 files][ 29.3 MiB/ 29.7 MiB] 98% Done
Copying file:///workspace/out/libfuzzer-introspector-x86_64/inspector/light/source_files/src/leveldb/util/cache.cc [Content-Type=text/x-c++src]...
Step #8: | [218/297 files][ 29.3 MiB/ 29.7 MiB] 98% Done
Copying file:///workspace/out/libfuzzer-introspector-x86_64/inspector/light/source_files/src/leveldb/util/crc32c.h [Content-Type=text/x-chdr]...
Step #8: | [218/297 files][ 29.4 MiB/ 29.7 MiB] 98% Done
Copying file:///workspace/out/libfuzzer-introspector-x86_64/inspector/light/source_files/src/leveldb/util/cache_test.cc [Content-Type=text/x-c++src]...
Step #8: | [218/297 files][ 29.4 MiB/ 29.7 MiB] 98% Done
| [219/297 files][ 29.4 MiB/ 29.7 MiB] 98% Done
| [220/297 files][ 29.4 MiB/ 29.7 MiB] 98% Done
| [221/297 files][ 29.4 MiB/ 29.7 MiB] 98% Done
Copying file:///workspace/out/libfuzzer-introspector-x86_64/inspector/light/source_files/src/leveldb/util/no_destructor_test.cc [Content-Type=text/x-c++src]...
Step #8: | [221/297 files][ 29.4 MiB/ 29.7 MiB] 98% Done
| [222/297 files][ 29.4 MiB/ 29.7 MiB] 98% Done
Copying file:///workspace/out/libfuzzer-introspector-x86_64/inspector/light/source_files/src/leveldb/util/mutexlock.h [Content-Type=text/x-chdr]...
Step #8: | [222/297 files][ 29.4 MiB/ 29.7 MiB] 98% Done
| [223/297 files][ 29.4 MiB/ 29.7 MiB] 98% Done
Copying file:///workspace/out/libfuzzer-introspector-x86_64/inspector/light/source_files/src/leveldb/util/env_windows_test.cc [Content-Type=text/x-c++src]...
Step #8: | [224/297 files][ 29.4 MiB/ 29.7 MiB] 98% Done
| [225/297 files][ 29.4 MiB/ 29.7 MiB] 98% Done
| [225/297 files][ 29.4 MiB/ 29.7 MiB] 98% Done
| [226/297 files][ 29.4 MiB/ 29.7 MiB] 98% Done
| [227/297 files][ 29.4 MiB/ 29.7 MiB] 98% Done
| [228/297 files][ 29.4 MiB/ 29.7 MiB] 99% Done
| [229/297 files][ 29.4 MiB/ 29.7 MiB] 99% Done
| [230/297 files][ 29.4 MiB/ 29.7 MiB] 99% Done
Copying file:///workspace/out/libfuzzer-introspector-x86_64/inspector/light/source_files/src/leveldb/benchmarks/db_bench_tree_db.cc [Content-Type=text/x-c++src]...
Step #8: | [231/297 files][ 29.4 MiB/ 29.7 MiB] 99% Done
| [231/297 files][ 29.4 MiB/ 29.7 MiB] 99% Done
| [232/297 files][ 29.4 MiB/ 29.7 MiB] 99% Done
Copying file:///workspace/out/libfuzzer-introspector-x86_64/inspector/light/source_files/src/leveldb/util/env_posix_test.cc [Content-Type=text/x-c++src]...
Step #8: | [232/297 files][ 29.4 MiB/ 29.7 MiB] 99% Done
| [233/297 files][ 29.4 MiB/ 29.7 MiB] 99% Done
Copying file:///workspace/out/libfuzzer-introspector-x86_64/inspector/light/source_files/src/leveldb/util/options.cc [Content-Type=text/x-c++src]...
Step #8: | [233/297 files][ 29.4 MiB/ 29.7 MiB] 99% Done
| [234/297 files][ 29.4 MiB/ 29.7 MiB] 99% Done
| [235/297 files][ 29.4 MiB/ 29.7 MiB] 99% Done
| [236/297 files][ 29.4 MiB/ 29.7 MiB] 99% Done
| [237/297 files][ 29.4 MiB/ 29.7 MiB] 99% Done
| [238/297 files][ 29.4 MiB/ 29.7 MiB] 99% Done
| [239/297 files][ 29.4 MiB/ 29.7 MiB] 99% Done
| [240/297 files][ 29.5 MiB/ 29.7 MiB] 99% Done
| [241/297 files][ 29.5 MiB/ 29.7 MiB] 99% Done
Copying file:///workspace/out/libfuzzer-introspector-x86_64/inspector/light/source_files/src/leveldb/benchmarks/db_bench.cc [Content-Type=text/x-c++src]...
Step #8: | [241/297 files][ 29.5 MiB/ 29.7 MiB] 99% Done
| [242/297 files][ 29.5 MiB/ 29.7 MiB] 99% Done
| [243/297 files][ 29.5 MiB/ 29.7 MiB] 99% Done
Copying file:///workspace/out/libfuzzer-introspector-x86_64/inspector/light/source_files/src/leveldb/benchmarks/db_bench_sqlite3.cc [Content-Type=text/x-c++src]...
Step #8: | [243/297 files][ 29.5 MiB/ 29.7 MiB] 99% Done
Copying file:///workspace/out/libfuzzer-introspector-x86_64/inspector/light/source_files/src/leveldb/benchmarks/db_bench_log.cc [Content-Type=text/x-c++src]...
Step #8: | [243/297 files][ 29.5 MiB/ 29.7 MiB] 99% Done
| [244/297 files][ 29.5 MiB/ 29.7 MiB] 99% Done
Copying file:///workspace/out/libfuzzer-introspector-x86_64/inspector/light/source_files/src/leveldb/table/merger.cc [Content-Type=text/x-c++src]...
Step #8: | [245/297 files][ 29.5 MiB/ 29.7 MiB] 99% Done
| [245/297 files][ 29.5 MiB/ 29.7 MiB] 99% Done
| [246/297 files][ 29.5 MiB/ 29.7 MiB] 99% Done
| [247/297 files][ 29.5 MiB/ 29.7 MiB] 99% Done
| [248/297 files][ 29.5 MiB/ 29.7 MiB] 99% Done
| [249/297 files][ 29.5 MiB/ 29.7 MiB] 99% Done
| [250/297 files][ 29.5 MiB/ 29.7 MiB] 99% Done
| [251/297 files][ 29.5 MiB/ 29.7 MiB] 99% Done
| [252/297 files][ 29.6 MiB/ 29.7 MiB] 99% Done
Copying file:///workspace/out/libfuzzer-introspector-x86_64/inspector/light/source_files/src/leveldb/table/iterator_wrapper.h [Content-Type=text/x-chdr]...
Step #8: | [252/297 files][ 29.6 MiB/ 29.7 MiB] 99% Done
| [253/297 files][ 29.6 MiB/ 29.7 MiB] 99% Done
Copying file:///workspace/out/libfuzzer-introspector-x86_64/inspector/light/source_files/src/leveldb/table/block.cc [Content-Type=text/x-c++src]...
Step #8: | [253/297 files][ 29.6 MiB/ 29.7 MiB] 99% Done
| [254/297 files][ 29.6 MiB/ 29.7 MiB] 99% Done
| [255/297 files][ 29.6 MiB/ 29.7 MiB] 99% Done
Copying file:///workspace/out/libfuzzer-introspector-x86_64/inspector/light/source_files/src/leveldb/table/table.cc [Content-Type=text/x-c++src]...
Step #8: | [256/297 files][ 29.6 MiB/ 29.7 MiB] 99% Done
| [256/297 files][ 29.6 MiB/ 29.7 MiB] 99% Done
| [257/297 files][ 29.6 MiB/ 29.7 MiB] 99% Done
Copying file:///workspace/out/libfuzzer-introspector-x86_64/inspector/light/source_files/src/leveldb/table/block_builder.cc [Content-Type=text/x-c++src]...
Step #8: | [257/297 files][ 29.6 MiB/ 29.7 MiB] 99% Done
| [258/297 files][ 29.6 MiB/ 29.7 MiB] 99% Done
| [259/297 files][ 29.6 MiB/ 29.7 MiB] 99% Done
Copying file:///workspace/out/libfuzzer-introspector-x86_64/inspector/light/source_files/src/leveldb/table/merger.h [Content-Type=text/x-chdr]...
Step #8: | [259/297 files][ 29.6 MiB/ 29.7 MiB] 99% Done
| [260/297 files][ 29.6 MiB/ 29.7 MiB] 99% Done
| [261/297 files][ 29.6 MiB/ 29.7 MiB] 99% Done
Copying file:///workspace/out/libfuzzer-introspector-x86_64/inspector/light/source_files/src/leveldb/table/filter_block.h [Content-Type=text/x-chdr]...
Step #8: | [261/297 files][ 29.6 MiB/ 29.7 MiB] 99% Done
| [262/297 files][ 29.6 MiB/ 29.7 MiB] 99% Done
Copying file:///workspace/out/libfuzzer-introspector-x86_64/inspector/light/source_files/src/leveldb/table/filter_block_test.cc [Content-Type=text/x-c++src]...
Step #8: | [262/297 files][ 29.6 MiB/ 29.7 MiB] 99% Done
Copying file:///workspace/out/libfuzzer-introspector-x86_64/inspector/light/source_files/src/leveldb/table/filter_block.cc [Content-Type=text/x-c++src]...
Step #8: | [262/297 files][ 29.6 MiB/ 29.7 MiB] 99% Done
| [263/297 files][ 29.6 MiB/ 29.7 MiB] 99% Done
Copying file:///workspace/out/libfuzzer-introspector-x86_64/inspector/light/source_files/src/leveldb/table/format.h [Content-Type=text/x-chdr]...
Step #8: | [263/297 files][ 29.6 MiB/ 29.7 MiB] 99% Done
| [264/297 files][ 29.6 MiB/ 29.7 MiB] 99% Done
| [265/297 files][ 29.6 MiB/ 29.7 MiB] 99% Done
Copying file:///workspace/out/libfuzzer-introspector-x86_64/inspector/light/source_files/src/leveldb/table/block_builder.h [Content-Type=text/x-chdr]...
Step #8: | [265/297 files][ 29.6 MiB/ 29.7 MiB] 99% Done
| [266/297 files][ 29.6 MiB/ 29.7 MiB] 99% Done
| [267/297 files][ 29.6 MiB/ 29.7 MiB] 99% Done
| [268/297 files][ 29.6 MiB/ 29.7 MiB] 99% Done
| [269/297 files][ 29.6 MiB/ 29.7 MiB] 99% Done
Copying file:///workspace/out/libfuzzer-introspector-x86_64/inspector/light/source_files/src/leveldb/table/two_level_iterator.cc [Content-Type=text/x-c++src]...
Step #8: | [269/297 files][ 29.6 MiB/ 29.7 MiB] 99% Done
| [270/297 files][ 29.6 MiB/ 29.7 MiB] 99% Done
Copying file:///workspace/out/libfuzzer-introspector-x86_64/inspector/light/source_files/src/leveldb/table/table_test.cc [Content-Type=text/x-c++src]...
Step #8: | [270/297 files][ 29.6 MiB/ 29.7 MiB] 99% Done
Copying file:///workspace/out/libfuzzer-introspector-x86_64/inspector/light/source_files/src/leveldb/table/two_level_iterator.h [Content-Type=text/x-chdr]...
Step #8: | [270/297 files][ 29.6 MiB/ 29.7 MiB] 99% Done
Copying file:///workspace/out/libfuzzer-introspector-x86_64/inspector/light/source_files/src/leveldb/table/block.h [Content-Type=text/x-chdr]...
Step #8: | [271/297 files][ 29.6 MiB/ 29.7 MiB] 99% Done
| [271/297 files][ 29.6 MiB/ 29.7 MiB] 99% Done
| [272/297 files][ 29.6 MiB/ 29.7 MiB] 99% Done
Copying file:///workspace/out/libfuzzer-introspector-x86_64/inspector/light/source_files/src/leveldb/table/table_builder.cc [Content-Type=text/x-c++src]...
Step #8: | [272/297 files][ 29.6 MiB/ 29.7 MiB] 99% Done
Copying file:///workspace/out/libfuzzer-introspector-x86_64/inspector/light/source_files/src/leveldb/table/iterator.cc [Content-Type=text/x-c++src]...
Step #8: | [272/297 files][ 29.6 MiB/ 29.7 MiB] 99% Done
| [273/297 files][ 29.6 MiB/ 29.7 MiB] 99% Done
| [274/297 files][ 29.6 MiB/ 29.7 MiB] 99% Done
| [275/297 files][ 29.6 MiB/ 29.7 MiB] 99% Done
| [276/297 files][ 29.6 MiB/ 29.7 MiB] 99% Done
Copying file:///workspace/out/libfuzzer-introspector-x86_64/inspector/light/source_files/src/leveldb/table/format.cc [Content-Type=text/x-c++src]...
Step #8: | [276/297 files][ 29.6 MiB/ 29.7 MiB] 99% Done
Copying file:///workspace/out/libfuzzer-introspector-x86_64/inspector/light/source_files/src/leveldb/helpers/memenv/memenv.cc [Content-Type=text/x-c++src]...
Step #8: | [276/297 files][ 29.7 MiB/ 29.7 MiB] 99% Done
Copying file:///workspace/out/libfuzzer-introspector-x86_64/inspector/light/source_files/src/leveldb/helpers/memenv/memenv.h [Content-Type=text/x-chdr]...
Step #8: | [276/297 files][ 29.7 MiB/ 29.7 MiB] 99% Done
Copying file:///workspace/out/libfuzzer-introspector-x86_64/inspector/light/source_files/src/leveldb/helpers/memenv/memenv_test.cc [Content-Type=text/x-c++src]...
Step #8: | [276/297 files][ 29.7 MiB/ 29.7 MiB] 99% Done
| [277/297 files][ 29.7 MiB/ 29.7 MiB] 99% Done
| [278/297 files][ 29.7 MiB/ 29.7 MiB] 99% Done
| [279/297 files][ 29.7 MiB/ 29.7 MiB] 99% Done
| [280/297 files][ 29.7 MiB/ 29.7 MiB] 99% Done
| [281/297 files][ 29.7 MiB/ 29.7 MiB] 99% Done
| [282/297 files][ 29.7 MiB/ 29.7 MiB] 99% Done
| [283/297 files][ 29.7 MiB/ 29.7 MiB] 99% Done
| [284/297 files][ 29.7 MiB/ 29.7 MiB] 99% Done
| [285/297 files][ 29.7 MiB/ 29.7 MiB] 99% Done
| [286/297 files][ 29.7 MiB/ 29.7 MiB] 99% Done
| [287/297 files][ 29.7 MiB/ 29.7 MiB] 99% Done
| [288/297 files][ 29.7 MiB/ 29.7 MiB] 99% Done
| [289/297 files][ 29.7 MiB/ 29.7 MiB] 99% Done
| [290/297 files][ 29.7 MiB/ 29.7 MiB] 99% Done
| [291/297 files][ 29.7 MiB/ 29.7 MiB] 99% Done
| [292/297 files][ 29.7 MiB/ 29.7 MiB] 99% Done
| [293/297 files][ 29.7 MiB/ 29.7 MiB] 99% Done
| [294/297 files][ 29.7 MiB/ 29.7 MiB] 99% Done
| [295/297 files][ 29.7 MiB/ 29.7 MiB] 99% Done
/
/ [296/297 files][ 29.7 MiB/ 29.7 MiB] 99% Done
/ [297/297 files][ 29.7 MiB/ 29.7 MiB] 100% Done
Step #8: Operation completed over 297 objects/29.7 MiB.
Finished Step #8
PUSH
DONE