starting build "e1f767e6-63d2-4d83-88e6-289572a58611" FETCHSOURCE BUILD Starting Step #0 Step #0: Already have image (with digest): gcr.io/cloud-builders/git Step #0: Cloning into 'oss-fuzz'... Finished Step #0 Starting Step #1 - "build-435ad16a-7083-40dd-bfeb-6338a6c9bfd2" Step #1 - "build-435ad16a-7083-40dd-bfeb-6338a6c9bfd2": Already have image (with digest): gcr.io/cloud-builders/docker Step #1 - "build-435ad16a-7083-40dd-bfeb-6338a6c9bfd2": Sending build context to Docker daemon 10.24kB Step #1 - "build-435ad16a-7083-40dd-bfeb-6338a6c9bfd2": Step 1/9 : FROM gcr.io/oss-fuzz-base/base-builder-jvm:ubuntu-24-04 Step #1 - "build-435ad16a-7083-40dd-bfeb-6338a6c9bfd2": ubuntu-24-04: Pulling from oss-fuzz-base/base-builder-jvm Step #1 - "build-435ad16a-7083-40dd-bfeb-6338a6c9bfd2": 76249c7cd503: Pulling fs layer Step #1 - "build-435ad16a-7083-40dd-bfeb-6338a6c9bfd2": c8e8434ee9c6: Pulling fs layer Step #1 - "build-435ad16a-7083-40dd-bfeb-6338a6c9bfd2": 8dbc474128eb: Pulling fs layer Step #1 - "build-435ad16a-7083-40dd-bfeb-6338a6c9bfd2": ea249cfad088: Pulling fs layer Step #1 - "build-435ad16a-7083-40dd-bfeb-6338a6c9bfd2": fecf008cf826: Pulling fs layer Step #1 - "build-435ad16a-7083-40dd-bfeb-6338a6c9bfd2": 59e3e9d6ca0a: Pulling fs layer Step #1 - "build-435ad16a-7083-40dd-bfeb-6338a6c9bfd2": 2f4feda5fae1: Pulling fs layer Step #1 - "build-435ad16a-7083-40dd-bfeb-6338a6c9bfd2": 7f2596b0d20a: Pulling fs layer Step #1 - "build-435ad16a-7083-40dd-bfeb-6338a6c9bfd2": f3bbf01e400a: Pulling fs layer Step #1 - "build-435ad16a-7083-40dd-bfeb-6338a6c9bfd2": 46c8db916463: Pulling fs layer Step #1 - "build-435ad16a-7083-40dd-bfeb-6338a6c9bfd2": c2da909e5afe: Pulling fs layer Step #1 - "build-435ad16a-7083-40dd-bfeb-6338a6c9bfd2": 19042a562fb6: Pulling fs layer Step #1 - "build-435ad16a-7083-40dd-bfeb-6338a6c9bfd2": ff1cf2e94224: Pulling fs layer Step #1 - "build-435ad16a-7083-40dd-bfeb-6338a6c9bfd2": 4611016af424: Pulling fs layer Step #1 - "build-435ad16a-7083-40dd-bfeb-6338a6c9bfd2": 826f5e7f4c33: Pulling fs layer Step #1 - "build-435ad16a-7083-40dd-bfeb-6338a6c9bfd2": ad835a45baa8: Pulling fs layer Step #1 - "build-435ad16a-7083-40dd-bfeb-6338a6c9bfd2": 46c8db916463: Waiting Step #1 - "build-435ad16a-7083-40dd-bfeb-6338a6c9bfd2": b77933de649a: Pulling fs layer Step #1 - "build-435ad16a-7083-40dd-bfeb-6338a6c9bfd2": 2f4feda5fae1: Waiting Step #1 - "build-435ad16a-7083-40dd-bfeb-6338a6c9bfd2": c2da909e5afe: Waiting Step #1 - "build-435ad16a-7083-40dd-bfeb-6338a6c9bfd2": 7f2596b0d20a: Waiting Step #1 - "build-435ad16a-7083-40dd-bfeb-6338a6c9bfd2": 0f481373bf1a: Pulling fs layer Step #1 - "build-435ad16a-7083-40dd-bfeb-6338a6c9bfd2": 59c089ce3326: Pulling fs layer Step #1 - "build-435ad16a-7083-40dd-bfeb-6338a6c9bfd2": f3bbf01e400a: Waiting Step #1 - "build-435ad16a-7083-40dd-bfeb-6338a6c9bfd2": 12362e633350: Pulling fs layer Step #1 - "build-435ad16a-7083-40dd-bfeb-6338a6c9bfd2": 826f5e7f4c33: Waiting Step #1 - "build-435ad16a-7083-40dd-bfeb-6338a6c9bfd2": f64fcb69ee72: Pulling fs layer Step #1 - "build-435ad16a-7083-40dd-bfeb-6338a6c9bfd2": 19042a562fb6: Waiting Step #1 - "build-435ad16a-7083-40dd-bfeb-6338a6c9bfd2": ad835a45baa8: Waiting Step #1 - "build-435ad16a-7083-40dd-bfeb-6338a6c9bfd2": 783d43a24dcf: Pulling fs layer Step #1 - "build-435ad16a-7083-40dd-bfeb-6338a6c9bfd2": 70482974d923: Pulling fs layer Step #1 - "build-435ad16a-7083-40dd-bfeb-6338a6c9bfd2": 8a075bfd2222: Pulling fs layer Step #1 - "build-435ad16a-7083-40dd-bfeb-6338a6c9bfd2": 62f631133cb7: Pulling fs layer Step #1 - "build-435ad16a-7083-40dd-bfeb-6338a6c9bfd2": b77933de649a: Waiting Step #1 - "build-435ad16a-7083-40dd-bfeb-6338a6c9bfd2": 28d4d1614fa2: Pulling fs layer Step #1 - "build-435ad16a-7083-40dd-bfeb-6338a6c9bfd2": 12362e633350: Waiting Step #1 - "build-435ad16a-7083-40dd-bfeb-6338a6c9bfd2": 47b29cad0773: Pulling fs layer Step #1 - "build-435ad16a-7083-40dd-bfeb-6338a6c9bfd2": ff1cf2e94224: Waiting Step #1 - "build-435ad16a-7083-40dd-bfeb-6338a6c9bfd2": 0f481373bf1a: Waiting Step #1 - "build-435ad16a-7083-40dd-bfeb-6338a6c9bfd2": 3134c4f9c882: Pulling fs layer Step #1 - "build-435ad16a-7083-40dd-bfeb-6338a6c9bfd2": 59c089ce3326: Waiting Step #1 - "build-435ad16a-7083-40dd-bfeb-6338a6c9bfd2": f9a799c52a46: Pulling fs layer Step #1 - "build-435ad16a-7083-40dd-bfeb-6338a6c9bfd2": e496dea144bb: Pulling fs layer Step #1 - "build-435ad16a-7083-40dd-bfeb-6338a6c9bfd2": 4611016af424: Waiting Step #1 - "build-435ad16a-7083-40dd-bfeb-6338a6c9bfd2": f38148a95a90: Pulling fs layer Step #1 - "build-435ad16a-7083-40dd-bfeb-6338a6c9bfd2": ef0339a165d4: Pulling fs layer Step #1 - "build-435ad16a-7083-40dd-bfeb-6338a6c9bfd2": 3eead7fc44a6: Pulling fs layer Step #1 - "build-435ad16a-7083-40dd-bfeb-6338a6c9bfd2": 62f631133cb7: Waiting Step #1 - "build-435ad16a-7083-40dd-bfeb-6338a6c9bfd2": f64fcb69ee72: Waiting Step #1 - "build-435ad16a-7083-40dd-bfeb-6338a6c9bfd2": b9148bdeeaaa: Pulling fs layer Step #1 - "build-435ad16a-7083-40dd-bfeb-6338a6c9bfd2": 47b29cad0773: Waiting Step #1 - "build-435ad16a-7083-40dd-bfeb-6338a6c9bfd2": 95f86c073ffa: Pulling fs layer Step #1 - "build-435ad16a-7083-40dd-bfeb-6338a6c9bfd2": 3d802f12a589: Pulling fs layer Step #1 - "build-435ad16a-7083-40dd-bfeb-6338a6c9bfd2": 783d43a24dcf: Waiting Step #1 - "build-435ad16a-7083-40dd-bfeb-6338a6c9bfd2": 70482974d923: Waiting Step #1 - "build-435ad16a-7083-40dd-bfeb-6338a6c9bfd2": 768315ef2b06: Pulling fs layer Step #1 - "build-435ad16a-7083-40dd-bfeb-6338a6c9bfd2": 5f611b20e895: Pulling fs layer Step #1 - "build-435ad16a-7083-40dd-bfeb-6338a6c9bfd2": 44265403d820: Pulling fs layer Step #1 - "build-435ad16a-7083-40dd-bfeb-6338a6c9bfd2": 8a075bfd2222: Waiting Step #1 - "build-435ad16a-7083-40dd-bfeb-6338a6c9bfd2": 3134c4f9c882: Waiting Step #1 - "build-435ad16a-7083-40dd-bfeb-6338a6c9bfd2": 570bcfa1008a: Pulling fs layer Step #1 - "build-435ad16a-7083-40dd-bfeb-6338a6c9bfd2": f9a799c52a46: Waiting Step #1 - "build-435ad16a-7083-40dd-bfeb-6338a6c9bfd2": 5265ad54ae98: Pulling fs layer Step #1 - "build-435ad16a-7083-40dd-bfeb-6338a6c9bfd2": 4491d5b0e779: Pulling fs layer Step #1 - "build-435ad16a-7083-40dd-bfeb-6338a6c9bfd2": 3eead7fc44a6: Waiting Step #1 - "build-435ad16a-7083-40dd-bfeb-6338a6c9bfd2": e496dea144bb: Waiting Step #1 - "build-435ad16a-7083-40dd-bfeb-6338a6c9bfd2": 6da5a7c45277: Pulling fs layer Step #1 - "build-435ad16a-7083-40dd-bfeb-6338a6c9bfd2": 8dbafd73497a: Pulling fs layer Step #1 - "build-435ad16a-7083-40dd-bfeb-6338a6c9bfd2": b9148bdeeaaa: Waiting Step #1 - "build-435ad16a-7083-40dd-bfeb-6338a6c9bfd2": f38148a95a90: Waiting Step #1 - "build-435ad16a-7083-40dd-bfeb-6338a6c9bfd2": 50ed1e5286fd: Pulling fs layer Step #1 - "build-435ad16a-7083-40dd-bfeb-6338a6c9bfd2": ef0339a165d4: Waiting Step #1 - "build-435ad16a-7083-40dd-bfeb-6338a6c9bfd2": 637092bee170: Pulling fs layer Step #1 - "build-435ad16a-7083-40dd-bfeb-6338a6c9bfd2": 95f86c073ffa: Waiting Step #1 - "build-435ad16a-7083-40dd-bfeb-6338a6c9bfd2": 3d802f12a589: Waiting Step #1 - "build-435ad16a-7083-40dd-bfeb-6338a6c9bfd2": 768315ef2b06: Waiting Step #1 - "build-435ad16a-7083-40dd-bfeb-6338a6c9bfd2": 8dbafd73497a: Waiting Step #1 - "build-435ad16a-7083-40dd-bfeb-6338a6c9bfd2": 5265ad54ae98: Waiting Step #1 - "build-435ad16a-7083-40dd-bfeb-6338a6c9bfd2": 5f611b20e895: Waiting Step #1 - "build-435ad16a-7083-40dd-bfeb-6338a6c9bfd2": 6da5a7c45277: Waiting Step #1 - "build-435ad16a-7083-40dd-bfeb-6338a6c9bfd2": 637092bee170: Waiting Step #1 - "build-435ad16a-7083-40dd-bfeb-6338a6c9bfd2": 50ed1e5286fd: Waiting Step #1 - "build-435ad16a-7083-40dd-bfeb-6338a6c9bfd2": 4491d5b0e779: Waiting Step #1 - "build-435ad16a-7083-40dd-bfeb-6338a6c9bfd2": 44265403d820: Waiting Step #1 - "build-435ad16a-7083-40dd-bfeb-6338a6c9bfd2": 570bcfa1008a: Waiting Step #1 - "build-435ad16a-7083-40dd-bfeb-6338a6c9bfd2": 59e3e9d6ca0a: Verifying Checksum Step #1 - "build-435ad16a-7083-40dd-bfeb-6338a6c9bfd2": 59e3e9d6ca0a: Download complete Step #1 - "build-435ad16a-7083-40dd-bfeb-6338a6c9bfd2": fecf008cf826: Verifying Checksum Step #1 - "build-435ad16a-7083-40dd-bfeb-6338a6c9bfd2": fecf008cf826: Download complete Step #1 - "build-435ad16a-7083-40dd-bfeb-6338a6c9bfd2": 8dbc474128eb: Verifying Checksum Step #1 - "build-435ad16a-7083-40dd-bfeb-6338a6c9bfd2": 8dbc474128eb: Download complete Step #1 - "build-435ad16a-7083-40dd-bfeb-6338a6c9bfd2": 7f2596b0d20a: Verifying Checksum Step #1 - "build-435ad16a-7083-40dd-bfeb-6338a6c9bfd2": 7f2596b0d20a: Download complete Step #1 - "build-435ad16a-7083-40dd-bfeb-6338a6c9bfd2": f3bbf01e400a: Verifying Checksum Step #1 - "build-435ad16a-7083-40dd-bfeb-6338a6c9bfd2": f3bbf01e400a: Download complete Step #1 - "build-435ad16a-7083-40dd-bfeb-6338a6c9bfd2": ea249cfad088: Verifying Checksum Step #1 - "build-435ad16a-7083-40dd-bfeb-6338a6c9bfd2": ea249cfad088: Download complete Step #1 - "build-435ad16a-7083-40dd-bfeb-6338a6c9bfd2": 76249c7cd503: Verifying Checksum Step #1 - "build-435ad16a-7083-40dd-bfeb-6338a6c9bfd2": 76249c7cd503: Download complete Step #1 - "build-435ad16a-7083-40dd-bfeb-6338a6c9bfd2": ff1cf2e94224: Verifying Checksum Step #1 - "build-435ad16a-7083-40dd-bfeb-6338a6c9bfd2": ff1cf2e94224: Download complete Step #1 - "build-435ad16a-7083-40dd-bfeb-6338a6c9bfd2": 19042a562fb6: Verifying Checksum Step #1 - "build-435ad16a-7083-40dd-bfeb-6338a6c9bfd2": 19042a562fb6: Download complete Step #1 - "build-435ad16a-7083-40dd-bfeb-6338a6c9bfd2": 826f5e7f4c33: Download complete Step #1 - "build-435ad16a-7083-40dd-bfeb-6338a6c9bfd2": 4611016af424: Verifying Checksum Step #1 - "build-435ad16a-7083-40dd-bfeb-6338a6c9bfd2": 4611016af424: Download complete Step #1 - "build-435ad16a-7083-40dd-bfeb-6338a6c9bfd2": ad835a45baa8: Verifying Checksum Step #1 - "build-435ad16a-7083-40dd-bfeb-6338a6c9bfd2": ad835a45baa8: Download complete Step #1 - "build-435ad16a-7083-40dd-bfeb-6338a6c9bfd2": b77933de649a: Verifying Checksum Step #1 - "build-435ad16a-7083-40dd-bfeb-6338a6c9bfd2": b77933de649a: Download complete Step #1 - "build-435ad16a-7083-40dd-bfeb-6338a6c9bfd2": c2da909e5afe: Verifying Checksum Step #1 - "build-435ad16a-7083-40dd-bfeb-6338a6c9bfd2": c2da909e5afe: Download complete Step #1 - "build-435ad16a-7083-40dd-bfeb-6338a6c9bfd2": c8e8434ee9c6: Download complete Step #1 - "build-435ad16a-7083-40dd-bfeb-6338a6c9bfd2": 12362e633350: Verifying Checksum Step #1 - "build-435ad16a-7083-40dd-bfeb-6338a6c9bfd2": 12362e633350: Download complete Step #1 - "build-435ad16a-7083-40dd-bfeb-6338a6c9bfd2": 59c089ce3326: Download complete Step #1 - "build-435ad16a-7083-40dd-bfeb-6338a6c9bfd2": 0f481373bf1a: Verifying Checksum Step #1 - "build-435ad16a-7083-40dd-bfeb-6338a6c9bfd2": 0f481373bf1a: Download complete Step #1 - "build-435ad16a-7083-40dd-bfeb-6338a6c9bfd2": f64fcb69ee72: Verifying Checksum Step #1 - "build-435ad16a-7083-40dd-bfeb-6338a6c9bfd2": f64fcb69ee72: Download complete Step #1 - "build-435ad16a-7083-40dd-bfeb-6338a6c9bfd2": 70482974d923: Download complete Step #1 - "build-435ad16a-7083-40dd-bfeb-6338a6c9bfd2": 783d43a24dcf: Verifying Checksum Step #1 - "build-435ad16a-7083-40dd-bfeb-6338a6c9bfd2": 783d43a24dcf: Download complete Step #1 - "build-435ad16a-7083-40dd-bfeb-6338a6c9bfd2": 62f631133cb7: Verifying Checksum Step #1 - "build-435ad16a-7083-40dd-bfeb-6338a6c9bfd2": 62f631133cb7: Download complete Step #1 - "build-435ad16a-7083-40dd-bfeb-6338a6c9bfd2": 28d4d1614fa2: Download complete Step #1 - "build-435ad16a-7083-40dd-bfeb-6338a6c9bfd2": 8a075bfd2222: Verifying Checksum Step #1 - "build-435ad16a-7083-40dd-bfeb-6338a6c9bfd2": 8a075bfd2222: Download complete Step #1 - "build-435ad16a-7083-40dd-bfeb-6338a6c9bfd2": 47b29cad0773: Download complete Step #1 - "build-435ad16a-7083-40dd-bfeb-6338a6c9bfd2": 76249c7cd503: Pull complete Step #1 - "build-435ad16a-7083-40dd-bfeb-6338a6c9bfd2": 3134c4f9c882: Download complete Step #1 - "build-435ad16a-7083-40dd-bfeb-6338a6c9bfd2": f9a799c52a46: Verifying Checksum Step #1 - "build-435ad16a-7083-40dd-bfeb-6338a6c9bfd2": f9a799c52a46: Download complete Step #1 - "build-435ad16a-7083-40dd-bfeb-6338a6c9bfd2": e496dea144bb: Verifying Checksum Step #1 - "build-435ad16a-7083-40dd-bfeb-6338a6c9bfd2": e496dea144bb: Download complete Step #1 - "build-435ad16a-7083-40dd-bfeb-6338a6c9bfd2": ef0339a165d4: Verifying Checksum Step #1 - "build-435ad16a-7083-40dd-bfeb-6338a6c9bfd2": ef0339a165d4: Download complete Step #1 - "build-435ad16a-7083-40dd-bfeb-6338a6c9bfd2": f38148a95a90: Verifying Checksum Step #1 - "build-435ad16a-7083-40dd-bfeb-6338a6c9bfd2": f38148a95a90: Download complete Step #1 - "build-435ad16a-7083-40dd-bfeb-6338a6c9bfd2": 95f86c073ffa: Verifying Checksum Step #1 - "build-435ad16a-7083-40dd-bfeb-6338a6c9bfd2": 95f86c073ffa: Download complete Step #1 - "build-435ad16a-7083-40dd-bfeb-6338a6c9bfd2": 3d802f12a589: Download complete Step #1 - "build-435ad16a-7083-40dd-bfeb-6338a6c9bfd2": 46c8db916463: Verifying Checksum Step #1 - "build-435ad16a-7083-40dd-bfeb-6338a6c9bfd2": 46c8db916463: Download complete Step #1 - "build-435ad16a-7083-40dd-bfeb-6338a6c9bfd2": 5f611b20e895: Download complete Step #1 - "build-435ad16a-7083-40dd-bfeb-6338a6c9bfd2": 768315ef2b06: Verifying Checksum Step #1 - "build-435ad16a-7083-40dd-bfeb-6338a6c9bfd2": 768315ef2b06: Download complete Step #1 - "build-435ad16a-7083-40dd-bfeb-6338a6c9bfd2": 3eead7fc44a6: Verifying Checksum Step #1 - "build-435ad16a-7083-40dd-bfeb-6338a6c9bfd2": 3eead7fc44a6: Download complete Step #1 - "build-435ad16a-7083-40dd-bfeb-6338a6c9bfd2": 44265403d820: Verifying Checksum Step #1 - "build-435ad16a-7083-40dd-bfeb-6338a6c9bfd2": 44265403d820: Download complete Step #1 - "build-435ad16a-7083-40dd-bfeb-6338a6c9bfd2": 5265ad54ae98: Download complete Step #1 - "build-435ad16a-7083-40dd-bfeb-6338a6c9bfd2": 4491d5b0e779: Verifying Checksum Step #1 - "build-435ad16a-7083-40dd-bfeb-6338a6c9bfd2": 4491d5b0e779: Download complete Step #1 - "build-435ad16a-7083-40dd-bfeb-6338a6c9bfd2": 6da5a7c45277: Verifying Checksum Step #1 - "build-435ad16a-7083-40dd-bfeb-6338a6c9bfd2": 6da5a7c45277: Download complete Step #1 - "build-435ad16a-7083-40dd-bfeb-6338a6c9bfd2": b9148bdeeaaa: Verifying Checksum Step #1 - "build-435ad16a-7083-40dd-bfeb-6338a6c9bfd2": b9148bdeeaaa: Download complete Step #1 - "build-435ad16a-7083-40dd-bfeb-6338a6c9bfd2": 8dbafd73497a: Verifying Checksum Step #1 - "build-435ad16a-7083-40dd-bfeb-6338a6c9bfd2": 8dbafd73497a: Download complete Step #1 - "build-435ad16a-7083-40dd-bfeb-6338a6c9bfd2": 50ed1e5286fd: Verifying Checksum Step #1 - "build-435ad16a-7083-40dd-bfeb-6338a6c9bfd2": 50ed1e5286fd: Download complete Step #1 - "build-435ad16a-7083-40dd-bfeb-6338a6c9bfd2": 637092bee170: Verifying Checksum Step #1 - "build-435ad16a-7083-40dd-bfeb-6338a6c9bfd2": 637092bee170: Download complete Step #1 - "build-435ad16a-7083-40dd-bfeb-6338a6c9bfd2": 2f4feda5fae1: Verifying Checksum Step #1 - "build-435ad16a-7083-40dd-bfeb-6338a6c9bfd2": 2f4feda5fae1: Download complete Step #1 - "build-435ad16a-7083-40dd-bfeb-6338a6c9bfd2": 570bcfa1008a: Verifying Checksum Step #1 - "build-435ad16a-7083-40dd-bfeb-6338a6c9bfd2": 570bcfa1008a: Download complete Step #1 - "build-435ad16a-7083-40dd-bfeb-6338a6c9bfd2": c8e8434ee9c6: Pull complete Step #1 - "build-435ad16a-7083-40dd-bfeb-6338a6c9bfd2": 8dbc474128eb: Pull complete Step #1 - "build-435ad16a-7083-40dd-bfeb-6338a6c9bfd2": ea249cfad088: Pull complete Step #1 - "build-435ad16a-7083-40dd-bfeb-6338a6c9bfd2": fecf008cf826: Pull complete Step #1 - "build-435ad16a-7083-40dd-bfeb-6338a6c9bfd2": 59e3e9d6ca0a: Pull complete Step #1 - "build-435ad16a-7083-40dd-bfeb-6338a6c9bfd2": 2f4feda5fae1: Pull complete Step #1 - "build-435ad16a-7083-40dd-bfeb-6338a6c9bfd2": 7f2596b0d20a: Pull complete Step #1 - "build-435ad16a-7083-40dd-bfeb-6338a6c9bfd2": f3bbf01e400a: Pull complete Step #1 - "build-435ad16a-7083-40dd-bfeb-6338a6c9bfd2": 46c8db916463: Pull complete Step #1 - "build-435ad16a-7083-40dd-bfeb-6338a6c9bfd2": c2da909e5afe: Pull complete Step #1 - "build-435ad16a-7083-40dd-bfeb-6338a6c9bfd2": 19042a562fb6: Pull complete Step #1 - "build-435ad16a-7083-40dd-bfeb-6338a6c9bfd2": ff1cf2e94224: Pull complete Step #1 - "build-435ad16a-7083-40dd-bfeb-6338a6c9bfd2": 4611016af424: Pull complete Step #1 - "build-435ad16a-7083-40dd-bfeb-6338a6c9bfd2": 826f5e7f4c33: Pull complete Step #1 - "build-435ad16a-7083-40dd-bfeb-6338a6c9bfd2": ad835a45baa8: Pull complete Step #1 - "build-435ad16a-7083-40dd-bfeb-6338a6c9bfd2": b77933de649a: Pull complete Step #1 - "build-435ad16a-7083-40dd-bfeb-6338a6c9bfd2": 0f481373bf1a: Pull complete Step #1 - "build-435ad16a-7083-40dd-bfeb-6338a6c9bfd2": 59c089ce3326: Pull complete Step #1 - "build-435ad16a-7083-40dd-bfeb-6338a6c9bfd2": 12362e633350: Pull complete Step #1 - "build-435ad16a-7083-40dd-bfeb-6338a6c9bfd2": f64fcb69ee72: Pull complete Step #1 - "build-435ad16a-7083-40dd-bfeb-6338a6c9bfd2": 783d43a24dcf: Pull complete Step #1 - "build-435ad16a-7083-40dd-bfeb-6338a6c9bfd2": 70482974d923: Pull complete Step #1 - "build-435ad16a-7083-40dd-bfeb-6338a6c9bfd2": 8a075bfd2222: Pull complete Step #1 - "build-435ad16a-7083-40dd-bfeb-6338a6c9bfd2": 62f631133cb7: Pull complete Step #1 - "build-435ad16a-7083-40dd-bfeb-6338a6c9bfd2": 28d4d1614fa2: Pull complete Step #1 - "build-435ad16a-7083-40dd-bfeb-6338a6c9bfd2": 47b29cad0773: Pull complete Step #1 - "build-435ad16a-7083-40dd-bfeb-6338a6c9bfd2": 3134c4f9c882: Pull complete Step #1 - "build-435ad16a-7083-40dd-bfeb-6338a6c9bfd2": f9a799c52a46: Pull complete Step #1 - "build-435ad16a-7083-40dd-bfeb-6338a6c9bfd2": e496dea144bb: Pull complete Step #1 - "build-435ad16a-7083-40dd-bfeb-6338a6c9bfd2": f38148a95a90: Pull complete Step #1 - "build-435ad16a-7083-40dd-bfeb-6338a6c9bfd2": ef0339a165d4: Pull complete Step #1 - "build-435ad16a-7083-40dd-bfeb-6338a6c9bfd2": 3eead7fc44a6: Pull complete Step #1 - "build-435ad16a-7083-40dd-bfeb-6338a6c9bfd2": b9148bdeeaaa: Pull complete Step #1 - "build-435ad16a-7083-40dd-bfeb-6338a6c9bfd2": 95f86c073ffa: Pull complete Step #1 - "build-435ad16a-7083-40dd-bfeb-6338a6c9bfd2": 3d802f12a589: Pull complete Step #1 - "build-435ad16a-7083-40dd-bfeb-6338a6c9bfd2": 768315ef2b06: Pull complete Step #1 - "build-435ad16a-7083-40dd-bfeb-6338a6c9bfd2": 5f611b20e895: Pull complete Step #1 - "build-435ad16a-7083-40dd-bfeb-6338a6c9bfd2": 44265403d820: Pull complete Step #1 - "build-435ad16a-7083-40dd-bfeb-6338a6c9bfd2": 570bcfa1008a: Pull complete Step #1 - "build-435ad16a-7083-40dd-bfeb-6338a6c9bfd2": 5265ad54ae98: Pull complete Step #1 - "build-435ad16a-7083-40dd-bfeb-6338a6c9bfd2": 4491d5b0e779: Pull complete Step #1 - "build-435ad16a-7083-40dd-bfeb-6338a6c9bfd2": 6da5a7c45277: Pull complete Step #1 - "build-435ad16a-7083-40dd-bfeb-6338a6c9bfd2": 8dbafd73497a: Pull complete Step #1 - "build-435ad16a-7083-40dd-bfeb-6338a6c9bfd2": 50ed1e5286fd: Pull complete Step #1 - "build-435ad16a-7083-40dd-bfeb-6338a6c9bfd2": 637092bee170: Pull complete Step #1 - "build-435ad16a-7083-40dd-bfeb-6338a6c9bfd2": Digest: sha256:7bbc26fb22a04a2d32ccae43dde3cecd582cf25faf41ead13fdcd9f9a2899dd3 Step #1 - "build-435ad16a-7083-40dd-bfeb-6338a6c9bfd2": Status: Downloaded newer image for gcr.io/oss-fuzz-base/base-builder-jvm:ubuntu-24-04 Step #1 - "build-435ad16a-7083-40dd-bfeb-6338a6c9bfd2": ---> babd358fd0b6 Step #1 - "build-435ad16a-7083-40dd-bfeb-6338a6c9bfd2": Step 2/9 : RUN curl -L https://services.gradle.org/distributions/gradle-7.4.2-bin.zip -o gradle.zip && unzip gradle.zip -d $SRC/gradle && rm -rf gradle.zip Step #1 - "build-435ad16a-7083-40dd-bfeb-6338a6c9bfd2": ---> Running in 14cdba80c246 Step #1 - "build-435ad16a-7083-40dd-bfeb-6338a6c9bfd2":  % Total % Received % Xferd Average Speed Time Time Time Current Step #1 - "build-435ad16a-7083-40dd-bfeb-6338a6c9bfd2": Dload Upload Total Spent Left Speed Step #1 - "build-435ad16a-7083-40dd-bfeb-6338a6c9bfd2": 0  0 0  0  0 0 0 0 --:--:-- --:--:-- --:--:-- 0 100 169 100 169 0 0 1626 0 --:--:-- --:--:-- --:--:-- 1640 Step #1 - "build-435ad16a-7083-40dd-bfeb-6338a6c9bfd2":  0 0 0 0 0 0 0 0 --:--:-- --:--:-- --:--:-- 0 0 0 0 0 0 0 0 0 --:--:-- --:--:-- --:--:-- 0 Step #1 - "build-435ad16a-7083-40dd-bfeb-6338a6c9bfd2":  100 110M 100 110M 0 0 129M 0 --:--:-- --:--:-- --:--:-- 129M Step #1 - "build-435ad16a-7083-40dd-bfeb-6338a6c9bfd2": Archive: gradle.zip Step #1 - "build-435ad16a-7083-40dd-bfeb-6338a6c9bfd2": creating: /src/gradle/gradle-7.4.2/ Step #1 - "build-435ad16a-7083-40dd-bfeb-6338a6c9bfd2": inflating: /src/gradle/gradle-7.4.2/LICENSE Step #1 - "build-435ad16a-7083-40dd-bfeb-6338a6c9bfd2": inflating: /src/gradle/gradle-7.4.2/NOTICE Step #1 - "build-435ad16a-7083-40dd-bfeb-6338a6c9bfd2": inflating: /src/gradle/gradle-7.4.2/README Step #1 - "build-435ad16a-7083-40dd-bfeb-6338a6c9bfd2": creating: /src/gradle/gradle-7.4.2/init.d/ Step #1 - "build-435ad16a-7083-40dd-bfeb-6338a6c9bfd2": inflating: /src/gradle/gradle-7.4.2/init.d/readme.txt Step #1 - "build-435ad16a-7083-40dd-bfeb-6338a6c9bfd2": creating: /src/gradle/gradle-7.4.2/bin/ Step #1 - "build-435ad16a-7083-40dd-bfeb-6338a6c9bfd2": inflating: /src/gradle/gradle-7.4.2/bin/gradle Step #1 - "build-435ad16a-7083-40dd-bfeb-6338a6c9bfd2": inflating: /src/gradle/gradle-7.4.2/bin/gradle.bat Step #1 - "build-435ad16a-7083-40dd-bfeb-6338a6c9bfd2": creating: /src/gradle/gradle-7.4.2/lib/ Step #1 - "build-435ad16a-7083-40dd-bfeb-6338a6c9bfd2": inflating: /src/gradle/gradle-7.4.2/lib/gradle-runtime-api-info-7.4.2.jar Step #1 - "build-435ad16a-7083-40dd-bfeb-6338a6c9bfd2": inflating: /src/gradle/gradle-7.4.2/lib/gradle-installation-beacon-7.4.2.jar Step #1 - "build-435ad16a-7083-40dd-bfeb-6338a6c9bfd2": inflating: /src/gradle/gradle-7.4.2/lib/gradle-api-metadata-7.4.2.jar Step #1 - "build-435ad16a-7083-40dd-bfeb-6338a6c9bfd2": inflating: /src/gradle/gradle-7.4.2/lib/gradle-launcher-7.4.2.jar Step #1 - "build-435ad16a-7083-40dd-bfeb-6338a6c9bfd2": inflating: /src/gradle/gradle-7.4.2/lib/gradle-kotlin-dsl-7.4.2.jar Step #1 - "build-435ad16a-7083-40dd-bfeb-6338a6c9bfd2": inflating: /src/gradle/gradle-7.4.2/lib/gradle-build-events-7.4.2.jar Step #1 - "build-435ad16a-7083-40dd-bfeb-6338a6c9bfd2": inflating: /src/gradle/gradle-7.4.2/lib/gradle-tooling-api-7.4.2.jar Step #1 - "build-435ad16a-7083-40dd-bfeb-6338a6c9bfd2": inflating: /src/gradle/gradle-7.4.2/lib/gradle-core-7.4.2.jar Step #1 - "build-435ad16a-7083-40dd-bfeb-6338a6c9bfd2": inflating: /src/gradle/gradle-7.4.2/lib/gradle-file-collections-7.4.2.jar Step #1 - "build-435ad16a-7083-40dd-bfeb-6338a6c9bfd2": inflating: /src/gradle/gradle-7.4.2/lib/gradle-jvm-services-7.4.2.jar Step #1 - "build-435ad16a-7083-40dd-bfeb-6338a6c9bfd2": inflating: /src/gradle/gradle-7.4.2/lib/gradle-execution-7.4.2.jar Step #1 - "build-435ad16a-7083-40dd-bfeb-6338a6c9bfd2": inflating: /src/gradle/gradle-7.4.2/lib/gradle-model-groovy-7.4.2.jar Step #1 - "build-435ad16a-7083-40dd-bfeb-6338a6c9bfd2": inflating: /src/gradle/gradle-7.4.2/lib/gradle-model-core-7.4.2.jar Step #1 - "build-435ad16a-7083-40dd-bfeb-6338a6c9bfd2": inflating: /src/gradle/gradle-7.4.2/lib/gradle-build-cache-7.4.2.jar Step #1 - "build-435ad16a-7083-40dd-bfeb-6338a6c9bfd2": inflating: /src/gradle/gradle-7.4.2/lib/gradle-core-api-7.4.2.jar Step #1 - "build-435ad16a-7083-40dd-bfeb-6338a6c9bfd2": inflating: /src/gradle/gradle-7.4.2/lib/gradle-persistent-cache-7.4.2.jar Step #1 - "build-435ad16a-7083-40dd-bfeb-6338a6c9bfd2": inflating: /src/gradle/gradle-7.4.2/lib/gradle-worker-processes-7.4.2.jar Step #1 - "build-435ad16a-7083-40dd-bfeb-6338a6c9bfd2": inflating: /src/gradle/gradle-7.4.2/lib/gradle-logging-7.4.2.jar Step #1 - "build-435ad16a-7083-40dd-bfeb-6338a6c9bfd2": inflating: /src/gradle/gradle-7.4.2/lib/groovy-ant-3.0.9.jar Step #1 - "build-435ad16a-7083-40dd-bfeb-6338a6c9bfd2": inflating: /src/gradle/gradle-7.4.2/lib/ant-junit-1.10.11.jar Step #1 - "build-435ad16a-7083-40dd-bfeb-6338a6c9bfd2": inflating: /src/gradle/gradle-7.4.2/lib/ant-1.10.11.jar Step #1 - "build-435ad16a-7083-40dd-bfeb-6338a6c9bfd2": inflating: /src/gradle/gradle-7.4.2/lib/ant-launcher-1.10.11.jar Step #1 - "build-435ad16a-7083-40dd-bfeb-6338a6c9bfd2": inflating: /src/gradle/gradle-7.4.2/lib/gradle-process-services-7.4.2.jar Step #1 - "build-435ad16a-7083-40dd-bfeb-6338a6c9bfd2": inflating: /src/gradle/gradle-7.4.2/lib/gradle-resources-7.4.2.jar Step #1 - "build-435ad16a-7083-40dd-bfeb-6338a6c9bfd2": inflating: /src/gradle/gradle-7.4.2/lib/gradle-messaging-7.4.2.jar Step #1 - "build-435ad16a-7083-40dd-bfeb-6338a6c9bfd2": inflating: /src/gradle/gradle-7.4.2/lib/gradle-native-7.4.2.jar Step #1 - "build-435ad16a-7083-40dd-bfeb-6338a6c9bfd2": inflating: /src/gradle/gradle-7.4.2/lib/gradle-base-services-groovy-7.4.2.jar Step #1 - "build-435ad16a-7083-40dd-bfeb-6338a6c9bfd2": inflating: /src/gradle/gradle-7.4.2/lib/gradle-file-temp-7.4.2.jar Step #1 - "build-435ad16a-7083-40dd-bfeb-6338a6c9bfd2": inflating: /src/gradle/gradle-7.4.2/lib/gradle-base-services-7.4.2.jar Step #1 - "build-435ad16a-7083-40dd-bfeb-6338a6c9bfd2": inflating: /src/gradle/gradle-7.4.2/lib/gradle-normalization-java-7.4.2.jar Step #1 - "build-435ad16a-7083-40dd-bfeb-6338a6c9bfd2": inflating: /src/gradle/gradle-7.4.2/lib/asm-commons-9.2.jar Step #1 - "build-435ad16a-7083-40dd-bfeb-6338a6c9bfd2": inflating: /src/gradle/gradle-7.4.2/lib/asm-analysis-9.2.jar Step #1 - "build-435ad16a-7083-40dd-bfeb-6338a6c9bfd2": inflating: /src/gradle/gradle-7.4.2/lib/asm-tree-9.2.jar Step #1 - "build-435ad16a-7083-40dd-bfeb-6338a6c9bfd2": inflating: /src/gradle/gradle-7.4.2/lib/asm-9.2.jar Step #1 - "build-435ad16a-7083-40dd-bfeb-6338a6c9bfd2": inflating: /src/gradle/gradle-7.4.2/lib/gradle-build-cache-packaging-7.4.2.jar Step #1 - "build-435ad16a-7083-40dd-bfeb-6338a6c9bfd2": inflating: /src/gradle/gradle-7.4.2/lib/commons-compress-1.21.jar Step #1 - "build-435ad16a-7083-40dd-bfeb-6338a6c9bfd2": inflating: /src/gradle/gradle-7.4.2/lib/commons-io-2.6.jar Step #1 - "build-435ad16a-7083-40dd-bfeb-6338a6c9bfd2": inflating: /src/gradle/gradle-7.4.2/lib/gradle-build-option-7.4.2.jar Step #1 - "build-435ad16a-7083-40dd-bfeb-6338a6c9bfd2": inflating: /src/gradle/gradle-7.4.2/lib/commons-lang-2.6.jar Step #1 - "build-435ad16a-7083-40dd-bfeb-6338a6c9bfd2": inflating: /src/gradle/gradle-7.4.2/lib/fastutil-8.5.2-min.jar Step #1 - "build-435ad16a-7083-40dd-bfeb-6338a6c9bfd2": inflating: /src/gradle/gradle-7.4.2/lib/groovy-json-3.0.9.jar Step #1 - "build-435ad16a-7083-40dd-bfeb-6338a6c9bfd2": inflating: /src/gradle/gradle-7.4.2/lib/groovy-astbuilder-3.0.9.jar Step #1 - "build-435ad16a-7083-40dd-bfeb-6338a6c9bfd2": inflating: /src/gradle/gradle-7.4.2/lib/groovy-console-3.0.9.jar Step #1 - "build-435ad16a-7083-40dd-bfeb-6338a6c9bfd2": inflating: /src/gradle/gradle-7.4.2/lib/groovy-dateutil-3.0.9.jar Step #1 - "build-435ad16a-7083-40dd-bfeb-6338a6c9bfd2": inflating: /src/gradle/gradle-7.4.2/lib/groovy-datetime-3.0.9.jar Step #1 - "build-435ad16a-7083-40dd-bfeb-6338a6c9bfd2": inflating: /src/gradle/gradle-7.4.2/lib/groovy-groovydoc-3.0.9.jar Step #1 - "build-435ad16a-7083-40dd-bfeb-6338a6c9bfd2": inflating: /src/gradle/gradle-7.4.2/lib/groovy-nio-3.0.9.jar Step #1 - "build-435ad16a-7083-40dd-bfeb-6338a6c9bfd2": inflating: /src/gradle/gradle-7.4.2/lib/groovy-sql-3.0.9.jar Step #1 - "build-435ad16a-7083-40dd-bfeb-6338a6c9bfd2": inflating: /src/gradle/gradle-7.4.2/lib/groovy-docgenerator-3.0.9.jar Step #1 - "build-435ad16a-7083-40dd-bfeb-6338a6c9bfd2": inflating: /src/gradle/gradle-7.4.2/lib/groovy-templates-3.0.9.jar Step #1 - "build-435ad16a-7083-40dd-bfeb-6338a6c9bfd2": inflating: /src/gradle/gradle-7.4.2/lib/groovy-test-3.0.9.jar Step #1 - "build-435ad16a-7083-40dd-bfeb-6338a6c9bfd2": inflating: /src/gradle/gradle-7.4.2/lib/groovy-xml-3.0.9.jar Step #1 - "build-435ad16a-7083-40dd-bfeb-6338a6c9bfd2": inflating: /src/gradle/gradle-7.4.2/lib/groovy-swing-3.0.9.jar Step #1 - "build-435ad16a-7083-40dd-bfeb-6338a6c9bfd2": inflating: /src/gradle/gradle-7.4.2/lib/groovy-3.0.9.jar Step #1 - "build-435ad16a-7083-40dd-bfeb-6338a6c9bfd2": inflating: /src/gradle/gradle-7.4.2/lib/gradle-file-watching-7.4.2.jar Step #1 - "build-435ad16a-7083-40dd-bfeb-6338a6c9bfd2": inflating: /src/gradle/gradle-7.4.2/lib/gradle-snapshots-7.4.2.jar Step #1 - "build-435ad16a-7083-40dd-bfeb-6338a6c9bfd2": inflating: /src/gradle/gradle-7.4.2/lib/gradle-build-cache-base-7.4.2.jar Step #1 - "build-435ad16a-7083-40dd-bfeb-6338a6c9bfd2": inflating: /src/gradle/gradle-7.4.2/lib/gradle-files-7.4.2.jar Step #1 - "build-435ad16a-7083-40dd-bfeb-6338a6c9bfd2": inflating: /src/gradle/gradle-7.4.2/lib/gradle-hashing-7.4.2.jar Step #1 - "build-435ad16a-7083-40dd-bfeb-6338a6c9bfd2": inflating: /src/gradle/gradle-7.4.2/lib/guava-30.1.1-jre.jar Step #1 - "build-435ad16a-7083-40dd-bfeb-6338a6c9bfd2": inflating: /src/gradle/gradle-7.4.2/lib/junit-4.13.2.jar Step #1 - "build-435ad16a-7083-40dd-bfeb-6338a6c9bfd2": inflating: /src/gradle/gradle-7.4.2/lib/hamcrest-core-1.3.jar Step #1 - "build-435ad16a-7083-40dd-bfeb-6338a6c9bfd2": inflating: /src/gradle/gradle-7.4.2/lib/javax.inject-1.jar Step #1 - "build-435ad16a-7083-40dd-bfeb-6338a6c9bfd2": inflating: /src/gradle/gradle-7.4.2/lib/jansi-1.18.jar Step #1 - "build-435ad16a-7083-40dd-bfeb-6338a6c9bfd2": inflating: /src/gradle/gradle-7.4.2/lib/jcl-over-slf4j-1.7.30.jar Step #1 - "build-435ad16a-7083-40dd-bfeb-6338a6c9bfd2": inflating: /src/gradle/gradle-7.4.2/lib/kotlin-stdlib-jdk8-1.5.31.jar Step #1 - "build-435ad16a-7083-40dd-bfeb-6338a6c9bfd2": inflating: /src/gradle/gradle-7.4.2/lib/kotlin-compiler-embeddable-1.5.31-patched-for-gradle-7.4.2.jar Step #1 - "build-435ad16a-7083-40dd-bfeb-6338a6c9bfd2": inflating: /src/gradle/gradle-7.4.2/lib/kotlin-stdlib-jdk7-1.5.31.jar Step #1 - "build-435ad16a-7083-40dd-bfeb-6338a6c9bfd2": inflating: /src/gradle/gradle-7.4.2/lib/kotlin-reflect-1.5.31.jar Step #1 - "build-435ad16a-7083-40dd-bfeb-6338a6c9bfd2": inflating: /src/gradle/gradle-7.4.2/lib/kotlin-stdlib-1.5.31.jar Step #1 - "build-435ad16a-7083-40dd-bfeb-6338a6c9bfd2": inflating: /src/gradle/gradle-7.4.2/lib/annotations-20.1.0.jar Step #1 - "build-435ad16a-7083-40dd-bfeb-6338a6c9bfd2": inflating: /src/gradle/gradle-7.4.2/lib/gradle-enterprise-operations-7.4.2.jar Step #1 - "build-435ad16a-7083-40dd-bfeb-6338a6c9bfd2": inflating: /src/gradle/gradle-7.4.2/lib/gradle-bootstrap-7.4.2.jar Step #1 - "build-435ad16a-7083-40dd-bfeb-6338a6c9bfd2": inflating: /src/gradle/gradle-7.4.2/lib/gradle-problems-7.4.2.jar Step #1 - "build-435ad16a-7083-40dd-bfeb-6338a6c9bfd2": inflating: /src/gradle/gradle-7.4.2/lib/gradle-kotlin-dsl-tooling-models-7.4.2.jar Step #1 - "build-435ad16a-7083-40dd-bfeb-6338a6c9bfd2": inflating: /src/gradle/gradle-7.4.2/lib/gradle-functional-7.4.2.jar Step #1 - "build-435ad16a-7083-40dd-bfeb-6338a6c9bfd2": inflating: /src/gradle/gradle-7.4.2/lib/gradle-worker-services-7.4.2.jar Step #1 - "build-435ad16a-7083-40dd-bfeb-6338a6c9bfd2": inflating: /src/gradle/gradle-7.4.2/lib/gradle-build-operations-7.4.2.jar Step #1 - "build-435ad16a-7083-40dd-bfeb-6338a6c9bfd2": inflating: /src/gradle/gradle-7.4.2/lib/gradle-enterprise-workers-7.4.2.jar Step #1 - "build-435ad16a-7083-40dd-bfeb-6338a6c9bfd2": inflating: /src/gradle/gradle-7.4.2/lib/gradle-base-annotations-7.4.2.jar Step #1 - "build-435ad16a-7083-40dd-bfeb-6338a6c9bfd2": inflating: /src/gradle/gradle-7.4.2/lib/tomlj-1.0.0.jar Step #1 - "build-435ad16a-7083-40dd-bfeb-6338a6c9bfd2": inflating: /src/gradle/gradle-7.4.2/lib/jsr305-3.0.2.jar Step #1 - "build-435ad16a-7083-40dd-bfeb-6338a6c9bfd2": inflating: /src/gradle/gradle-7.4.2/lib/jul-to-slf4j-1.7.30.jar Step #1 - "build-435ad16a-7083-40dd-bfeb-6338a6c9bfd2": inflating: /src/gradle/gradle-7.4.2/lib/kryo-2.24.0.jar Step #1 - "build-435ad16a-7083-40dd-bfeb-6338a6c9bfd2": inflating: /src/gradle/gradle-7.4.2/lib/log4j-over-slf4j-1.7.30.jar Step #1 - "build-435ad16a-7083-40dd-bfeb-6338a6c9bfd2": inflating: /src/gradle/gradle-7.4.2/lib/minlog-1.2.jar Step #1 - "build-435ad16a-7083-40dd-bfeb-6338a6c9bfd2": inflating: /src/gradle/gradle-7.4.2/lib/native-platform-0.22-milestone-23.jar Step #1 - "build-435ad16a-7083-40dd-bfeb-6338a6c9bfd2": inflating: /src/gradle/gradle-7.4.2/lib/file-events-0.22-milestone-23.jar Step #1 - "build-435ad16a-7083-40dd-bfeb-6338a6c9bfd2": inflating: /src/gradle/gradle-7.4.2/lib/objenesis-2.6.jar Step #1 - "build-435ad16a-7083-40dd-bfeb-6338a6c9bfd2": inflating: /src/gradle/gradle-7.4.2/lib/slf4j-api-1.7.30.jar Step #1 - "build-435ad16a-7083-40dd-bfeb-6338a6c9bfd2": inflating: /src/gradle/gradle-7.4.2/lib/trove4j-1.0.20181211.jar Step #1 - "build-435ad16a-7083-40dd-bfeb-6338a6c9bfd2": inflating: /src/gradle/gradle-7.4.2/lib/xml-apis-1.4.01.jar Step #1 - "build-435ad16a-7083-40dd-bfeb-6338a6c9bfd2": inflating: /src/gradle/gradle-7.4.2/lib/javaparser-core-3.17.0.jar Step #1 - "build-435ad16a-7083-40dd-bfeb-6338a6c9bfd2": inflating: /src/gradle/gradle-7.4.2/lib/gradle-wrapper-7.4.2.jar Step #1 - "build-435ad16a-7083-40dd-bfeb-6338a6c9bfd2": inflating: /src/gradle/gradle-7.4.2/lib/gradle-cli-7.4.2.jar Step #1 - "build-435ad16a-7083-40dd-bfeb-6338a6c9bfd2": inflating: /src/gradle/gradle-7.4.2/lib/kotlin-script-runtime-1.5.31.jar Step #1 - "build-435ad16a-7083-40dd-bfeb-6338a6c9bfd2": inflating: /src/gradle/gradle-7.4.2/lib/kotlin-daemon-embeddable-1.5.31.jar Step #1 - "build-435ad16a-7083-40dd-bfeb-6338a6c9bfd2": inflating: /src/gradle/gradle-7.4.2/lib/kotlin-scripting-common-1.5.31.jar Step #1 - "build-435ad16a-7083-40dd-bfeb-6338a6c9bfd2": inflating: /src/gradle/gradle-7.4.2/lib/kotlin-scripting-jvm-1.5.31.jar Step #1 - "build-435ad16a-7083-40dd-bfeb-6338a6c9bfd2": inflating: /src/gradle/gradle-7.4.2/lib/kotlin-scripting-jvm-host-1.5.31.jar Step #1 - "build-435ad16a-7083-40dd-bfeb-6338a6c9bfd2": inflating: /src/gradle/gradle-7.4.2/lib/kotlin-scripting-compiler-embeddable-1.5.31.jar Step #1 - "build-435ad16a-7083-40dd-bfeb-6338a6c9bfd2": inflating: /src/gradle/gradle-7.4.2/lib/kotlin-scripting-compiler-impl-embeddable-1.5.31.jar Step #1 - "build-435ad16a-7083-40dd-bfeb-6338a6c9bfd2": inflating: /src/gradle/gradle-7.4.2/lib/kotlin-sam-with-receiver-compiler-plugin-1.5.31.jar Step #1 - "build-435ad16a-7083-40dd-bfeb-6338a6c9bfd2": inflating: /src/gradle/gradle-7.4.2/lib/kotlinx-metadata-jvm-0.3.0.jar Step #1 - "build-435ad16a-7083-40dd-bfeb-6338a6c9bfd2": inflating: /src/gradle/gradle-7.4.2/lib/failureaccess-1.0.1.jar Step #1 - "build-435ad16a-7083-40dd-bfeb-6338a6c9bfd2": inflating: /src/gradle/gradle-7.4.2/lib/native-platform-freebsd-amd64-libcpp-0.22-milestone-23.jar Step #1 - "build-435ad16a-7083-40dd-bfeb-6338a6c9bfd2": inflating: /src/gradle/gradle-7.4.2/lib/native-platform-linux-aarch64-0.22-milestone-23.jar Step #1 - "build-435ad16a-7083-40dd-bfeb-6338a6c9bfd2": inflating: /src/gradle/gradle-7.4.2/lib/native-platform-linux-amd64-0.22-milestone-23.jar Step #1 - "build-435ad16a-7083-40dd-bfeb-6338a6c9bfd2": inflating: /src/gradle/gradle-7.4.2/lib/native-platform-osx-aarch64-0.22-milestone-23.jar Step #1 - "build-435ad16a-7083-40dd-bfeb-6338a6c9bfd2": inflating: /src/gradle/gradle-7.4.2/lib/native-platform-osx-amd64-0.22-milestone-23.jar Step #1 - "build-435ad16a-7083-40dd-bfeb-6338a6c9bfd2": inflating: /src/gradle/gradle-7.4.2/lib/native-platform-windows-amd64-0.22-milestone-23.jar Step #1 - "build-435ad16a-7083-40dd-bfeb-6338a6c9bfd2": inflating: /src/gradle/gradle-7.4.2/lib/native-platform-windows-amd64-min-0.22-milestone-23.jar Step #1 - "build-435ad16a-7083-40dd-bfeb-6338a6c9bfd2": inflating: /src/gradle/gradle-7.4.2/lib/native-platform-windows-i386-0.22-milestone-23.jar Step #1 - "build-435ad16a-7083-40dd-bfeb-6338a6c9bfd2": inflating: /src/gradle/gradle-7.4.2/lib/native-platform-windows-i386-min-0.22-milestone-23.jar Step #1 - "build-435ad16a-7083-40dd-bfeb-6338a6c9bfd2": inflating: /src/gradle/gradle-7.4.2/lib/native-platform-linux-aarch64-ncurses5-0.22-milestone-23.jar Step #1 - "build-435ad16a-7083-40dd-bfeb-6338a6c9bfd2": inflating: /src/gradle/gradle-7.4.2/lib/native-platform-linux-aarch64-ncurses6-0.22-milestone-23.jar Step #1 - "build-435ad16a-7083-40dd-bfeb-6338a6c9bfd2": inflating: /src/gradle/gradle-7.4.2/lib/native-platform-linux-amd64-ncurses5-0.22-milestone-23.jar Step #1 - "build-435ad16a-7083-40dd-bfeb-6338a6c9bfd2": inflating: /src/gradle/gradle-7.4.2/lib/native-platform-linux-amd64-ncurses6-0.22-milestone-23.jar Step #1 - "build-435ad16a-7083-40dd-bfeb-6338a6c9bfd2": inflating: /src/gradle/gradle-7.4.2/lib/file-events-linux-aarch64-0.22-milestone-23.jar Step #1 - "build-435ad16a-7083-40dd-bfeb-6338a6c9bfd2": inflating: /src/gradle/gradle-7.4.2/lib/file-events-linux-amd64-0.22-milestone-23.jar Step #1 - "build-435ad16a-7083-40dd-bfeb-6338a6c9bfd2": inflating: /src/gradle/gradle-7.4.2/lib/file-events-osx-aarch64-0.22-milestone-23.jar Step #1 - "build-435ad16a-7083-40dd-bfeb-6338a6c9bfd2": inflating: /src/gradle/gradle-7.4.2/lib/file-events-osx-amd64-0.22-milestone-23.jar Step #1 - "build-435ad16a-7083-40dd-bfeb-6338a6c9bfd2": inflating: /src/gradle/gradle-7.4.2/lib/file-events-windows-amd64-0.22-milestone-23.jar Step #1 - "build-435ad16a-7083-40dd-bfeb-6338a6c9bfd2": inflating: /src/gradle/gradle-7.4.2/lib/file-events-windows-amd64-min-0.22-milestone-23.jar Step #1 - "build-435ad16a-7083-40dd-bfeb-6338a6c9bfd2": inflating: /src/gradle/gradle-7.4.2/lib/file-events-windows-i386-0.22-milestone-23.jar Step #1 - "build-435ad16a-7083-40dd-bfeb-6338a6c9bfd2": inflating: /src/gradle/gradle-7.4.2/lib/file-events-windows-i386-min-0.22-milestone-23.jar Step #1 - "build-435ad16a-7083-40dd-bfeb-6338a6c9bfd2": inflating: /src/gradle/gradle-7.4.2/lib/ant-antlr-1.10.11.jar Step #1 - "build-435ad16a-7083-40dd-bfeb-6338a6c9bfd2": inflating: /src/gradle/gradle-7.4.2/lib/antlr4-runtime-4.7.2.jar Step #1 - "build-435ad16a-7083-40dd-bfeb-6338a6c9bfd2": inflating: /src/gradle/gradle-7.4.2/lib/kotlin-stdlib-common-1.5.31.jar Step #1 - "build-435ad16a-7083-40dd-bfeb-6338a6c9bfd2": inflating: /src/gradle/gradle-7.4.2/lib/qdox-1.12.1.jar Step #1 - "build-435ad16a-7083-40dd-bfeb-6338a6c9bfd2": creating: /src/gradle/gradle-7.4.2/lib/plugins/ Step #1 - "build-435ad16a-7083-40dd-bfeb-6338a6c9bfd2": inflating: /src/gradle/gradle-7.4.2/lib/plugins/gradle-kotlin-dsl-provider-plugins-7.4.2.jar Step #1 - "build-435ad16a-7083-40dd-bfeb-6338a6c9bfd2": inflating: /src/gradle/gradle-7.4.2/lib/plugins/gradle-plugin-development-7.4.2.jar Step #1 - "build-435ad16a-7083-40dd-bfeb-6338a6c9bfd2": inflating: /src/gradle/gradle-7.4.2/lib/plugins/gradle-build-init-7.4.2.jar Step #1 - "build-435ad16a-7083-40dd-bfeb-6338a6c9bfd2": inflating: /src/gradle/gradle-7.4.2/lib/plugins/gradle-build-profile-7.4.2.jar Step #1 - "build-435ad16a-7083-40dd-bfeb-6338a6c9bfd2": inflating: /src/gradle/gradle-7.4.2/lib/plugins/gradle-antlr-7.4.2.jar Step #1 - "build-435ad16a-7083-40dd-bfeb-6338a6c9bfd2": inflating: /src/gradle/gradle-7.4.2/lib/plugins/gradle-enterprise-7.4.2.jar Step #1 - "build-435ad16a-7083-40dd-bfeb-6338a6c9bfd2": inflating: /src/gradle/gradle-7.4.2/lib/plugins/gradle-tooling-api-builders-7.4.2.jar Step #1 - "build-435ad16a-7083-40dd-bfeb-6338a6c9bfd2": inflating: /src/gradle/gradle-7.4.2/lib/plugins/gradle-configuration-cache-7.4.2.jar Step #1 - "build-435ad16a-7083-40dd-bfeb-6338a6c9bfd2": inflating: /src/gradle/gradle-7.4.2/lib/plugins/gradle-kotlin-dsl-tooling-builders-7.4.2.jar Step #1 - "build-435ad16a-7083-40dd-bfeb-6338a6c9bfd2": inflating: /src/gradle/gradle-7.4.2/lib/plugins/gradle-code-quality-7.4.2.jar Step #1 - "build-435ad16a-7083-40dd-bfeb-6338a6c9bfd2": inflating: /src/gradle/gradle-7.4.2/lib/plugins/gradle-signing-7.4.2.jar Step #1 - "build-435ad16a-7083-40dd-bfeb-6338a6c9bfd2": inflating: /src/gradle/gradle-7.4.2/lib/plugins/gradle-tooling-native-7.4.2.jar Step #1 - "build-435ad16a-7083-40dd-bfeb-6338a6c9bfd2": inflating: /src/gradle/gradle-7.4.2/lib/plugins/gradle-ide-native-7.4.2.jar Step #1 - "build-435ad16a-7083-40dd-bfeb-6338a6c9bfd2": inflating: /src/gradle/gradle-7.4.2/lib/plugins/gradle-ide-7.4.2.jar Step #1 - "build-435ad16a-7083-40dd-bfeb-6338a6c9bfd2": inflating: /src/gradle/gradle-7.4.2/lib/plugins/gradle-scala-7.4.2.jar Step #1 - "build-435ad16a-7083-40dd-bfeb-6338a6c9bfd2": inflating: /src/gradle/gradle-7.4.2/lib/plugins/gradle-ear-7.4.2.jar Step #1 - "build-435ad16a-7083-40dd-bfeb-6338a6c9bfd2": inflating: /src/gradle/gradle-7.4.2/lib/plugins/gradle-jacoco-7.4.2.jar Step #1 - "build-435ad16a-7083-40dd-bfeb-6338a6c9bfd2": inflating: /src/gradle/gradle-7.4.2/lib/plugins/gradle-testing-native-7.4.2.jar Step #1 - "build-435ad16a-7083-40dd-bfeb-6338a6c9bfd2": inflating: /src/gradle/gradle-7.4.2/lib/plugins/gradle-language-native-7.4.2.jar Step #1 - "build-435ad16a-7083-40dd-bfeb-6338a6c9bfd2": inflating: /src/gradle/gradle-7.4.2/lib/plugins/gradle-maven-7.4.2.jar Step #1 - "build-435ad16a-7083-40dd-bfeb-6338a6c9bfd2": inflating: /src/gradle/gradle-7.4.2/lib/plugins/gradle-ivy-7.4.2.jar Step #1 - "build-435ad16a-7083-40dd-bfeb-6338a6c9bfd2": inflating: /src/gradle/gradle-7.4.2/lib/plugins/gradle-plugins-7.4.2.jar Step #1 - "build-435ad16a-7083-40dd-bfeb-6338a6c9bfd2": inflating: /src/gradle/gradle-7.4.2/lib/plugins/gradle-testing-junit-platform-7.4.2.jar Step #1 - "build-435ad16a-7083-40dd-bfeb-6338a6c9bfd2": inflating: /src/gradle/gradle-7.4.2/lib/plugins/gradle-testing-jvm-7.4.2.jar Step #1 - "build-435ad16a-7083-40dd-bfeb-6338a6c9bfd2": inflating: /src/gradle/gradle-7.4.2/lib/plugins/gradle-language-groovy-7.4.2.jar Step #1 - "build-435ad16a-7083-40dd-bfeb-6338a6c9bfd2": inflating: /src/gradle/gradle-7.4.2/lib/plugins/gradle-language-java-7.4.2.jar Step #1 - "build-435ad16a-7083-40dd-bfeb-6338a6c9bfd2": inflating: /src/gradle/gradle-7.4.2/lib/plugins/gradle-language-jvm-7.4.2.jar Step #1 - "build-435ad16a-7083-40dd-bfeb-6338a6c9bfd2": inflating: /src/gradle/gradle-7.4.2/lib/plugins/gradle-platform-jvm-7.4.2.jar Step #1 - "build-435ad16a-7083-40dd-bfeb-6338a6c9bfd2": inflating: /src/gradle/gradle-7.4.2/lib/plugins/gradle-composite-builds-7.4.2.jar Step #1 - "build-435ad16a-7083-40dd-bfeb-6338a6c9bfd2": inflating: /src/gradle/gradle-7.4.2/lib/plugins/gradle-plugin-use-7.4.2.jar Step #1 - "build-435ad16a-7083-40dd-bfeb-6338a6c9bfd2": inflating: /src/gradle/gradle-7.4.2/lib/plugins/gradle-publish-7.4.2.jar Step #1 - "build-435ad16a-7083-40dd-bfeb-6338a6c9bfd2": inflating: /src/gradle/gradle-7.4.2/lib/plugins/gradle-testing-base-7.4.2.jar Step #1 - "build-435ad16a-7083-40dd-bfeb-6338a6c9bfd2": inflating: /src/gradle/gradle-7.4.2/lib/plugins/gradle-platform-native-7.4.2.jar Step #1 - "build-435ad16a-7083-40dd-bfeb-6338a6c9bfd2": inflating: /src/gradle/gradle-7.4.2/lib/plugins/gradle-diagnostics-7.4.2.jar Step #1 - "build-435ad16a-7083-40dd-bfeb-6338a6c9bfd2": inflating: /src/gradle/gradle-7.4.2/lib/plugins/gradle-platform-base-7.4.2.jar Step #1 - "build-435ad16a-7083-40dd-bfeb-6338a6c9bfd2": inflating: /src/gradle/gradle-7.4.2/lib/plugins/gradle-version-control-7.4.2.jar Step #1 - "build-435ad16a-7083-40dd-bfeb-6338a6c9bfd2": inflating: /src/gradle/gradle-7.4.2/lib/plugins/gradle-dependency-management-7.4.2.jar Step #1 - "build-435ad16a-7083-40dd-bfeb-6338a6c9bfd2": inflating: /src/gradle/gradle-7.4.2/lib/plugins/gradle-reporting-7.4.2.jar Step #1 - "build-435ad16a-7083-40dd-bfeb-6338a6c9bfd2": inflating: /src/gradle/gradle-7.4.2/lib/plugins/gradle-workers-7.4.2.jar Step #1 - "build-435ad16a-7083-40dd-bfeb-6338a6c9bfd2": inflating: /src/gradle/gradle-7.4.2/lib/plugins/gradle-test-kit-7.4.2.jar Step #1 - "build-435ad16a-7083-40dd-bfeb-6338a6c9bfd2": inflating: /src/gradle/gradle-7.4.2/lib/plugins/gradle-resources-s3-7.4.2.jar Step #1 - "build-435ad16a-7083-40dd-bfeb-6338a6c9bfd2": inflating: /src/gradle/gradle-7.4.2/lib/plugins/gradle-resources-gcs-7.4.2.jar Step #1 - "build-435ad16a-7083-40dd-bfeb-6338a6c9bfd2": inflating: /src/gradle/gradle-7.4.2/lib/plugins/gradle-build-cache-http-7.4.2.jar Step #1 - "build-435ad16a-7083-40dd-bfeb-6338a6c9bfd2": inflating: /src/gradle/gradle-7.4.2/lib/plugins/gradle-security-7.4.2.jar Step #1 - "build-435ad16a-7083-40dd-bfeb-6338a6c9bfd2": inflating: /src/gradle/gradle-7.4.2/lib/plugins/gradle-resources-http-7.4.2.jar Step #1 - "build-435ad16a-7083-40dd-bfeb-6338a6c9bfd2": inflating: /src/gradle/gradle-7.4.2/lib/plugins/gradle-resources-sftp-7.4.2.jar Step #1 - "build-435ad16a-7083-40dd-bfeb-6338a6c9bfd2": inflating: /src/gradle/gradle-7.4.2/lib/plugins/aws-java-sdk-s3-1.11.948.jar Step #1 - "build-435ad16a-7083-40dd-bfeb-6338a6c9bfd2": inflating: /src/gradle/gradle-7.4.2/lib/plugins/aws-java-sdk-kms-1.11.948.jar Step #1 - "build-435ad16a-7083-40dd-bfeb-6338a6c9bfd2": inflating: /src/gradle/gradle-7.4.2/lib/plugins/aws-java-sdk-sts-1.11.948.jar Step #1 - "build-435ad16a-7083-40dd-bfeb-6338a6c9bfd2": inflating: /src/gradle/gradle-7.4.2/lib/plugins/aws-java-sdk-core-1.11.948.jar Step #1 - "build-435ad16a-7083-40dd-bfeb-6338a6c9bfd2": inflating: /src/gradle/gradle-7.4.2/lib/plugins/org.eclipse.jgit-5.7.0.202003110725-r.jar Step #1 - "build-435ad16a-7083-40dd-bfeb-6338a6c9bfd2": inflating: /src/gradle/gradle-7.4.2/lib/plugins/bcpg-jdk15on-1.68.jar Step #1 - "build-435ad16a-7083-40dd-bfeb-6338a6c9bfd2": inflating: /src/gradle/gradle-7.4.2/lib/plugins/bcpkix-jdk15on-1.68.jar Step #1 - "build-435ad16a-7083-40dd-bfeb-6338a6c9bfd2": inflating: /src/gradle/gradle-7.4.2/lib/plugins/bcprov-jdk15on-1.68.jar Step #1 - "build-435ad16a-7083-40dd-bfeb-6338a6c9bfd2": inflating: /src/gradle/gradle-7.4.2/lib/plugins/testng-6.3.1.jar Step #1 - "build-435ad16a-7083-40dd-bfeb-6338a6c9bfd2": inflating: /src/gradle/gradle-7.4.2/lib/plugins/bsh-2.0b6.jar Step #1 - "build-435ad16a-7083-40dd-bfeb-6338a6c9bfd2": inflating: /src/gradle/gradle-7.4.2/lib/plugins/capsule-0.6.3.jar Step #1 - "build-435ad16a-7083-40dd-bfeb-6338a6c9bfd2": inflating: /src/gradle/gradle-7.4.2/lib/plugins/google-api-services-storage-v1-rev171-1.25.0.jar Step #1 - "build-435ad16a-7083-40dd-bfeb-6338a6c9bfd2": inflating: /src/gradle/gradle-7.4.2/lib/plugins/google-api-client-1.25.0.jar Step #1 - "build-435ad16a-7083-40dd-bfeb-6338a6c9bfd2": inflating: /src/gradle/gradle-7.4.2/lib/plugins/google-oauth-client-1.25.0.jar Step #1 - "build-435ad16a-7083-40dd-bfeb-6338a6c9bfd2": inflating: /src/gradle/gradle-7.4.2/lib/plugins/google-http-client-jackson2-1.25.0.jar Step #1 - "build-435ad16a-7083-40dd-bfeb-6338a6c9bfd2": inflating: /src/gradle/gradle-7.4.2/lib/plugins/google-http-client-1.25.0.jar Step #1 - "build-435ad16a-7083-40dd-bfeb-6338a6c9bfd2": inflating: /src/gradle/gradle-7.4.2/lib/plugins/httpclient-4.5.13.jar Step #1 - "build-435ad16a-7083-40dd-bfeb-6338a6c9bfd2": inflating: /src/gradle/gradle-7.4.2/lib/plugins/commons-codec-1.15.jar Step #1 - "build-435ad16a-7083-40dd-bfeb-6338a6c9bfd2": inflating: /src/gradle/gradle-7.4.2/lib/plugins/gson-2.8.6.jar Step #1 - "build-435ad16a-7083-40dd-bfeb-6338a6c9bfd2": inflating: /src/gradle/gradle-7.4.2/lib/plugins/jmespath-java-1.11.948.jar Step #1 - "build-435ad16a-7083-40dd-bfeb-6338a6c9bfd2": inflating: /src/gradle/gradle-7.4.2/lib/plugins/jackson-databind-2.12.1.jar Step #1 - "build-435ad16a-7083-40dd-bfeb-6338a6c9bfd2": inflating: /src/gradle/gradle-7.4.2/lib/plugins/jackson-core-2.12.1.jar Step #1 - "build-435ad16a-7083-40dd-bfeb-6338a6c9bfd2": inflating: /src/gradle/gradle-7.4.2/lib/plugins/jackson-annotations-2.12.1.jar Step #1 - "build-435ad16a-7083-40dd-bfeb-6338a6c9bfd2": inflating: /src/gradle/gradle-7.4.2/lib/plugins/httpcore-4.4.14.jar Step #1 - "build-435ad16a-7083-40dd-bfeb-6338a6c9bfd2": inflating: /src/gradle/gradle-7.4.2/lib/plugins/maven-settings-builder-3.6.3.jar Step #1 - "build-435ad16a-7083-40dd-bfeb-6338a6c9bfd2": inflating: /src/gradle/gradle-7.4.2/lib/plugins/ivy-2.3.0.jar Step #1 - "build-435ad16a-7083-40dd-bfeb-6338a6c9bfd2": inflating: /src/gradle/gradle-7.4.2/lib/plugins/jaxb-impl-3.0.0.jar Step #1 - "build-435ad16a-7083-40dd-bfeb-6338a6c9bfd2": inflating: /src/gradle/gradle-7.4.2/lib/plugins/jaxb-core-3.0.0.jar Step #1 - "build-435ad16a-7083-40dd-bfeb-6338a6c9bfd2": inflating: /src/gradle/gradle-7.4.2/lib/plugins/jakarta.xml.bind-api-3.0.0.jar Step #1 - "build-435ad16a-7083-40dd-bfeb-6338a6c9bfd2": inflating: /src/gradle/gradle-7.4.2/lib/plugins/jakarta.activation-2.0.0.jar Step #1 - "build-435ad16a-7083-40dd-bfeb-6338a6c9bfd2": inflating: /src/gradle/gradle-7.4.2/lib/plugins/jatl-0.2.3.jar Step #1 - "build-435ad16a-7083-40dd-bfeb-6338a6c9bfd2": inflating: /src/gradle/gradle-7.4.2/lib/plugins/jcifs-1.3.17.jar Step #1 - "build-435ad16a-7083-40dd-bfeb-6338a6c9bfd2": inflating: /src/gradle/gradle-7.4.2/lib/plugins/jcommander-1.78.jar Step #1 - "build-435ad16a-7083-40dd-bfeb-6338a6c9bfd2": inflating: /src/gradle/gradle-7.4.2/lib/plugins/joda-time-2.10.4.jar Step #1 - "build-435ad16a-7083-40dd-bfeb-6338a6c9bfd2": inflating: /src/gradle/gradle-7.4.2/lib/plugins/jsch-0.1.55.jar Step #1 - "build-435ad16a-7083-40dd-bfeb-6338a6c9bfd2": inflating: /src/gradle/gradle-7.4.2/lib/plugins/junit-platform-engine-1.7.2.jar Step #1 - "build-435ad16a-7083-40dd-bfeb-6338a6c9bfd2": inflating: /src/gradle/gradle-7.4.2/lib/plugins/junit-platform-commons-1.7.2.jar Step #1 - "build-435ad16a-7083-40dd-bfeb-6338a6c9bfd2": inflating: /src/gradle/gradle-7.4.2/lib/plugins/junit-platform-launcher-1.7.2.jar Step #1 - "build-435ad16a-7083-40dd-bfeb-6338a6c9bfd2": inflating: /src/gradle/gradle-7.4.2/lib/plugins/jzlib-1.1.3.jar Step #1 - "build-435ad16a-7083-40dd-bfeb-6338a6c9bfd2": inflating: /src/gradle/gradle-7.4.2/lib/plugins/maven-builder-support-3.6.3.jar Step #1 - "build-435ad16a-7083-40dd-bfeb-6338a6c9bfd2": inflating: /src/gradle/gradle-7.4.2/lib/plugins/maven-model-3.6.3.jar Step #1 - "build-435ad16a-7083-40dd-bfeb-6338a6c9bfd2": inflating: /src/gradle/gradle-7.4.2/lib/plugins/maven-repository-metadata-3.6.3.jar Step #1 - "build-435ad16a-7083-40dd-bfeb-6338a6c9bfd2": inflating: /src/gradle/gradle-7.4.2/lib/plugins/maven-settings-3.6.3.jar Step #1 - "build-435ad16a-7083-40dd-bfeb-6338a6c9bfd2": inflating: /src/gradle/gradle-7.4.2/lib/plugins/nekohtml-1.9.22.jar Step #1 - "build-435ad16a-7083-40dd-bfeb-6338a6c9bfd2": inflating: /src/gradle/gradle-7.4.2/lib/plugins/plexus-sec-dispatcher-1.4.jar Step #1 - "build-435ad16a-7083-40dd-bfeb-6338a6c9bfd2": inflating: /src/gradle/gradle-7.4.2/lib/plugins/plexus-cipher-1.7.jar Step #1 - "build-435ad16a-7083-40dd-bfeb-6338a6c9bfd2": inflating: /src/gradle/gradle-7.4.2/lib/plugins/plexus-interpolation-1.26.jar Step #1 - "build-435ad16a-7083-40dd-bfeb-6338a6c9bfd2": inflating: /src/gradle/gradle-7.4.2/lib/plugins/plexus-utils-3.3.0.jar Step #1 - "build-435ad16a-7083-40dd-bfeb-6338a6c9bfd2": inflating: /src/gradle/gradle-7.4.2/lib/plugins/dd-plist-1.21.jar Step #1 - "build-435ad16a-7083-40dd-bfeb-6338a6c9bfd2": inflating: /src/gradle/gradle-7.4.2/lib/plugins/snakeyaml-1.28.jar Step #1 - "build-435ad16a-7083-40dd-bfeb-6338a6c9bfd2": inflating: /src/gradle/gradle-7.4.2/lib/plugins/xercesImpl-2.12.0.jar Step #1 - "build-435ad16a-7083-40dd-bfeb-6338a6c9bfd2": inflating: /src/gradle/gradle-7.4.2/lib/plugins/gradle-java-compiler-plugin-7.4.2.jar Step #1 - "build-435ad16a-7083-40dd-bfeb-6338a6c9bfd2": inflating: /src/gradle/gradle-7.4.2/lib/plugins/ion-java-1.0.2.jar Step #1 - "build-435ad16a-7083-40dd-bfeb-6338a6c9bfd2": inflating: /src/gradle/gradle-7.4.2/lib/plugins/apiguardian-api-1.1.0.jar Step #1 - "build-435ad16a-7083-40dd-bfeb-6338a6c9bfd2": inflating: /src/gradle/gradle-7.4.2/lib/plugins/opentest4j-1.2.0.jar Step #1 - "build-435ad16a-7083-40dd-bfeb-6338a6c9bfd2": Removing intermediate container 14cdba80c246 Step #1 - "build-435ad16a-7083-40dd-bfeb-6338a6c9bfd2": ---> bfaa18a8a5c2 Step #1 - "build-435ad16a-7083-40dd-bfeb-6338a6c9bfd2": Step 3/9 : ENV GRADLE_HOME $SRC/gradle/gradle-7.4.2 Step #1 - "build-435ad16a-7083-40dd-bfeb-6338a6c9bfd2": ---> Running in 42820febe899 Step #1 - "build-435ad16a-7083-40dd-bfeb-6338a6c9bfd2": Removing intermediate container 42820febe899 Step #1 - "build-435ad16a-7083-40dd-bfeb-6338a6c9bfd2": ---> 4b9b8f78d359 Step #1 - "build-435ad16a-7083-40dd-bfeb-6338a6c9bfd2": Step 4/9 : ENV PATH $GRADLE_HOME/bin:$PATH Step #1 - "build-435ad16a-7083-40dd-bfeb-6338a6c9bfd2": ---> Running in 5e891721d7d2 Step #1 - "build-435ad16a-7083-40dd-bfeb-6338a6c9bfd2": Removing intermediate container 5e891721d7d2 Step #1 - "build-435ad16a-7083-40dd-bfeb-6338a6c9bfd2": ---> ff035f7fc6f8 Step #1 - "build-435ad16a-7083-40dd-bfeb-6338a6c9bfd2": Step 5/9 : RUN git clone --depth 1 https://github.com/strongcourage/fuzzing-corpus.git && zip -j $SRC/JunrarFuzzer_seed_corpus.zip fuzzing-corpus/rar/* && rm -rf fuzzing-corpus Step #1 - "build-435ad16a-7083-40dd-bfeb-6338a6c9bfd2": ---> Running in d6711c81bf16 Step #1 - "build-435ad16a-7083-40dd-bfeb-6338a6c9bfd2": Cloning into 'fuzzing-corpus'... Step #1 - "build-435ad16a-7083-40dd-bfeb-6338a6c9bfd2": Updating files: 40% (4213/10320) Updating files: 41% (4232/10320) Updating files: 42% (4335/10320) Updating files: 43% (4438/10320) Updating files: 44% (4541/10320) Updating files: 45% (4644/10320) Updating files: 46% (4748/10320) Updating files: 47% (4851/10320) Updating files: 48% (4954/10320) Updating files: 49% (5057/10320) Updating files: 50% (5160/10320) Updating files: 51% (5264/10320) Updating files: 52% (5367/10320) Updating files: 53% (5470/10320) Updating files: 54% (5573/10320) Updating files: 55% (5676/10320) Updating files: 56% (5780/10320) Updating files: 57% (5883/10320) Updating files: 58% (5986/10320) Updating files: 59% (6089/10320) Updating files: 60% (6192/10320) Updating files: 61% (6296/10320) Updating files: 62% (6399/10320) Updating files: 63% (6502/10320) Updating files: 64% (6605/10320) Updating files: 65% (6708/10320) Updating files: 66% (6812/10320) Updating files: 67% (6915/10320) Updating files: 68% (7018/10320) Updating files: 69% (7121/10320) Updating files: 70% (7224/10320) Updating files: 71% (7328/10320) Updating files: 72% (7431/10320) Updating files: 73% (7534/10320) Updating files: 74% (7637/10320) Updating files: 75% (7740/10320) Updating files: 76% (7844/10320) Updating files: 77% (7947/10320) Updating files: 78% (8050/10320) Updating files: 79% (8153/10320) Updating files: 80% (8256/10320) Updating files: 81% (8360/10320) Updating files: 82% (8463/10320) Updating files: 83% (8566/10320) Updating files: 84% (8669/10320) Updating files: 85% (8772/10320) Updating files: 86% (8876/10320) Updating files: 87% (8979/10320) Updating files: 88% (9082/10320) Updating files: 89% (9185/10320) Updating files: 90% (9288/10320) Updating files: 91% (9392/10320) Updating files: 92% (9495/10320) Updating files: 93% (9598/10320) Updating files: 94% (9701/10320) Updating files: 95% (9804/10320) Updating files: 96% (9908/10320) Updating files: 97% (10011/10320) Updating files: 98% (10114/10320) Updating files: 99% (10217/10320) Updating files: 100% (10320/10320) Updating files: 100% (10320/10320), done. Step #1 - "build-435ad16a-7083-40dd-bfeb-6338a6c9bfd2":  adding: sample.rar (deflated 1%) Step #1 - "build-435ad16a-7083-40dd-bfeb-6338a6c9bfd2": Removing intermediate container d6711c81bf16 Step #1 - "build-435ad16a-7083-40dd-bfeb-6338a6c9bfd2": ---> 74d88f8e9855 Step #1 - "build-435ad16a-7083-40dd-bfeb-6338a6c9bfd2": Step 6/9 : RUN git clone --depth 1 https://github.com/junrar/junrar.git junrar Step #1 - "build-435ad16a-7083-40dd-bfeb-6338a6c9bfd2": ---> Running in c4a92a420c9d Step #1 - "build-435ad16a-7083-40dd-bfeb-6338a6c9bfd2": Cloning into 'junrar'... Step #1 - "build-435ad16a-7083-40dd-bfeb-6338a6c9bfd2": Removing intermediate container c4a92a420c9d Step #1 - "build-435ad16a-7083-40dd-bfeb-6338a6c9bfd2": ---> 8cb307346767 Step #1 - "build-435ad16a-7083-40dd-bfeb-6338a6c9bfd2": Step 7/9 : COPY build.sh $SRC/ Step #1 - "build-435ad16a-7083-40dd-bfeb-6338a6c9bfd2": ---> 6a891804d72a Step #1 - "build-435ad16a-7083-40dd-bfeb-6338a6c9bfd2": Step 8/9 : COPY JunrarFuzzer.java $SRC/ Step #1 - "build-435ad16a-7083-40dd-bfeb-6338a6c9bfd2": ---> e43f98fe9b81 Step #1 - "build-435ad16a-7083-40dd-bfeb-6338a6c9bfd2": Step 9/9 : WORKDIR $SRC/junrar Step #1 - "build-435ad16a-7083-40dd-bfeb-6338a6c9bfd2": ---> Running in 2a5552df8987 Step #1 - "build-435ad16a-7083-40dd-bfeb-6338a6c9bfd2": Removing intermediate container 2a5552df8987 Step #1 - "build-435ad16a-7083-40dd-bfeb-6338a6c9bfd2": ---> 0cf2d46485ce Step #1 - "build-435ad16a-7083-40dd-bfeb-6338a6c9bfd2": Successfully built 0cf2d46485ce Step #1 - "build-435ad16a-7083-40dd-bfeb-6338a6c9bfd2": Successfully tagged gcr.io/oss-fuzz/junrar:latest Step #1 - "build-435ad16a-7083-40dd-bfeb-6338a6c9bfd2": Successfully tagged us-central1-docker.pkg.dev/oss-fuzz/unsafe/junrar:latest Finished Step #1 - "build-435ad16a-7083-40dd-bfeb-6338a6c9bfd2" Starting Step #2 - "srcmap" Step #2 - "srcmap": Already have image: gcr.io/oss-fuzz/junrar Step #2 - "srcmap": ++ tempfile Step #2 - "srcmap": WARNING: tempfile is deprecated; consider using mktemp instead. Step #2 - "srcmap": + SRCMAP=/tmp/filetEWlDe Step #2 - "srcmap": + echo '{}' Step #2 - "srcmap": + PATHS_TO_SCAN=/src Step #2 - "srcmap": + [[ jvm == \g\o ]] Step #2 - "srcmap": ++ find /src -name .git -type d Step #2 - "srcmap": + for DOT_GIT_DIR in $(find $PATHS_TO_SCAN -name ".git" -type d) Step #2 - "srcmap": ++ dirname /src/junrar/.git Step #2 - "srcmap": + GIT_DIR=/src/junrar Step #2 - "srcmap": + cd /src/junrar Step #2 - "srcmap": ++ git config --get remote.origin.url Step #2 - "srcmap": + GIT_URL=https://github.com/junrar/junrar.git Step #2 - "srcmap": ++ git rev-parse HEAD Step #2 - "srcmap": + GIT_REV=65578378b0e63656e4948d2a22186fc99f536847 Step #2 - "srcmap": + jq_inplace /tmp/filetEWlDe '."/src/junrar" = { type: "git", url: "https://github.com/junrar/junrar.git", rev: "65578378b0e63656e4948d2a22186fc99f536847" }' Step #2 - "srcmap": ++ tempfile Step #2 - "srcmap": WARNING: tempfile is deprecated; consider using mktemp instead. Step #2 - "srcmap": + F=/tmp/filePAm4Ea Step #2 - "srcmap": + cat /tmp/filetEWlDe Step #2 - "srcmap": + jq '."/src/junrar" = { type: "git", url: "https://github.com/junrar/junrar.git", rev: "65578378b0e63656e4948d2a22186fc99f536847" }' Step #2 - "srcmap": + mv /tmp/filePAm4Ea /tmp/filetEWlDe Step #2 - "srcmap": ++ find /src -name .svn -type d Step #2 - "srcmap": ++ find /src -name .hg -type d Step #2 - "srcmap": + '[' '' '!=' '' ']' Step #2 - "srcmap": + cat /tmp/filetEWlDe Step #2 - "srcmap": + rm /tmp/filetEWlDe Step #2 - "srcmap": { Step #2 - "srcmap": "/src/junrar": { Step #2 - "srcmap": "type": "git", Step #2 - "srcmap": "url": "https://github.com/junrar/junrar.git", Step #2 - "srcmap": "rev": "65578378b0e63656e4948d2a22186fc99f536847" Step #2 - "srcmap": } Step #2 - "srcmap": } Finished Step #2 - "srcmap" Starting Step #3 - "compile-libfuzzer-coverage-x86_64" Step #3 - "compile-libfuzzer-coverage-x86_64": Already have image (with digest): gcr.io/cloud-builders/docker Step #3 - "compile-libfuzzer-coverage-x86_64": --------------------------------------------------------------- Step #3 - "compile-libfuzzer-coverage-x86_64": vm.mmap_rnd_bits = 28 Step #3 - "compile-libfuzzer-coverage-x86_64": --------------------------------------------------------------- Step #3 - "compile-libfuzzer-coverage-x86_64": CC=clang Step #3 - "compile-libfuzzer-coverage-x86_64": CXX=clang++ Step #3 - "compile-libfuzzer-coverage-x86_64": CFLAGS=-O1 -fno-omit-frame-pointer -gline-tables-only -Wno-error=incompatible-function-pointer-types -Wno-error=int-conversion -Wno-error=deprecated-declarations -Wno-error=implicit-function-declaration -Wno-error=implicit-int -Wno-error=unknown-warning-option -Wno-error=vla-cxx-extension -DFUZZING_BUILD_MODE_UNSAFE_FOR_PRODUCTION -fprofile-instr-generate -fcoverage-mapping -pthread -Wl,--no-as-needed -Wl,-ldl -Wl,-lm -Wno-unused-command-line-argument -fno-sanitize=leak Step #3 - "compile-libfuzzer-coverage-x86_64": CXXFLAGS=-O1 -fno-omit-frame-pointer -gline-tables-only -Wno-error=incompatible-function-pointer-types -Wno-error=int-conversion -Wno-error=deprecated-declarations -Wno-error=implicit-function-declaration -Wno-error=implicit-int -Wno-error=unknown-warning-option -Wno-error=vla-cxx-extension -DFUZZING_BUILD_MODE_UNSAFE_FOR_PRODUCTION -fprofile-instr-generate -fcoverage-mapping -pthread -Wl,--no-as-needed -Wl,-ldl -Wl,-lm -Wno-unused-command-line-argument -stdlib=libc++ -fno-sanitize=leak Step #3 - "compile-libfuzzer-coverage-x86_64": RUSTFLAGS=--cfg fuzzing -Cdebuginfo=1 -Cforce-frame-pointers -Cinstrument-coverage -C link-arg=-lc++ Step #3 - "compile-libfuzzer-coverage-x86_64": --------------------------------------------------------------- Step #3 - "compile-libfuzzer-coverage-x86_64": + mv /src/JunrarFuzzer_seed_corpus.zip /workspace/out/libfuzzer-coverage-x86_64 Step #3 - "compile-libfuzzer-coverage-x86_64": + ./gradlew build Step #3 - "compile-libfuzzer-coverage-x86_64": Fetching distribution. Step #3 - "compile-libfuzzer-coverage-x86_64": Downloading https://services.gradle.org/distributions/gradle-9.6.1-all.zip Step #3 - "compile-libfuzzer-coverage-x86_64": ......................10%.......................20%.......................30%.......................40%.......................50%.......................60%......................70%.......................80%.......................90%.......................100% Step #3 - "compile-libfuzzer-coverage-x86_64": Step #3 - "compile-libfuzzer-coverage-x86_64": Welcome to Gradle 9.6.1! Step #3 - "compile-libfuzzer-coverage-x86_64": Step #3 - "compile-libfuzzer-coverage-x86_64": Here are the highlights of this release: Step #3 - "compile-libfuzzer-coverage-x86_64": - Improved Configuration Cache hit rates Step #3 - "compile-libfuzzer-coverage-x86_64": - Additional CLI rendering options Step #3 - "compile-libfuzzer-coverage-x86_64": - Important project hierarchy lookup deprecations Step #3 - "compile-libfuzzer-coverage-x86_64": Step #3 - "compile-libfuzzer-coverage-x86_64": For more details see https://docs.gradle.org/9.6.1/release-notes.html Step #3 - "compile-libfuzzer-coverage-x86_64": Step #3 - "compile-libfuzzer-coverage-x86_64": Starting a Gradle Daemon (subsequent builds will be faster) Step #3 - "compile-libfuzzer-coverage-x86_64": Step #3 - "compile-libfuzzer-coverage-x86_64": Step #3 - "compile-libfuzzer-coverage-x86_64": > Starting Daemon> IDLEโ”‚ยทยทยทยทยทยทยทยทยทยทยทยทยทยทยทโ”‚ 0% INITIALIZING [10ms]โ”‚ยทยทยทยทยทยทยทยทยทยทยทยทยทยทยทโ”‚ 0% INITIALIZING [110ms]โ”‚ยทยทยทยทยทยทยทยทยทยทยทยทยทยทยทโ”‚ 0% INITIALIZING [209ms]โ”‚ยทยทยทยทยทยทยทยทยทยทยทยทยทยทยทโ”‚ 0% INITIALIZING [310ms]โ”‚ยทยทยทยทยทยทยทยทยทยทยทยทยทยทยทโ”‚ 0% INITIALIZING [410ms]โ”‚ยทยทยทยทยทยทยทยทยทยทยทยทยทยทยทโ”‚ 0% INITIALIZING [510ms]โ”‚ยทยทยทยทยทยทยทยทยทยทยทยทยทยทยทโ”‚ 0% INITIALIZING [609ms]โ”‚ยทยทยทยทยทยทยทยทยทยทยทยทยทยทยทโ”‚ 0% INITIALIZING [709ms]> Evaluating settingsโ”‚ยทยทยทยทยทยทยทยทยทยทยทยทยทยทยทโ”‚ 0% INITIALIZING [810ms]โ”‚ยทยทยทยทยทยทยทยทยทยทยทยทยทยทยทโ”‚ 0% INITIALIZING [909ms]โ”‚ยทยทยทยทยทยทยทยทยทยทยทยทยทยทยทโ”‚ 0% INITIALIZING [1s]โ”‚ยทยทยทยทยทยทยทยทยทยทยทยทยทยทยทโ”‚ 0% INITIALIZING [2s]> Evaluating settings > Resolve dependencies of detachedConfiguration1> Evaluating settings > Resolve dependencies of detachedConfiguration1 > org.grโ”‚ยทยทยทยทยทยทยทยทยทยทยทยทยทยทยทโ”‚ 0% INITIALIZING [3s]> Evaluating settings > Resolve dependencies of detachedConfiguration1> Evaluating settings> Evaluating settings > Resolve dependencies of detachedConfiguration2 > io.git> Evaluating settingsโ”‚ยทยทยทยทยทยทยทยทยทยทยทยทยทยทยทโ”‚ 0% INITIALIZING [4s]> Evaluating settings > Resolve dependencies of classpath > foojay-resolver-1.0> Evaluating settings > Resolve dependencies of classpath > gradle-versions-plu> Evaluating settings > Resolve dependencies of classpath > kotlin-bom-2.4.10.p> Evaluating settings > Resolve dependencies of classpath Step #3 - "compile-libfuzzer-coverage-x86_64": Step #3 - "compile-libfuzzer-coverage-x86_64": > Evaluating settings > Resolve dependencies of classpath > okhttp-4.12.0.pom> Evaluating settings > Resolve dependencies of classpath > moshi-kotlin-1.12.0> Evaluating settings > Resolve dependencies of classpath > kotlin-stdlib-2.4.1> IDLE> IDLE> Evaluating settings > Resolve dependencies of classpath > annotations-13.0.po> Evaluating settings > Resolve dependencies of classpath > okio-3.6.0.pom> Evaluating settings > Resolve dependencies of classpath > kotlin-stdlib-jdk8-โ”‚ยทยทยทยทยทยทยทยทยทยทยทยทยทยทยทโ”‚ 0% INITIALIZING [5s]> Evaluating settings > Resolve dependencies of classpath > moshi-1.12.0.pom> Evaluating settings > Resolve dependencies of classpath > moshi-1.12.0.module> Evaluating settings > Resolve dependencies of classpath > okio-jvm-3.6.0.pom> Evaluating settings > Resolve dependencies of classpath > kotlin-stdlib-jdk7-> Evaluating settings > Resolve dependencies of classpath > kotlin-stdlib-commo Step #3 - "compile-libfuzzer-coverage-x86_64": > Evaluating settings > Resolve files of configuration 'classpath' > kotlin-ref> Evaluating settings > Resolve files of configuration 'classpath' > moshi-1.12> Evaluating settings > Resolve files of configuration 'classpath' > okio-jvm-3> Evaluating settings > Resolve files of configuration 'classpath' > moshi-kotl (6 lines not showing)> Evaluating settings > Resolve files of configuration 'classpath' > foojay-res> IDLE> Evaluating settings > Resolve files of configuration 'classpath' > kotlin-std (2 lines not showing)> IDLE> IDLE> Evaluating settings > Resolve files of configuration 'classpath' > Resolve fi> Evaluating settings > Resolve files of configuration 'classpath' > Resolve fi> Evaluating settings > Resolve files of configuration 'classpath' > Resolve fi> Evaluating settings > Resolve files of configuration 'classpath' > Resolve fi (3 lines not showing)โ”‚ยทยทยทยทยทยทยทยทยทยทยทยทยทยทยทโ”‚ 0% INITIALIZING [6s]> IDLE> IDLE> IDLE> IDLE (1 line not showing)> Evaluating settings > Resolve files of configuration 'classpath' > MergeInstr> Evaluating settings > Resolve files of configuration 'classpath' > MergeInstr> Evaluating settings > Resolve files of configuration 'classpath' > ExternalDe> Evaluating settings > Resolve files of configuration 'classpath' > ExternalDe> Evaluating settings > Resolve files of configuration 'classpath' > ExternalDe> Evaluating settings > Resolve files of configuration 'classpath' > ExternalDe (3 lines not showing) (2 lines not showing)> IDLE> IDLE> IDLE> IDLE (1 line not showing)> Evaluating settings > Resolve files of configuration 'classpath'โ”‚ยทยทยทยทยทยทยทยทยทยทยทยทยทยทยทโ”‚ 0% INITIALIZING [7s]> Evaluating settingsโ”‚ยทยทยทยทยทยทยทยทยทยทยทยทยทยทยทโ”‚ 0% CONFIGURING [7s]> Loading projects> root projectโ”‚ยทยทยทยทยทยทยทยทยทยทยทยทยทยทยทโ”‚ 0% CONFIGURING [8s]> root project > Resolve dependencies of detachedConfiguration1 > dev.jacomet.l> root project> root project > Resolve dependencies of detachedConfiguration2 > io.github.gra> root project> root project > Resolve dependencies of detachedConfiguration3 > org.jreleaser> root project > Resolve dependencies of detachedConfiguration4 > com.diffplug.> root projectโ”‚ยทยทยทยทยทยทยทยทยทยทยทยทยทยทยทโ”‚ 0% CONFIGURING [9s]> root project > Resolve dependencies of classpath > logging-capabilities-0.11.> root project > Resolve dependencies of classpath > publish-plugin-2.0.0.pom> root project > Resolve dependencies of classpath > jreleaser-gradle-plugin-1.> root project > Resolve dependencies of classpath > spotless-plugin-gradle-8.9> root project > Resolve dependencies of classpath > jreleaser-config-json-1.25> root project > Resolve dependencies of classpath > jreleaser-config-toml-1.25> root project > Resolve dependencies of classpath > jreleaser-config-yaml-1.25> root project > Resolve dependencies of classpath > base-gradle-plugin-0.46.10 (1 line not showing)> IDLE> IDLE> IDLE> root project > Resolve dependencies of classpath > spotless-lib-extra-4.9.0.m> root project > Resolve dependencies of classpath > durian-core-1.2.0.pom> root project > Resolve dependencies of classpath > durian-collect-1.2.0.pom> root project > Resolve dependencies of classpath > spotless-lib-4.9.0.pom (1 line not showing)> root project > Resolve dependencies of classpath> IDLE> IDLE> IDLEโ”‚ยทยทยทยทยทยทยทยทยทยทยทยทยทยทยทโ”‚ 0% CONFIGURING [10s]> root project > Resolve dependencies of classpath > maven-model-builder-3.6.3.> root project > Resolve dependencies of classpath > maven-3.6.3.pom> root project > Resolve dependencies of classpath > maven-parent-33.pom> root project > Resolve dependencies of classpath > apache-21.pom> root project > Resolve dependencies of classpath > jsonschema-generator-4.38.> root project > Resolve dependencies of classpath > jreleaser-signing-java-sdk> root project > Resolve dependencies of classpath > jreleaser-templates-1.25.0> root project > Resolve dependencies of classpath > jreleaser-discourse-java-s (40 lines not showing)> IDLE> IDLE (27 lines not showing)> root project > Resolve dependencies of classpath > jsonschema-generator-paren> root project > Resolve dependencies of classpath > commons-parent-92.pom> root project > Resolve dependencies of classpath > commons-parent-93.pom> root project > Resolve dependencies of classpath > jsonschema-generator-bom-4> IDLE> root project > Resolve dependencies of classpath > apache-35.pom> root project > Resolve dependencies of classpath > junit-bom-5.14.1.pom> root project > Resolve dependencies of classpath > junit-bom-5.13.4.pom> root project > Resolve dependencies of classpath > jackson-bom-2.17.2.pom> root project > Resolve dependencies of classpath > junit-bom-5.14.1.moduleโ”‚ยทยทยทยทยทยทยทยทยทยทยทยทยทยทยทโ”‚ 0% CONFIGURING [11s]> IDLE> root project > Resolve dependencies of classpath > junit-bom-5.13.4.module> root project > Resolve dependencies of classpath > jackson-parent-2.17.pom> IDLE> root project > Resolve dependencies of classpath > oss-parent-58.pom> root project > Resolve dependencies of classpath> root project > Resolve dependencies of classpath > yamllint-1.6.1.pom> root project > Resolve dependencies of classpath > jackson-dataformat-yaml-2.> root project > Resolve dependencies of classpath > jackson-core-2.22.0.pom> root project > Resolve dependencies of classpath > jackson-databind-2.22.0.po> root project > Resolve dependencies of classpath > junit-bom-5.10.1.pom> IDLE> root project > Resolve dependencies of classpath > jackson-base-2.22.0.pom> IDLE> root project > Resolve dependencies of classpath > junit-bom-5.10.1.module> root project > Resolve dependencies of classpath > jackson-bom-2.22.0.pom> IDLE> root project > Resolve dependencies of classpath > jackson-parent-2.22.pom> root project > Resolve dependencies of classpath > oss-parent-79.pom> root project > Resolve dependencies of classpath > junit-bom-5.14.3.pom> root project > Resolve dependencies of classpath > junit-bom-5.14.3.moduleโ”‚ยทยทยทยทยทยทยทยทยทยทยทยทยทยทยทโ”‚ 0% CONFIGURING [12s]> root project > Resolve dependencies of classpath > jackson-databind-2.22.0.mo> root project > Resolve dependencies of classpath > jackson-core-2.22.0.module> root project > Resolve dependencies of classpath > jackson-dataformat-yaml-2.> IDLE> root project > Resolve dependencies of classpath > jackson-dataformat-toml-2.> IDLE> root project > Resolve dependencies of classpath > JavaEWAH-1.1.13.pom> root project > Resolve dependencies of classpath > slf4j-api-1.7.30.pom> IDLE> root project > Resolve dependencies of classpath > oss-parent-5.pom> root project > Resolve dependencies of classpath > slf4j-parent-1.7.30.pom> root project > Resolve dependencies of classpath > concurrent-trees-2.6.1.pom> root project > Resolve dependencies of classpath > solstice-1.8.2.pom> root project > Resolve dependencies of classpath > org.eclipse.osgi-3.24.200.> root project > Resolve dependencies of classpath > oss-parent-7.pom> root project > Resolve dependencies of classpath > solstice-1.8.2.module> IDLE> IDLE> root project > Resolve dependencies of classpathโ”‚ยทยทยทยทยทยทยทยทยทยทยทยทยทยทยทโ”‚ 0% CONFIGURING [13s]> root project > Resolve dependencies of classpath > plexus-utils-3.2.1.pom> root project > Resolve dependencies of classpath > javax.inject-1.pom> root project > Resolve dependencies of classpath > maven-model-3.6.3.pom> root project > Resolve dependencies of classpath > org.eclipse.sisu.inject-0.> IDLE> IDLE> root project > Resolve dependencies of classpath > plexus-5.1.pom> root project > Resolve dependencies of classpath > sisu-inject-0.3.4.pom> IDLE> root project > Resolve dependencies of classpath > oss-parent-9.pom> root project > Resolve dependencies of classpath > commons-jexl3-3.6.3.pom> root project > Resolve dependencies of classpath > jreleaser-model-api-1.25.0> root project > Resolve dependencies of classpath > commons-parent-102.pom> IDLE> root project > Resolve dependencies of classpath > apache-38.pom> root project > Resolve dependencies of classpath > mockito-bom-4.11.0.pom> root project > Resolve dependencies of classpath > commons-io-2.22.0.pom> root project > Resolve dependencies of classpath > compiler-0.9.14.pom> root project > Resolve dependencies of classpath > mustache.java-0.9.14.pom> root project > Resolve dependencies of classpath > commons-parent-98.pomโ”‚ยทยทยทยทยทยทยทยทยทยทยทยทยทยทยทโ”‚ 0% CONFIGURING [14s]> root project > Resolve dependencies of classpath > apache-37.pom> IDLE> root project > Resolve dependencies of classpath > junit-bom-5.14.2.pom> root project > Resolve dependencies of classpath > junit-bom-5.14.2.module> root project > Resolve dependencies of classpath > bcpg-jdk18on-1.84.pom> root project > Resolve dependencies of classpath > jreleaser-resource-bundle-> root project > Resolve dependencies of classpath > jreleaser-logger-api-1.25.> root project > Resolve dependencies of classpath > jreleaser-utils-1.25.0.pom> IDLE> IDLE> root project > Resolve dependencies of classpath > slf4j-api-2.0.16.pom> root project > Resolve dependencies of classpath > slf4j-parent-2.0.16.pomโ”‚ยทยทยทยทยทยทยทยทยทยทยทยทยทยทยทโ”‚ 0% CONFIGURING [15s]> root project > Resolve dependencies of classpath > slf4j-bom-2.0.16.pom> root project > Resolve dependencies of classpath > classmate-1.7.0.pom> root project > Resolve dependencies of classpath > oss-parent-56.pom> root project > Resolve dependencies of classpath > jreleaser-java-sdk-commons> root project > Resolve dependencies of classpath > jakarta.activation-api-2.1> root project > Resolve dependencies of classpath > jakarta.mail-api-2.1.5.pom> IDLE> root project > Resolve dependencies of classpath > project-1.0.9.pom> root project > Resolve dependencies of classpath > twitter4j-core-4.1.2.pomโ”‚ยทยทยทยทยทยทยทยทยทยทยทยทยทยทยทโ”‚ 0% CONFIGURING [16s]> root project > Resolve dependencies of classpath > twitter4j-core-4.1.2.modul> root project > Resolve dependencies of classpath > jackson-dataformat-xml-2.2> root project > Resolve dependencies of classpath > jackson-datatype-jsr310-2.> root project > Resolve dependencies of classpath > failsafe-3.3.2.pom> root project > Resolve dependencies of classpath > failsafe-parent-3.3.2.pom> IDLE> root project > Resolve dependencies of classpath > jackson-modules-java8-2.22> IDLE> root project > Resolve dependencies of classpath > jackson-datatype-jsr310-2.> root project > Resolve dependencies of classpath> root project > Resolve dependencies of classpath > commons-net-3.13.0.pom> root project > Resolve dependencies of classpath > commons-parent-97.pom> root project > Resolve dependencies of classpath > bcprov-jdk18on-1.84.pom> root project > Resolve dependencies of classpath > bcutil-jdk18on-1.84.pom> root project > Resolve dependencies of classpath > sshj-0.40.0.pom> root project > Resolve dependencies of classpath > bcpkix-jdk18on-1.84.pom> IDLE> IDLE> IDLEโ”‚ยทยทยทยทยทยทยทยทยทยทยทยทยทยทยทโ”‚ 0% CONFIGURING [17s]> root project > Resolve dependencies of classpath > sshj-0.40.0.module> root project > Resolve dependencies of classpath > s3-2.46.17.pom> root project > Resolve dependencies of classpath > httpclient5-5.6.1.pom> root project > Resolve dependencies of classpath > httpcore5-5.4.3.pom> root project > Resolve dependencies of classpath > commons-codec-1.22.0.pom (1 line not showing)> root project > Resolve dependencies of classpath > services-2.46.17.pom> root project > Resolve dependencies of classpath > httpclient5-parent-5.6.1.p> root project > Resolve dependencies of classpath > httpcore5-parent-5.4.3.pom> root project > Resolve dependencies of classpath > http-clients-2.46.17.pom> IDLE> IDLE> root project > Resolve dependencies of classpath > httpcomponents-parent-14.p> root project > Resolve dependencies of classpath > aws-sdk-java-pom-2.46.17.p> root project > Resolve dependencies of classpath > apache-27.pom> root project > Resolve dependencies of classpath > bom-internal-2.46.17.pom> root project > Resolve dependencies of classpath > junit-bom-5.13.3.pom> root project > Resolve dependencies of classpath > junit-bom-5.10.3.pom> root project > Resolve dependencies of classpath > junit-bom-5.13.3.module> root project > Resolve dependencies of classpath > junit-bom-5.10.3.module> root project > Resolve dependencies of classpath > opentelemetry-bom-1.49.0.p> IDLE> root project > Resolve dependencies of classpath > opentelemetry-bom-1.49.0.mโ”‚ยทยทยทยทยทยทยทยทยทยทยทยทยทยทยทโ”‚ 0% CONFIGURING [18s]> root project > Resolve dependencies of classpath > jackson-annotations-2.22.p> root project > Resolve dependencies of classpath > jackson-annotations-2.22.m> root project > Resolve dependencies of classpath > snakeyaml-2.5.pom> root project > Resolve dependencies of classpath > xz-1.9.pom> root project > Resolve dependencies of classpath > durian-swt.os-4.3.0.pom> root project > Resolve dependencies of classpath > durian-swt.os-4.3.0.module> IDLE> root project > Resolve dependencies of classpath > slf4j-api-2.0.18.pom> root project > Resolve dependencies of classpath > slf4j-parent-2.0.18.pom> root project > Resolve dependencies of classpath > slf4j-bom-2.0.18.pomโ”‚ยทยทยทยทยทยทยทยทยทยทยทยทยทยทยทโ”‚ 0% CONFIGURING [19s]> root project > Resolve dependencies of classpath > jcl-over-slf4j-2.0.18.pom> root project > Resolve dependencies of classpath > xz-1.12.pom> root project > Resolve dependencies of classpath > commonmark-ext-autolink-0.> root project > Resolve dependencies of classpath > zstd-jni-1.5.7-11.pom> root project > Resolve dependencies of classpath > commons-compress-1.28.0.po> root project > Resolve dependencies of classpath > commonmark-0.21.0.pom> IDLE> root project > Resolve dependencies of classpath > commonmark-parent-0.21.0.p> root project > Resolve dependencies of classpath > commons-parent-85.pom> IDLE> root project > Resolve dependencies of classpath > junit-bom-5.13.1.pom> IDLE> root project > Resolve dependencies of classpath > junit-bom-5.13.1.module> root project > Resolve dependencies of classpath > httpcore-4.4.16.pom> root project > Resolve dependencies of classpath > tika-core-2.9.4.pom> root project > Resolve dependencies of classpath > feign-core-13.13.pom> root project > Resolve dependencies of classpath > httpclient-4.5.14.pom (3 lines not showing)> root project > Resolve dependencies of classpath > httpcomponents-core-4.4.16> root project > Resolve dependencies of classpath > feign-parent-13.13.pom> root project > Resolve dependencies of classpath > tika-parent-2.9.4.pom (1 line not showing)โ”‚ยทยทยทยทยทยทยทยทยทยทยทยทยทยทยทโ”‚ 0% CONFIGURING [20s]> IDLE> root project > Resolve dependencies of classpath > junit-bom-6.1.0.module> IDLE> root project > Resolve dependencies of classpath > apache-34.pom> root project > Resolve dependencies of classpath > okhttp-bom-5.4.0.pom> root project > Resolve dependencies of classpath > jackson-parent-2.19.pom> IDLE> root project > Resolve dependencies of classpath > oss-parent-65.pom> root project > Resolve dependencies of classpath> root project > Resolve dependencies of classpath > netty-bom-4.2.0.Final.pom> root project > Resolve dependencies of classpath > cxf-bom-3.5.11.pom> root project > Resolve dependencies of classpath > cxf-3.5.11.pom> root project > Resolve dependencies of classpath > log4j-bom-2.24.3.pom> root project > Resolve dependencies of classpath > logging-parent-11.3.0.pom> root project > Resolve dependencies of classpath > apache-33.pomโ”‚ยทยทยทยทยทยทยทยทยทยทยทยทยทยทยทโ”‚ 0% CONFIGURING [21s]> root project > Resolve dependencies of classpath > jetty-bom-9.4.57.v20241219> root project > Resolve dependencies of classpath > junit-bom-5.12.2.pom> root project > Resolve dependencies of classpath > junit-bom-5.12.2.module> root project > Resolve dependencies of classpath > testcontainers-bom-1.21.0.> root project > Resolve dependencies of classpath> root project > Resolve dependencies of classpath > jakarta.activation-api-2.1> root project > Resolve dependencies of classpath > oss-parent-68.pom> root project > Resolve dependencies of classpath > woodstox-core-7.2.0.pom> root project > Resolve dependencies of classpath > asn-one-0.6.0.pom> IDLE> root project > Resolve dependencies of classpath > httpcore5-h2-5.4.pom> root project > Resolve dependencies of classpath > annotations-2.46.17.pom> root project > Resolve dependencies of classpath > http-client-spi-2.46.17.po> root project > Resolve dependencies of classpath > metrics-spi-2.46.17.pom> root project > Resolve dependencies of classpath > utils-2.46.17.pomโ”‚ยทยทยทยทยทยทยทยทยทยทยทยทยทยทยทโ”‚ 0% CONFIGURING [22s]> root project > Resolve dependencies of classpath > core-2.46.17.pom> IDLE> IDLE> root project > Resolve dependencies of classpath> IDLE> root project > Resolve dependencies of classpath > aws-xml-protocol-2.46.17.p> root project > Resolve dependencies of classpath > aws-core-2.46.17.pom> root project > Resolve dependencies of classpath > http-auth-2.46.17.pom> root project > Resolve dependencies of classpath > identity-spi-2.46.17.pom> IDLE> IDLE> IDLE> root project > Resolve dependencies of classpath > protocols-2.46.17.pom> root project > Resolve dependencies of classpath> root project > Resolve dependencies of classpath > autolink-0.10.0.pom> root project > Resolve dependencies of classpath > commons-logging-1.2.pom> root project > Resolve dependencies of classpath > commons-parent-34.pom> root project > Resolve dependencies of classpath > apache-13.pom> root project > Resolve dependencies of classpath > reactive-streams-1.0.4.pomโ”‚ยทยทยทยทยทยทยทยทยทยทยทยทยทยทยทโ”‚ 0% CONFIGURING [23s]> root project > Resolve dependencies of classpath > aws-query-protocol-2.46.17> root project > Resolve dependencies of classpath > retries-2.46.17.pom> root project > Resolve dependencies of classpath > http-auth-aws-eventstream-> root project > Resolve dependencies of classpath > eventstream-1.0.1.pom> IDLE> root project > Resolve dependencies of classpath > utils-lite-2.46.17.pom> root project > Resolve dependencies of classpath> root project > Resolve dependencies of classpath > third-party-jackson-core-2> root project > Resolve dependencies of classpath > third-party-2.46.17.pomโ”‚ยทยทยทยทยทยทยทยทยทยทยทยทยทยทยทโ”‚ 0% CONFIGURING [24s]> root project > Resolve dependencies of classpath > kotlin-stdlib-jdk7-1.8.21.> root project > Resolve dependencies of classpath > kotlin-stdlib-1.8.21.pom> root project > Resolve dependencies of classpath > kotlin-stdlib-jdk8-1.9.10.> IDLE> root project > Resolve dependencies of classpath > kotlin-stdlib-common-1.9.1> root project > Resolve dependencies of classpath > kotlin-stdlib-1.9.10.pom> root project > Resolve dependencies of classpath > kotlin-stdlib-jdk7-1.9.10.> root project > Resolve files of configuration 'classpath' > logging-capabilit> root project > Resolve files of configuration 'classpath' > spotless-plugin-g> root project > Resolve files of configuration 'classpath' > publish-plugin-2.> root project > Resolve files of configuration 'classpath' > jreleaser-gradle- (23 lines not showing)โ”‚ยทยทยทยทยทยทยทยทยทยทยทยทยทยทยทโ”‚ 0% CONFIGURING [25s] (28 lines not showing)> root project > Resolve files of configuration 'classpath' > aws-core-2.46.17.> root project > Resolve files of configuration 'classpath' > jackson-databind-> root project > Resolve files of configuration 'classpath' > solstice-1.8.2.ja> root project > Resolve files of configuration 'classpath' > s3-2.46.17.jar >  (3 lines not showing)> root project > Resolve files of configuration 'classpath' > org.eclipse.osgi-> root project > Resolve files of configuration 'classpath' > profiles-2.46.17.> root project > Resolve files of configuration 'classpath' > http-client-spi-2> root project > Resolve files of configuration 'classpath' > regions-2.46.17.j (8 lines not showing)> root project > Resolve files of configuration 'classpath' > jackson-annotatio> root project > Resolve files of configuration 'classpath' > twitter4j-core-4.> root project > Resolve files of configuration 'classpath' > bcpg-jdk18on-1.84> root project > Resolve files of configuration 'classpath' > commons-io-2.22.0 (22 lines not showing)> root project > Resolve files of configuration 'classpath' > kotlin-stdlib-jdk> root project > Resolve files of configuration 'classpath' > kotlin-stdlib-com> root project > Resolve files of configuration 'classpath' > commons-logging-1> root project > Resolve files of configuration 'classpath' > autolink-0.10.0.j (4 lines not showing)> IDLE> IDLE> root project > Resolve files of configuration 'classpath'> IDLE> root project > Resolve files of configuration 'classpath' > Resolve files of > root project > Resolve files of configuration 'classpath' > Resolve files of > root project > Resolve files of configuration 'classpath' > Resolve files of > root project > Resolve files of configuration 'classpath' > Resolve files of  (4 lines not showing) (8 lines not showing) (2 lines not showing)> IDLE> IDLE> IDLEโ”‚ยทยทยทยทยทยทยทยทยทยทยทยทยทยทยทโ”‚ 0% CONFIGURING [26s]> root project > Resolve files of configuration 'classpath' > MergeInstrumentat> root project > Resolve files of configuration 'classpath' > ExternalDependenc> root project > Resolve files of configuration 'classpath' > ExternalDependenc> root project > Resolve files of configuration 'classpath' > ExternalDependenc> root project > Resolve files of configuration 'classpath' > ExternalDependenc (5 lines not showing) (10 lines not showing) (16 lines not showing) (14 lines not showing) (15 lines not showing) (17 lines not showing) (20 lines not showing) (17 lines not showing)โ”‚ยทยทยทยทยทยทยทยทยทยทยทยทยทยทยทโ”‚ 0% CONFIGURING [27s] (18 lines not showing) (15 lines not showing) (9 lines not showing)> IDLE (6 lines not showing)> IDLE (4 lines not showing) (2 lines not showing)> IDLE> IDLE (1 line not showing)โ”‚ยทยทยทยทยทยทยทยทยทยทยทยทยทยทยทโ”‚ 0% CONFIGURING [28s]> root project > Resolve files of configuration 'classpath'> root projectโ”‚ยทยทยทยทยทยทยทยทยทยทยทยทยทยทยทโ”‚ 0% CONFIGURING [29s]โ”‚ยทยทยทยทยทยทยทยทยทยทยทยทยทยทยทโ”‚ 0% CONFIGURING [30s] Step #3 - "compile-libfuzzer-coverage-x86_64": > Configure project : Step #3 - "compile-libfuzzer-coverage-x86_64": JReleaser Gradle Plugin 1.25.0. Consider becoming a sponsor at https://opencollective.com/jreleaser Step #3 - "compile-libfuzzer-coverage-x86_64":  Step #3 - "compile-libfuzzer-coverage-x86_64":  Step #3 - "compile-libfuzzer-coverage-x86_64":  Step #3 - "compile-libfuzzer-coverage-x86_64": โ”‚ยทยทยทยทยทยทยทยทยทยทยทยทยทยทยทโ”‚ 0% CONFIGURING [30s]> IDLE> IDLE> IDLE> root projectโ”‚ยทยทยทยทยทยทยทยทยทยทยทยทยทยทยทโ”‚ 0% CONFIGURING [31s]โ”‚ยทยทยทยทยทยทยทยทยทยทยทยทยทยทยทโ”‚ 0% CONFIGURING [32s]โ”‚โ–ˆโ–ˆโ–ˆโ–ˆโ–ˆโ–ˆโ–ˆโ–ˆโ–ˆโ–ˆโ–ˆโ–ˆโ–ˆโ–ˆโ–ˆโ”‚ 100% CONFIGURING [32s]> Building task graph of root buildโ”‚โ–ˆโ–ˆโ–ˆโ–ˆโ–ˆโ–ˆโ–ˆโ–ˆโ–ˆโ–ˆโ–ˆโ–ˆโ–ˆโ–ˆโ–ˆโ”‚ 100% CONFIGURING [33s]โ”‚ยทยทยทยทยทยทยทยทยทยทยทยทยทยทยทโ”‚ 0% EXECUTING [33s]> :compileJava> :compileJava > Resolve dependencies of :compileClasspath > slf4j-parent-2.0.1> :compileJava > Resolve files of configuration ':compileClasspath' > slf4j-api> :compileJavaโ”‚ยทยทยทยทยทยทยทยทยทยทยทยทยทยทยทโ”‚ 0% EXECUTING [34s]โ”‚ยทยทยทยทยทยทยทยทยทยทยทยทยทยทยทโ”‚ 0% EXECUTING [35s]โ”‚โ–ˆโ–ˆโ–Žยทยทยทยทยทยทยทยทยทยทยทยทโ”‚ 15% EXECUTING [35s]> :jarโ”‚โ–ˆโ–ˆโ–ˆโ–ยทยทยทยทยทยทยทยทยทยทยทโ”‚ 21% EXECUTING [36s]> :javadoc Step #3 - "compile-libfuzzer-coverage-x86_64": > Task :javadoc FAILED Step #3 - "compile-libfuzzer-coverage-x86_64": /src/junrar/src/main/java/com/github/junrar/rarfile/Rar5FileHeaderReader.java:41: error: unmappable character (0xE2) for encoding US-ASCII Step #3 - "compile-libfuzzer-coverage-x86_64": /** {@code headers5.hpp:65} ??? RAR7 compression flags carrying a RAR5 compression algorithm. */ Step #3 - "compile-libfuzzer-coverage-x86_64": ^ Step #3 - "compile-libfuzzer-coverage-x86_64": /src/junrar/src/main/java/com/github/junrar/rarfile/Rar5FileHeaderReader.java:41: error: unmappable character (0x80) for encoding US-ASCII Step #3 - "compile-libfuzzer-coverage-x86_64": /** {@code headers5.hpp:65} ??? RAR7 compression flags carrying a RAR5 compression algorithm. */ Step #3 - "compile-libfuzzer-coverage-x86_64": ^ Step #3 - "compile-libfuzzer-coverage-x86_64": /src/junrar/src/main/java/com/github/junrar/rarfile/Rar5FileHeaderReader.java:41: error: unmappable character (0x94) for encoding US-ASCII Step #3 - "compile-libfuzzer-coverage-x86_64": /** {@code headers5.hpp:65} ??? RAR7 compression flags carrying a RAR5 compression algorithm. */ Step #3 - "compile-libfuzzer-coverage-x86_64": ^ Step #3 - "compile-libfuzzer-coverage-x86_64": /src/junrar/src/main/java/com/github/junrar/rarfile/FileHeader.java:1019: error: unmappable character (0xE2) for encoding US-ASCII Step #3 - "compile-libfuzzer-coverage-x86_64": * the two as one case throughout ??? {@code case VER_PACK5: case VER_PACK7:} in Step #3 - "compile-libfuzzer-coverage-x86_64": ^ Step #3 - "compile-libfuzzer-coverage-x86_64": /src/junrar/src/main/java/com/github/junrar/rarfile/FileHeader.java:1019: error: unmappable character (0x80) for encoding US-ASCII Step #3 - "compile-libfuzzer-coverage-x86_64": * the two as one case throughout ??? {@code case VER_PACK5: case VER_PACK7:} in Step #3 - "compile-libfuzzer-coverage-x86_64": ^ Step #3 - "compile-libfuzzer-coverage-x86_64": /src/junrar/src/main/java/com/github/junrar/rarfile/FileHeader.java:1019: error: unmappable character (0x94) for encoding US-ASCII Step #3 - "compile-libfuzzer-coverage-x86_64": * the two as one case throughout ??? {@code case VER_PACK5: case VER_PACK7:} in Step #3 - "compile-libfuzzer-coverage-x86_64": ^ Step #3 - "compile-libfuzzer-coverage-x86_64": /src/junrar/src/main/java/com/github/junrar/rarfile/FileHeader.java:1020: error: unmappable character (0xE2) for encoding US-ASCII Step #3 - "compile-libfuzzer-coverage-x86_64": * {@code d861246:unpack.cpp:182-184} ??? and RAR7 reuses the RARFMT50 container Step #3 - "compile-libfuzzer-coverage-x86_64": ^ Step #3 - "compile-libfuzzer-coverage-x86_64": /src/junrar/src/main/java/com/github/junrar/rarfile/FileHeader.java:1020: error: unmappable character (0x80) for encoding US-ASCII Step #3 - "compile-libfuzzer-coverage-x86_64": * {@code d861246:unpack.cpp:182-184} ??? and RAR7 reuses the RARFMT50 container Step #3 - "compile-libfuzzer-coverage-x86_64": ^ Step #3 - "compile-libfuzzer-coverage-x86_64": /src/junrar/src/main/java/com/github/junrar/rarfile/FileHeader.java:1020: error: unmappable character (0x94) for encoding US-ASCII Step #3 - "compile-libfuzzer-coverage-x86_64": * {@code d861246:unpack.cpp:182-184} ??? and RAR7 reuses the RARFMT50 container Step #3 - "compile-libfuzzer-coverage-x86_64": ^ Step #3 - "compile-libfuzzer-coverage-x86_64": /src/junrar/src/main/java/com/github/junrar/unpack/Unpack5Window.java:20: error: unmappable character (0xE2) for encoding US-ASCII Step #3 - "compile-libfuzzer-coverage-x86_64": * {@code unpack50frag.cpp} ??? that allocator solves a 32-bit-C++ fragmentation problem, not an Step #3 - "compile-libfuzzer-coverage-x86_64": ^ Step #3 - "compile-libfuzzer-coverage-x86_64": /src/junrar/src/main/java/com/github/junrar/unpack/Unpack5Window.java:20: error: unmappable character (0x80) for encoding US-ASCII Step #3 - "compile-libfuzzer-coverage-x86_64": * {@code unpack50frag.cpp} ??? that allocator solves a 32-bit-C++ fragmentation problem, not an Step #3 - "compile-libfuzzer-coverage-x86_64": ^ Step #3 - "compile-libfuzzer-coverage-x86_64": /src/junrar/src/main/java/com/github/junrar/unpack/Unpack5Window.java:20: error: unmappable character (0x94) for encoding US-ASCII Step #3 - "compile-libfuzzer-coverage-x86_64": * {@code unpack50frag.cpp} ??? that allocator solves a 32-bit-C++ fragmentation problem, not an Step #3 - "compile-libfuzzer-coverage-x86_64": ^ Step #3 - "compile-libfuzzer-coverage-x86_64": /src/junrar/src/main/java/com/github/junrar/unpack/Unpack5Window.java:32: error: unmappable character (0xE2) for encoding US-ASCII Step #3 - "compile-libfuzzer-coverage-x86_64": * 256 KB, not 64 GB ??? strictly better than upstream, which eagerly allocates up to its limit. Step #3 - "compile-libfuzzer-coverage-x86_64": ^ Step #3 - "compile-libfuzzer-coverage-x86_64": /src/junrar/src/main/java/com/github/junrar/unpack/Unpack5Window.java:32: error: unmappable character (0x80) for encoding US-ASCII Step #3 - "compile-libfuzzer-coverage-x86_64": * 256 KB, not 64 GB ??? strictly better than upstream, which eagerly allocates up to its limit. Step #3 - "compile-libfuzzer-coverage-x86_64": ^ Step #3 - "compile-libfuzzer-coverage-x86_64": /src/junrar/src/main/java/com/github/junrar/unpack/Unpack5Window.java:32: error: unmappable character (0x94) for encoding US-ASCII Step #3 - "compile-libfuzzer-coverage-x86_64": * 256 KB, not 64 GB ??? strictly better than upstream, which eagerly allocates up to its limit. Step #3 - "compile-libfuzzer-coverage-x86_64": ^ Step #3 - "compile-libfuzzer-coverage-x86_64": /src/junrar/src/main/java/com/github/junrar/unpack/Unpack5Window.java:146: error: unmappable character (0xE2) for encoding US-ASCII Step #3 - "compile-libfuzzer-coverage-x86_64": /** @return the backing array holding {@code pos} ??? pair with {@link #offsetAt}. */ Step #3 - "compile-libfuzzer-coverage-x86_64": ^ Step #3 - "compile-libfuzzer-coverage-x86_64": /src/junrar/src/main/java/com/github/junrar/unpack/Unpack5Window.java:146: error: unmappable character (0x80) for encoding US-ASCII Step #3 - "compile-libfuzzer-coverage-x86_64": /** @return the backing array holding {@code pos} ??? pair with {@link #offsetAt}. */ Step #3 - "compile-libfuzzer-coverage-x86_64": ^ Step #3 - "compile-libfuzzer-coverage-x86_64": /src/junrar/src/main/java/com/github/junrar/unpack/Unpack5Window.java:146: error: unmappable character (0x94) for encoding US-ASCII Step #3 - "compile-libfuzzer-coverage-x86_64": /** @return the backing array holding {@code pos} ??? pair with {@link #offsetAt}. */ Step #3 - "compile-libfuzzer-coverage-x86_64": ^ Step #3 - "compile-libfuzzer-coverage-x86_64": /src/junrar/src/main/java/com/github/junrar/unpack/Unpack5Window.java:158: error: unmappable character (0xE2) for encoding US-ASCII Step #3 - "compile-libfuzzer-coverage-x86_64": * segment boundaries as needed. The range must not cross the window end ??? callers Step #3 - "compile-libfuzzer-coverage-x86_64": ^ Step #3 - "compile-libfuzzer-coverage-x86_64": /src/junrar/src/main/java/com/github/junrar/unpack/Unpack5Window.java:158: error: unmappable character (0x80) for encoding US-ASCII Step #3 - "compile-libfuzzer-coverage-x86_64": * segment boundaries as needed. The range must not cross the window end ??? callers Step #3 - "compile-libfuzzer-coverage-x86_64": ^ Step #3 - "compile-libfuzzer-coverage-x86_64": /src/junrar/src/main/java/com/github/junrar/unpack/Unpack5Window.java:158: error: unmappable character (0x94) for encoding US-ASCII Step #3 - "compile-libfuzzer-coverage-x86_64": * segment boundaries as needed. The range must not cross the window end ??? callers Step #3 - "compile-libfuzzer-coverage-x86_64": ^ Step #3 - "compile-libfuzzer-coverage-x86_64": /src/junrar/src/main/java/com/github/junrar/unpack/decode/Compress.java:74: error: unmappable character (0xE2) for encoding US-ASCII Step #3 - "compile-libfuzzer-coverage-x86_64": // Match-length ceilings (compress.hpp:10,17) ??? the write-out reserve margin the decode loop Step #3 - "compile-libfuzzer-coverage-x86_64": ^ Step #3 - "compile-libfuzzer-coverage-x86_64": /src/junrar/src/main/java/com/github/junrar/unpack/decode/Compress.java:74: error: unmappable character (0x80) for encoding US-ASCII Step #3 - "compile-libfuzzer-coverage-x86_64": // Match-length ceilings (compress.hpp:10,17) ??? the write-out reserve margin the decode loop Step #3 - "compile-libfuzzer-coverage-x86_64": ^ Step #3 - "compile-libfuzzer-coverage-x86_64": /src/junrar/src/main/java/com/github/junrar/unpack/decode/Compress.java:74: error: unmappable character (0x94) for encoding US-ASCII Step #3 - "compile-libfuzzer-coverage-x86_64": // Match-length ceilings (compress.hpp:10,17) ??? the write-out reserve margin the decode loop Step #3 - "compile-libfuzzer-coverage-x86_64": ^ Step #3 - "compile-libfuzzer-coverage-x86_64": /src/junrar/src/main/java/com/github/junrar/unpack/decode/Decode5.java:9: error: unmappable character (0xE2) for encoding US-ASCII Step #3 - "compile-libfuzzer-coverage-x86_64": * {@code 8f437ab:unpack.hpp} ??? the quick-decode accelerator ({@link #quickLen}/{@link #quickNum}) Step #3 - "compile-libfuzzer-coverage-x86_64": ^ Step #3 - "compile-libfuzzer-coverage-x86_64": /src/junrar/src/main/java/com/github/junrar/unpack/decode/Decode5.java:9: error: unmappable character (0x80) for encoding US-ASCII Step #3 - "compile-libfuzzer-coverage-x86_64": * {@code 8f437ab:unpack.hpp} ??? the quick-decode accelerator ({@link #quickLen}/{@link #quickNum}) Step #3 - "compile-libfuzzer-coverage-x86_64": ^ Step #3 - "compile-libfuzzer-coverage-x86_64": /src/junrar/src/main/java/com/github/junrar/unpack/decode/Decode5.java:9: error: unmappable character (0x94) for encoding US-ASCII Step #3 - "compile-libfuzzer-coverage-x86_64": * {@code 8f437ab:unpack.hpp} ??? the quick-decode accelerator ({@link #quickLen}/{@link #quickNum}) Step #3 - "compile-libfuzzer-coverage-x86_64": ^ Step #3 - "compile-libfuzzer-coverage-x86_64": /src/junrar/src/main/java/com/github/junrar/unpack/decode/Decode5.java:10: error: unmappable character (0xE2) for encoding US-ASCII Step #3 - "compile-libfuzzer-coverage-x86_64": * that the older RAR3 {@link Decode} lacks ??? so it is a sibling holder, not a subclass. Every Step #3 - "compile-libfuzzer-coverage-x86_64": ^ Step #3 - "compile-libfuzzer-coverage-x86_64": /src/junrar/src/main/java/com/github/junrar/unpack/decode/Decode5.java:10: error: unmappable character (0x80) for encoding US-ASCII Step #3 - "compile-libfuzzer-coverage-x86_64": * that the older RAR3 {@link Decode} lacks ??? so it is a sibling holder, not a subclass. Every Step #3 - "compile-libfuzzer-coverage-x86_64": ^ Step #3 - "compile-libfuzzer-coverage-x86_64": /src/junrar/src/main/java/com/github/junrar/unpack/decode/Decode5.java:10: error: unmappable character (0x94) for encoding US-ASCII Step #3 - "compile-libfuzzer-coverage-x86_64": * that the older RAR3 {@link Decode} lacks ??? so it is a sibling holder, not a subclass. Every Step #3 - "compile-libfuzzer-coverage-x86_64": ^ Step #3 - "compile-libfuzzer-coverage-x86_64": /src/junrar/src/main/java/com/github/junrar/unpack/Unpack5.java:17: error: unmappable character (0xE2) for encoding US-ASCII Step #3 - "compile-libfuzzer-coverage-x86_64": * RAR5 (unpack method 0x50) decode engine ??? skeleton (issue #27, M3.6). Built as a Step #3 - "compile-libfuzzer-coverage-x86_64": ^ Step #3 - "compile-libfuzzer-coverage-x86_64": /src/junrar/src/main/java/com/github/junrar/unpack/Unpack5.java:17: error: unmappable character (0x80) for encoding US-ASCII Step #3 - "compile-libfuzzer-coverage-x86_64": * RAR5 (unpack method 0x50) decode engine ??? skeleton (issue #27, M3.6). Built as a Step #3 - "compile-libfuzzer-coverage-x86_64": ^ Step #3 - "compile-libfuzzer-coverage-x86_64": /src/junrar/src/main/java/com/github/junrar/unpack/Unpack5.java:17: error: unmappable character (0x94) for encoding US-ASCII Step #3 - "compile-libfuzzer-coverage-x86_64": * RAR5 (unpack method 0x50) decode engine ??? skeleton (issue #27, M3.6). Built as a Step #3 - "compile-libfuzzer-coverage-x86_64": ^ Step #3 - "compile-libfuzzer-coverage-x86_64": /src/junrar/src/main/java/com/github/junrar/unpack/Unpack5.java:25: error: unmappable character (0xE2) for encoding US-ASCII Step #3 - "compile-libfuzzer-coverage-x86_64": *

Dictionary resource model (plan §6 R1, review B-S3 ??? three separated concepts). Step #3 - "compile-libfuzzer-coverage-x86_64": ^ Step #3 - "compile-libfuzzer-coverage-x86_64": /src/junrar/src/main/java/com/github/junrar/unpack/Unpack5.java:25: error: unmappable character (0x80) for encoding US-ASCII Step #3 - "compile-libfuzzer-coverage-x86_64": *

Dictionary resource model (plan §6 R1, review B-S3 ??? three separated concepts). Step #3 - "compile-libfuzzer-coverage-x86_64": ^ Step #3 - "compile-libfuzzer-coverage-x86_64": /src/junrar/src/main/java/com/github/junrar/unpack/Unpack5.java:25: error: unmappable character (0x94) for encoding US-ASCII Step #3 - "compile-libfuzzer-coverage-x86_64": *

Dictionary resource model (plan §6 R1, review B-S3 ??? three separated concepts). Step #3 - "compile-libfuzzer-coverage-x86_64": ^ Step #3 - "compile-libfuzzer-coverage-x86_64": /src/junrar/src/main/java/com/github/junrar/unpack/Unpack5.java:27: error: unmappable character (0xE2) for encoding US-ASCII Step #3 - "compile-libfuzzer-coverage-x86_64": *

  • Engine capability ceiling ??? what {@link Unpack5Window} can address: 64 GB since Step #3 - "compile-libfuzzer-coverage-x86_64": ^ Step #3 - "compile-libfuzzer-coverage-x86_64": /src/junrar/src/main/java/com/github/junrar/unpack/Unpack5.java:27: error: unmappable character (0x80) for encoding US-ASCII Step #3 - "compile-libfuzzer-coverage-x86_64": *
  • Engine capability ceiling ??? what {@link Unpack5Window} can address: 64 GB since Step #3 - "compile-libfuzzer-coverage-x86_64": ^ Step #3 - "compile-libfuzzer-coverage-x86_64": /src/junrar/src/main/java/com/github/junrar/unpack/Unpack5.java:27: error: unmappable character (0x94) for encoding US-ASCII Step #3 - "compile-libfuzzer-coverage-x86_64": *
  • Engine capability ceiling ??? what {@link Unpack5Window} can address: 64 GB since Step #3 - "compile-libfuzzer-coverage-x86_64": ^ Step #3 - "compile-libfuzzer-coverage-x86_64": /src/junrar/src/main/java/com/github/junrar/unpack/Unpack5.java:30: error: unmappable character (0xE2) for encoding US-ASCII Step #3 - "compile-libfuzzer-coverage-x86_64": *
  • Caller resource limit ??? {@code ArchiveOptions.maxDictionarySize} (P0.8; default Step #3 - "compile-libfuzzer-coverage-x86_64": ^ Step #3 - "compile-libfuzzer-coverage-x86_64": /src/junrar/src/main/java/com/github/junrar/unpack/Unpack5.java:30: error: unmappable character (0x80) for encoding US-ASCII Step #3 - "compile-libfuzzer-coverage-x86_64": *
  • Caller resource limit ??? {@code ArchiveOptions.maxDictionarySize} (P0.8; default Step #3 - "compile-libfuzzer-coverage-x86_64": ^ Step #3 - "compile-libfuzzer-coverage-x86_64": /src/junrar/src/main/java/com/github/junrar/unpack/Unpack5.java:30: error: unmappable character (0x94) for encoding US-ASCII Step #3 - "compile-libfuzzer-coverage-x86_64": *
  • Caller resource limit ??? {@code ArchiveOptions.maxDictionarySize} (P0.8; default Step #3 - "compile-libfuzzer-coverage-x86_64": ^ Step #3 - "compile-libfuzzer-coverage-x86_64": /src/junrar/src/main/java/com/github/junrar/unpack/Unpack5.java:34: error: unmappable character (0xE2) for encoding US-ASCII Step #3 - "compile-libfuzzer-coverage-x86_64": *
  • Allocation policy ??? growth-capped and lazily segmented, never header-eager (see Step #3 - "compile-libfuzzer-coverage-x86_64": ^ Step #3 - "compile-libfuzzer-coverage-x86_64": /src/junrar/src/main/java/com/github/junrar/unpack/Unpack5.java:34: error: unmappable character (0x80) for encoding US-ASCII Step #3 - "compile-libfuzzer-coverage-x86_64": *
  • Allocation policy ??? growth-capped and lazily segmented, never header-eager (see Step #3 - "compile-libfuzzer-coverage-x86_64": ^ Step #3 - "compile-libfuzzer-coverage-x86_64": /src/junrar/src/main/java/com/github/junrar/unpack/Unpack5.java:34: error: unmappable character (0x94) for encoding US-ASCII Step #3 - "compile-libfuzzer-coverage-x86_64": *
  • Allocation policy ??? growth-capped and lazily segmented, never header-eager (see Step #3 - "compile-libfuzzer-coverage-x86_64": ^ Step #3 - "compile-libfuzzer-coverage-x86_64": /src/junrar/src/main/java/com/github/junrar/unpack/Unpack5.java:123: error: unmappable character (0xC2) for encoding US-ASCII Step #3 - "compile-libfuzzer-coverage-x86_64": // (manual ??4.3). Grown on demand, bounded by MAX_FILTER_BLOCK_SIZE via the ReadFilter clamp. Step #3 - "compile-libfuzzer-coverage-x86_64": ^ Step #3 - "compile-libfuzzer-coverage-x86_64": /src/junrar/src/main/java/com/github/junrar/unpack/Unpack5.java:123: error: unmappable character (0xA7) for encoding US-ASCII Step #3 - "compile-libfuzzer-coverage-x86_64": // (manual ??4.3). Grown on demand, bounded by MAX_FILTER_BLOCK_SIZE via the ReadFilter clamp. Step #3 - "compile-libfuzzer-coverage-x86_64": ^ Step #3 - "compile-libfuzzer-coverage-x86_64": /src/junrar/src/main/java/com/github/junrar/unpack/Unpack5.java:152: error: unmappable character (0xE2) for encoding US-ASCII Step #3 - "compile-libfuzzer-coverage-x86_64": * {@code false} for version 50 ??? including a RAR7 header that {@code FCI_RAR5_COMPAT} demoted. Step #3 - "compile-libfuzzer-coverage-x86_64": ^ Step #3 - "compile-libfuzzer-coverage-x86_64": /src/junrar/src/main/java/com/github/junrar/unpack/Unpack5.java:152: error: unmappable character (0x80) for encoding US-ASCII Step #3 - "compile-libfuzzer-coverage-x86_64": * {@code false} for version 50 ??? including a RAR7 header that {@code FCI_RAR5_COMPAT} demoted. Step #3 - "compile-libfuzzer-coverage-x86_64": ^ Step #3 - "compile-libfuzzer-coverage-x86_64": /src/junrar/src/main/java/com/github/junrar/unpack/Unpack5.java:152: error: unmappable character (0x94) for encoding US-ASCII Step #3 - "compile-libfuzzer-coverage-x86_64": * {@code false} for version 50 ??? including a RAR7 header that {@code FCI_RAR5_COMPAT} demoted. Step #3 - "compile-libfuzzer-coverage-x86_64": ^ Step #3 - "compile-libfuzzer-coverage-x86_64": /src/junrar/src/main/java/com/github/junrar/unpack/Unpack5.java:186: error: unmappable character (0xE2) for encoding US-ASCII Step #3 - "compile-libfuzzer-coverage-x86_64": // Caller resource limit ??? BEFORE any window allocation (the -mdx / CheckWinLimit analog). Step #3 - "compile-libfuzzer-coverage-x86_64": ^ Step #3 - "compile-libfuzzer-coverage-x86_64": /src/junrar/src/main/java/com/github/junrar/unpack/Unpack5.java:186: error: unmappable character (0x80) for encoding US-ASCII Step #3 - "compile-libfuzzer-coverage-x86_64": // Caller resource limit ??? BEFORE any window allocation (the -mdx / CheckWinLimit analog). Step #3 - "compile-libfuzzer-coverage-x86_64": ^ Step #3 - "compile-libfuzzer-coverage-x86_64": /src/junrar/src/main/java/com/github/junrar/unpack/Unpack5.java:186: error: unmappable character (0x94) for encoding US-ASCII Step #3 - "compile-libfuzzer-coverage-x86_64": // Caller resource limit ??? BEFORE any window allocation (the -mdx / CheckWinLimit analog). Step #3 - "compile-libfuzzer-coverage-x86_64": ^ Step #3 - "compile-libfuzzer-coverage-x86_64": /src/junrar/src/main/java/com/github/junrar/unpack/Unpack5.java:247: error: unmappable character (0xE2) for encoding US-ASCII Step #3 - "compile-libfuzzer-coverage-x86_64": * (test) mode ??? {@link #feed} supplied everything ??? and on a spent stream ({@code readCode==-1}, Step #3 - "compile-libfuzzer-coverage-x86_64": ^ Step #3 - "compile-libfuzzer-coverage-x86_64": /src/junrar/src/main/java/com/github/junrar/unpack/Unpack5.java:247: error: unmappable character (0x80) for encoding US-ASCII Step #3 - "compile-libfuzzer-coverage-x86_64": * (test) mode ??? {@link #feed} supplied everything ??? and on a spent stream ({@code readCode==-1}, Step #3 - "compile-libfuzzer-coverage-x86_64": ^ Step #3 - "compile-libfuzzer-coverage-x86_64": /src/junrar/src/main/java/com/github/junrar/unpack/Unpack5.java:247: error: unmappable character (0x94) for encoding US-ASCII Step #3 - "compile-libfuzzer-coverage-x86_64": * (test) mode ??? {@link #feed} supplied everything ??? and on a spent stream ({@code readCode==-1}, Step #3 - "compile-libfuzzer-coverage-x86_64": ^ Step #3 - "compile-libfuzzer-coverage-x86_64": /src/junrar/src/main/java/com/github/junrar/unpack/Unpack5.java:247: error: unmappable character (0xE2) for encoding US-ASCII Step #3 - "compile-libfuzzer-coverage-x86_64": * (test) mode ??? {@link #feed} supplied everything ??? and on a spent stream ({@code readCode==-1}, Step #3 - "compile-libfuzzer-coverage-x86_64": ^ Step #3 - "compile-libfuzzer-coverage-x86_64": /src/junrar/src/main/java/com/github/junrar/unpack/Unpack5.java:247: error: unmappable character (0x80) for encoding US-ASCII Step #3 - "compile-libfuzzer-coverage-x86_64": * (test) mode ??? {@link #feed} supplied everything ??? and on a spent stream ({@code readCode==-1}, Step #3 - "compile-libfuzzer-coverage-x86_64": ^ Step #3 - "compile-libfuzzer-coverage-x86_64": /src/junrar/src/main/java/com/github/junrar/unpack/Unpack5.java:247: error: unmappable character (0x94) for encoding US-ASCII Step #3 - "compile-libfuzzer-coverage-x86_64": * (test) mode ??? {@link #feed} supplied everything ??? and on a spent stream ({@code readCode==-1}, Step #3 - "compile-libfuzzer-coverage-x86_64": ^ Step #3 - "compile-libfuzzer-coverage-x86_64": /src/junrar/src/main/java/com/github/junrar/unpack/Unpack5.java:605: error: unmappable character (0xE2) for encoding US-ASCII Step #3 - "compile-libfuzzer-coverage-x86_64": // (8f437ab:unpack.cpp UnpInitData ??? InitFilters() runs even for solid continuations). Step #3 - "compile-libfuzzer-coverage-x86_64": ^ Step #3 - "compile-libfuzzer-coverage-x86_64": /src/junrar/src/main/java/com/github/junrar/unpack/Unpack5.java:605: error: unmappable character (0x80) for encoding US-ASCII Step #3 - "compile-libfuzzer-coverage-x86_64": // (8f437ab:unpack.cpp UnpInitData ??? InitFilters() runs even for solid continuations). Step #3 - "compile-libfuzzer-coverage-x86_64": ^ Step #3 - "compile-libfuzzer-coverage-x86_64": /src/junrar/src/main/java/com/github/junrar/unpack/Unpack5.java:605: error: unmappable character (0x94) for encoding US-ASCII Step #3 - "compile-libfuzzer-coverage-x86_64": // (8f437ab:unpack.cpp UnpInitData ??? InitFilters() runs even for solid continuations). Step #3 - "compile-libfuzzer-coverage-x86_64": ^ Step #3 - "compile-libfuzzer-coverage-x86_64": /src/junrar/src/main/java/com/github/junrar/unpack/Unpack5.java:628: error: unmappable character (0xE2) for encoding US-ASCII Step #3 - "compile-libfuzzer-coverage-x86_64": * are not powers of two and a {@code size - 1} mask wraps at the wrong position ??? it Step #3 - "compile-libfuzzer-coverage-x86_64": ^ Step #3 - "compile-libfuzzer-coverage-x86_64": /src/junrar/src/main/java/com/github/junrar/unpack/Unpack5.java:628: error: unmappable character (0x80) for encoding US-ASCII Step #3 - "compile-libfuzzer-coverage-x86_64": * are not powers of two and a {@code size - 1} mask wraps at the wrong position ??? it Step #3 - "compile-libfuzzer-coverage-x86_64": ^ Step #3 - "compile-libfuzzer-coverage-x86_64": /src/junrar/src/main/java/com/github/junrar/unpack/Unpack5.java:628: error: unmappable character (0x94) for encoding US-ASCII Step #3 - "compile-libfuzzer-coverage-x86_64": * are not powers of two and a {@code size - 1} mask wraps at the wrong position ??? it Step #3 - "compile-libfuzzer-coverage-x86_64": ^ Step #3 - "compile-libfuzzer-coverage-x86_64": /src/junrar/src/main/java/com/github/junrar/unpack/Unpack5.java:825: error: unmappable character (0xE2) for encoding US-ASCII Step #3 - "compile-libfuzzer-coverage-x86_64": * upstream's fast/slow paths bit-for-bit (both copy byte-by-byte forward, overlap-safe ??? the Step #3 - "compile-libfuzzer-coverage-x86_64": ^ Step #3 - "compile-libfuzzer-coverage-x86_64": /src/junrar/src/main/java/com/github/junrar/unpack/Unpack5.java:825: error: unmappable character (0x80) for encoding US-ASCII Step #3 - "compile-libfuzzer-coverage-x86_64": * upstream's fast/slow paths bit-for-bit (both copy byte-by-byte forward, overlap-safe ??? the Step #3 - "compile-libfuzzer-coverage-x86_64": ^ Step #3 - "compile-libfuzzer-coverage-x86_64": /src/junrar/src/main/java/com/github/junrar/unpack/Unpack5.java:825: error: unmappable character (0x94) for encoding US-ASCII Step #3 - "compile-libfuzzer-coverage-x86_64": * upstream's fast/slow paths bit-for-bit (both copy byte-by-byte forward, overlap-safe ??? the Step #3 - "compile-libfuzzer-coverage-x86_64": ^ Step #3 - "compile-libfuzzer-coverage-x86_64": /src/junrar/src/main/java/com/github/junrar/unpack/Unpack5.java:871: error: unmappable character (0xE2) for encoding US-ASCII Step #3 - "compile-libfuzzer-coverage-x86_64": * relative block start, block length, 3-bit type, and ??? for DELTA ??? the 5-bit channel count. Step #3 - "compile-libfuzzer-coverage-x86_64": ^ Step #3 - "compile-libfuzzer-coverage-x86_64": /src/junrar/src/main/java/com/github/junrar/unpack/Unpack5.java:871: error: unmappable character (0x80) for encoding US-ASCII Step #3 - "compile-libfuzzer-coverage-x86_64": * relative block start, block length, 3-bit type, and ??? for DELTA ??? the 5-bit channel count. Step #3 - "compile-libfuzzer-coverage-x86_64": ^ Step #3 - "compile-libfuzzer-coverage-x86_64": /src/junrar/src/main/java/com/github/junrar/unpack/Unpack5.java:871: error: unmappable character (0x94) for encoding US-ASCII Step #3 - "compile-libfuzzer-coverage-x86_64": * relative block start, block length, 3-bit type, and ??? for DELTA ??? the 5-bit channel count. Step #3 - "compile-libfuzzer-coverage-x86_64": ^ Step #3 - "compile-libfuzzer-coverage-x86_64": /src/junrar/src/main/java/com/github/junrar/unpack/Unpack5.java:871: error: unmappable character (0xE2) for encoding US-ASCII Step #3 - "compile-libfuzzer-coverage-x86_64": * relative block start, block length, 3-bit type, and ??? for DELTA ??? the 5-bit channel count. Step #3 - "compile-libfuzzer-coverage-x86_64": ^ Step #3 - "compile-libfuzzer-coverage-x86_64": /src/junrar/src/main/java/com/github/junrar/unpack/Unpack5.java:871: error: unmappable character (0x80) for encoding US-ASCII Step #3 - "compile-libfuzzer-coverage-x86_64": * relative block start, block length, 3-bit type, and ??? for DELTA ??? the 5-bit channel count. Step #3 - "compile-libfuzzer-coverage-x86_64": ^ Step #3 - "compile-libfuzzer-coverage-x86_64": /src/junrar/src/main/java/com/github/junrar/unpack/Unpack5.java:871: error: unmappable character (0x94) for encoding US-ASCII Step #3 - "compile-libfuzzer-coverage-x86_64": * relative block start, block length, 3-bit type, and ??? for DELTA ??? the 5-bit channel count. Step #3 - "compile-libfuzzer-coverage-x86_64": ^ Step #3 - "compile-libfuzzer-coverage-x86_64": /src/junrar/src/main/java/com/github/junrar/unpack/Unpack5.java:899: error: unmappable character (0xE2) for encoding US-ASCII Step #3 - "compile-libfuzzer-coverage-x86_64": * if still over the cap, drops the whole queue ({@link #initFilters()}) ??? a no-op, never an Step #3 - "compile-libfuzzer-coverage-x86_64": ^ Step #3 - "compile-libfuzzer-coverage-x86_64": /src/junrar/src/main/java/com/github/junrar/unpack/Unpack5.java:899: error: unmappable character (0x80) for encoding US-ASCII Step #3 - "compile-libfuzzer-coverage-x86_64": * if still over the cap, drops the whole queue ({@link #initFilters()}) ??? a no-op, never an Step #3 - "compile-libfuzzer-coverage-x86_64": ^ Step #3 - "compile-libfuzzer-coverage-x86_64": /src/junrar/src/main/java/com/github/junrar/unpack/Unpack5.java:899: error: unmappable character (0x94) for encoding US-ASCII Step #3 - "compile-libfuzzer-coverage-x86_64": * if still over the cap, drops the whole queue ({@link #initFilters()}) ??? a no-op, never an Step #3 - "compile-libfuzzer-coverage-x86_64": ^ Step #3 - "compile-libfuzzer-coverage-x86_64": /src/junrar/src/main/java/com/github/junrar/unpack/Unpack5.java:928: error: unmappable character (0xE2) for encoding US-ASCII Step #3 - "compile-libfuzzer-coverage-x86_64": * d861246:unpack50.cpp:427-485 is the authoritative 4-type census ??? DELTA/E8/E8E9/ARM only). Step #3 - "compile-libfuzzer-coverage-x86_64": ^ Step #3 - "compile-libfuzzer-coverage-x86_64": /src/junrar/src/main/java/com/github/junrar/unpack/Unpack5.java:928: error: unmappable character (0x80) for encoding US-ASCII Step #3 - "compile-libfuzzer-coverage-x86_64": * d861246:unpack50.cpp:427-485 is the authoritative 4-type census ??? DELTA/E8/E8E9/ARM only). Step #3 - "compile-libfuzzer-coverage-x86_64": ^ Step #3 - "compile-libfuzzer-coverage-x86_64": /src/junrar/src/main/java/com/github/junrar/unpack/Unpack5.java:928: error: unmappable character (0x94) for encoding US-ASCII Step #3 - "compile-libfuzzer-coverage-x86_64": * d861246:unpack50.cpp:427-485 is the authoritative 4-type census ??? DELTA/E8/E8E9/ARM only). Step #3 - "compile-libfuzzer-coverage-x86_64": ^ Step #3 - "compile-libfuzzer-coverage-x86_64": /src/junrar/src/main/java/com/github/junrar/unpack/Unpack5.java:1029: error: unmappable character (0xE2) for encoding US-ASCII Step #3 - "compile-libfuzzer-coverage-x86_64": * filtered output is written INSTEAD of them (the window itself is never modified ??? its bytes Step #3 - "compile-libfuzzer-coverage-x86_64": ^ Step #3 - "compile-libfuzzer-coverage-x86_64": /src/junrar/src/main/java/com/github/junrar/unpack/Unpack5.java:1029: error: unmappable character (0x80) for encoding US-ASCII Step #3 - "compile-libfuzzer-coverage-x86_64": * filtered output is written INSTEAD of them (the window itself is never modified ??? its bytes Step #3 - "compile-libfuzzer-coverage-x86_64": ^ Step #3 - "compile-libfuzzer-coverage-x86_64": /src/junrar/src/main/java/com/github/junrar/unpack/Unpack5.java:1029: error: unmappable character (0x94) for encoding US-ASCII Step #3 - "compile-libfuzzer-coverage-x86_64": * filtered output is written INSTEAD of them (the window itself is never modified ??? its bytes Step #3 - "compile-libfuzzer-coverage-x86_64": ^ Step #3 - "compile-libfuzzer-coverage-x86_64": /src/junrar/src/main/java/com/github/junrar/unpack/Unpack5.java:1069: error: unmappable character (0xC2) for encoding US-ASCII Step #3 - "compile-libfuzzer-coverage-x86_64": // Real copy-out, wrap split into two copies (manual ??4.3): the window Step #3 - "compile-libfuzzer-coverage-x86_64": ^ Step #3 - "compile-libfuzzer-coverage-x86_64": /src/junrar/src/main/java/com/github/junrar/unpack/Unpack5.java:1069: error: unmappable character (0xA7) for encoding US-ASCII Step #3 - "compile-libfuzzer-coverage-x86_64": // Real copy-out, wrap split into two copies (manual ??4.3): the window Step #3 - "compile-libfuzzer-coverage-x86_64": ^ Step #3 - "compile-libfuzzer-coverage-x86_64": /src/junrar/src/main/java/com/github/junrar/unpack/Unpack.java:119: error: unmappable character (0xC2) for encoding US-ASCII Step #3 - "compile-libfuzzer-coverage-x86_64": // (reports/unrar-delta-map.md ??3) Step #3 - "compile-libfuzzer-coverage-x86_64": ^ Step #3 - "compile-libfuzzer-coverage-x86_64": /src/junrar/src/main/java/com/github/junrar/unpack/Unpack.java:119: error: unmappable character (0xA7) for encoding US-ASCII Step #3 - "compile-libfuzzer-coverage-x86_64": // (reports/unrar-delta-map.md ??3) Step #3 - "compile-libfuzzer-coverage-x86_64": ^ Step #3 - "compile-libfuzzer-coverage-x86_64": /src/junrar/src/main/java/com/github/junrar/unpack/ComprDataIO.java:219: error: unmappable character (0xE2) for encoding US-ASCII Step #3 - "compile-libfuzzer-coverage-x86_64": * (never by constructing names here ??? manual ??4.12), re-parse it, and continue the entry Step #3 - "compile-libfuzzer-coverage-x86_64": ^ Step #3 - "compile-libfuzzer-coverage-x86_64": /src/junrar/src/main/java/com/github/junrar/unpack/ComprDataIO.java:219: error: unmappable character (0x80) for encoding US-ASCII Step #3 - "compile-libfuzzer-coverage-x86_64": * (never by constructing names here ??? manual ??4.12), re-parse it, and continue the entry Step #3 - "compile-libfuzzer-coverage-x86_64": ^ Step #3 - "compile-libfuzzer-coverage-x86_64": /src/junrar/src/main/java/com/github/junrar/unpack/ComprDataIO.java:219: error: unmappable character (0x94) for encoding US-ASCII Step #3 - "compile-libfuzzer-coverage-x86_64": * (never by constructing names here ??? manual ??4.12), re-parse it, and continue the entry Step #3 - "compile-libfuzzer-coverage-x86_64": ^ Step #3 - "compile-libfuzzer-coverage-x86_64": /src/junrar/src/main/java/com/github/junrar/unpack/ComprDataIO.java:219: error: unmappable character (0xC2) for encoding US-ASCII Step #3 - "compile-libfuzzer-coverage-x86_64": * (never by constructing names here ??? manual ??4.12), re-parse it, and continue the entry Step #3 - "compile-libfuzzer-coverage-x86_64": ^ Step #3 - "compile-libfuzzer-coverage-x86_64": /src/junrar/src/main/java/com/github/junrar/unpack/ComprDataIO.java:219: error: unmappable character (0xA7) for encoding US-ASCII Step #3 - "compile-libfuzzer-coverage-x86_64": * (never by constructing names here ??? manual ??4.12), re-parse it, and continue the entry Step #3 - "compile-libfuzzer-coverage-x86_64": ^ Step #3 - "compile-libfuzzer-coverage-x86_64": /src/junrar/src/main/java/com/github/junrar/unpack/ComprDataIO.java:222: error: unmappable character (0xE2) for encoding US-ASCII Step #3 - "compile-libfuzzer-coverage-x86_64": * the unpacked-side accumulators survive ??? the final part stores the end-to-end unpacked Step #3 - "compile-libfuzzer-coverage-x86_64": ^ Step #3 - "compile-libfuzzer-coverage-x86_64": /src/junrar/src/main/java/com/github/junrar/unpack/ComprDataIO.java:222: error: unmappable character (0x80) for encoding US-ASCII Step #3 - "compile-libfuzzer-coverage-x86_64": * the unpacked-side accumulators survive ??? the final part stores the end-to-end unpacked Step #3 - "compile-libfuzzer-coverage-x86_64": ^ Step #3 - "compile-libfuzzer-coverage-x86_64": /src/junrar/src/main/java/com/github/junrar/unpack/ComprDataIO.java:222: error: unmappable character (0x94) for encoding US-ASCII Step #3 - "compile-libfuzzer-coverage-x86_64": * the unpacked-side accumulators survive ??? the final part stores the end-to-end unpacked Step #3 - "compile-libfuzzer-coverage-x86_64": ^ Step #3 - "compile-libfuzzer-coverage-x86_64": /src/junrar/src/main/java/com/github/junrar/unpack/ComprDataIO.java:258: error: unmappable character (0xE2) for encoding US-ASCII Step #3 - "compile-libfuzzer-coverage-x86_64": * decrypting {@link RawDataIo} seam, while unrar hashes the raw pre-decryption stream ??? Step #3 - "compile-libfuzzer-coverage-x86_64": ^ Step #3 - "compile-libfuzzer-coverage-x86_64": /src/junrar/src/main/java/com/github/junrar/unpack/ComprDataIO.java:258: error: unmappable character (0x80) for encoding US-ASCII Step #3 - "compile-libfuzzer-coverage-x86_64": * decrypting {@link RawDataIo} seam, while unrar hashes the raw pre-decryption stream ??? Step #3 - "compile-libfuzzer-coverage-x86_64": ^ Step #3 - "compile-libfuzzer-coverage-x86_64": /src/junrar/src/main/java/com/github/junrar/unpack/ComprDataIO.java:258: error: unmappable character (0x94) for encoding US-ASCII Step #3 - "compile-libfuzzer-coverage-x86_64": * decrypting {@link RawDataIo} seam, while unrar hashes the raw pre-decryption stream ??? Step #3 - "compile-libfuzzer-coverage-x86_64": ^ Step #3 - "compile-libfuzzer-coverage-x86_64": /src/junrar/src/main/java/com/github/junrar/unpack/ComprDataIO.java:583: error: unmappable character (0xE2) for encoding US-ASCII Step #3 - "compile-libfuzzer-coverage-x86_64": * {@link DataHash} seam ??? converted to MAC space ({@code ConvertHashToMAC}) when the Step #3 - "compile-libfuzzer-coverage-x86_64": ^ Step #3 - "compile-libfuzzer-coverage-x86_64": /src/junrar/src/main/java/com/github/junrar/unpack/ComprDataIO.java:583: error: unmappable character (0x80) for encoding US-ASCII Step #3 - "compile-libfuzzer-coverage-x86_64": * {@link DataHash} seam ??? converted to MAC space ({@code ConvertHashToMAC}) when the Step #3 - "compile-libfuzzer-coverage-x86_64": ^ Step #3 - "compile-libfuzzer-coverage-x86_64": 100 errors Step #3 - "compile-libfuzzer-coverage-x86_64": Step #3 - "compile-libfuzzer-coverage-x86_64": [Incubating] Problems report is available at: file:///src/junrar/build/reports/problems/problems-report.html Step #3 - "compile-libfuzzer-coverage-x86_64": Step #3 - "compile-libfuzzer-coverage-x86_64": FAILURE: Build failed with an exception. Step #3 - "compile-libfuzzer-coverage-x86_64": Step #3 - "compile-libfuzzer-coverage-x86_64": * What went wrong: Step #3 - "compile-libfuzzer-coverage-x86_64": Execution failed for task ':javadoc' (registered by plugin class 'org.gradle.api.plugins.JavaPlugin'). Step #3 - "compile-libfuzzer-coverage-x86_64": > Javadoc generation failed. Generated Javadoc options file (useful for troubleshooting): '/src/junrar/build/tmp/javadoc/javadoc.options' Step #3 - "compile-libfuzzer-coverage-x86_64": Step #3 - "compile-libfuzzer-coverage-x86_64": * Try: Step #3 - "compile-libfuzzer-coverage-x86_64": > Run with --stacktrace option to get the stack trace. Step #3 - "compile-libfuzzer-coverage-x86_64": > Run with --info or --debug option to get more log output. Step #3 - "compile-libfuzzer-coverage-x86_64": > Run with --scan to get full insights from a Build Scan (powered by Develocity). Step #3 - "compile-libfuzzer-coverage-x86_64": > Get more help at https://help.gradle.org. Step #3 - "compile-libfuzzer-coverage-x86_64": Step #3 - "compile-libfuzzer-coverage-x86_64": Deprecated Gradle features were used in this build, making it incompatible with Gradle 10. Step #3 - "compile-libfuzzer-coverage-x86_64": Step #3 - "compile-libfuzzer-coverage-x86_64": You can use '--warning-mode all' to show the individual deprecation warnings and determine if they come from your own scripts or plugins. Step #3 - "compile-libfuzzer-coverage-x86_64": Step #3 - "compile-libfuzzer-coverage-x86_64": For more on this, please refer to https://docs.gradle.org/9.6.1/userguide/command_line_interface.html#sec:command_line_warnings in the Gradle documentation. Step #3 - "compile-libfuzzer-coverage-x86_64": Step #3 - "compile-libfuzzer-coverage-x86_64": BUILD FAILED in 44s Step #3 - "compile-libfuzzer-coverage-x86_64": 3 actionable tasks: 3 executed Step #3 - "compile-libfuzzer-coverage-x86_64":  Step #3 - "compile-libfuzzer-coverage-x86_64":  Step #3 - "compile-libfuzzer-coverage-x86_64":  Step #3 - "compile-libfuzzer-coverage-x86_64":  Step #3 - "compile-libfuzzer-coverage-x86_64":  Step #3 - "compile-libfuzzer-coverage-x86_64": โ”‚โ–ˆโ–ˆโ–ˆโ–‰ยทยทยทยทยทยทยทยทยทยทยทโ”‚ 26% EXECUTING [36s]> IDLE> IDLE> IDLE> IDLEโ”‚ยทยทยทยทยทยทยทยทยทยทยทยทยทยทยทโ”‚ 0% WAITING[?12l[?25h********************************************************************************\nFailed to build.\nTo reproduce, run:\npython infra/helper.py build_image junrar\npython infra/helper.py build_fuzzers --sanitizer coverage --engine libfuzzer --architecture x86_64 junrar\n******************************************************************************** Finished Step #3 - "compile-libfuzzer-coverage-x86_64" ERROR ERROR: build step 3 "gcr.io/cloud-builders/docker" failed: step exited with non-zero status: 1